##TITLE=Casca de Arroz 1 $$ Begin of the data block
##JCAMP-DX=5.00 $$ ACD/SpecManager v 10.08
##SPECTROMETER/DATA SYSTEM=Alpha
##DATE=21 May 2015 14:09:38
##DATA TYPE=INFRARED SPECTRUM
##DATA CLASS=XYDATA
##ORIGIN=
##OWNER=
##NPOINTS=1765
##FIRSTX=399.76428223
##LASTX=3997.64306641
##MAXX=3997.64306641
##MINX=399.76428223
##MAXY=0.83258593
##MINY=0.56975436
##XFACTOR=1.0000000000
##YFACTOR=1.000000000000000e-9
##FIRSTY=0.74513334
##DELTAX=2.03961372
##XUNITS=1/CM
##YUNITS=ARBITRARY UNITS
##XYDATA=(X++(Y..Y))
399.8 745133340 743153095 741647482 740052342 739384413 739222169 737736404 735602438 735755920 737403095
418.1 737403095 735806763 732011080 729879677 729026616 727597833 725563586 724301755 723920107 722828507
436.5 722828507 720991671 720249832 720344901 719271421 717217565 715995073 715881169 715329468 714171350
454.8 714171350 713694394 713488579 712482393 711065233 710476041 711025655 711679459 712148428 713024199
473.2 713024199 714391768 715737760 716907203 718699992 721416831 723795891 725351810 727397859
489.5 727397859 730297744 732680500 734073341 735559285 737597048 739207268 739731312 740096509 740854621
507.9 740854621 741278827 741012454 740813076 741224706 741446376 740876377 740297318 740432978 740675449 740272641
528.3 740272641 739718378 739647269 739924490 739971876 739572942 739107668 739003539 739035785 738589644 737816095
548.7 737816095 737350464 737113595 736548722 735741079 735362947 735582650 735723794 735462546 735409439 735855997
569.1 735855997 736118972 735983551 736293077 737209141 737793982 737750053 738029361 739045858 739844680 739928007
589.4 739928007 740107536 740931392 741710484 741902173 742223918 743283987 744201541 744214594 744273365 745329738
609.8 745329738 746512353 746739030 746746123 747805178 749408782 750369191 751199424 752879143 754711628
628.2 754711628 755561531 756004930 757239878 758787870 759396076 759494543 760422528 761861384 762458146
646.6 762458146 762383580 763039351 764330745 764823794 764492393 764701486 765596867 766067743 765875936 765416563
667 765416563 765814483 767254353 768393159 769583941 771437287 773150325 774119794 775068760 776432216
685.3 776432216 777464211 777716756 777973592 778808832 779618979 779799998 779778719 780299067 781155646 781559885
705.7 781559885 781625211 782079458 782925904 783498526 783624947 783859491 784499228 785180271 785572708 785990417
726.1 785990417 786779284 787609100 788030028 788265288 788815737 789521754 789765179 789628685 789914072 790701807
746.5 790701807 791139722 791024089 791205704 791935086 792339563 791993678 791722417 792204261 792664707 792219937
766.9 792219937 791504502 791418254 791311026 790169120 788717031 788287103 788441658 787911594 787061214 787157595
787.3 787157595 787835300 787676156 786884010 786948264 787853718 788072228 787471831 787621498 788781106 789353073
807.7 789353073 788969755 789224207 790585697 791519880 791400552 791693628 793174386 794363141 794260502
826 794260502 794227123 795385778 796552002 796668947 796980739 798736036 800739765 801408172 801565707 802694917
846.4 802694917 803997219 803916633 803145051 803347826 804061174 803648293 802468121 802237391 802798927 802415133
866.8 802415133 801109314 800603390 800956249 800493300 798992932 798009574 797868550 797069669 795139611
885.2 795139611 793441534 792625785 791596830 789784312 788422465 788378775 788628101 788197994 787818968
903.5 787818968 788294137 788772583 788186729 787157357 786788285 786640525 785672784 784253120 783432424
921.9 783432424 783016801 782020032 780524433 779531956 779081941 778193951 776714087 775533020 774895370
940.3 774895370 773962915 772362530 770831347 769822001 768697262 766960859 765187502 763963461 762853742
958.6 762853742 761249602 759489059 758196950 757101953 755546153 753657758 752019167 750533104
974.9 750533104 748566747 746073425 743665993 741569519 739346147 736850560 734627128 732990324
991.3 732990324 731457233 729581773 727661729 726043522 724380374 722220898 719784617 717515528
1007.6 717515528 715281546 712637305 709674597 706929564 704522491 702052116 699410617 697063565
1023.9 697063565 695212483 693403959 691385865 689600527 688407362 687480867 686392844 685280025
1040.2 685280025 684409678 683542848 682335019 681011796 680044770 679354429 678510308 677565575 676995158
1058.6 676995158 676851034 676675618 676318467 676067412 675908387 675425529 674533308 673695326 673283219 673118472
1079 673118472 672879755 672705531 672875285 673142493 673119724 672983587 673115790 673395455 673434377 673313916
1099.4 673313916 673481286 674021423 674599767 675179958 676184773 677735269 679424167 681040287 682824194
1117.7 682824194 684850872 686773062 688395083 690055847 692120194 694445491 696659863 698759973
1134 698759973 700930893 702893138 704204321 704980552 705614448 706093848 706155300 705896080 705723047 705737829
1154.4 705737829 705689251 705574870 705758333 706398189 707251847 708209932 709542215 711403012 713503838
1172.8 713503838 715545714 717626691 719883323 722068250 723883867 725449502 727017760 728444159
1189.1 728444159 729412794 729988098 730467081 730862319 730978489 730934978 731089294 731490076 731894433 732222140
1209.5 732222140 732603014 733049512 733376503 733477116 733506441 733625054 733717740 733634710 733503997 733533919
1229.9 733533919 733693838 733852506 734083056 734534144 735146821 735747159 736305475 736965477 737805426 738677382
1250.3 738677382 739454806 740225255 741065323 741866231 742488503 743044734 743781745 744693935 745606720 746497571
1270.7 746497571 747502983 748691261 749937057 751098156 752240062 753511906 754862547 756094933
1287 756094933 757171631 758219779 759209812 759948790 760422766 760802209 761076212 761077702 760866344 760671496
1307.4 760671496 760525167 760237694 759767056 759478331 759551764 759596765 759481311 759550512 759897590 760217428
1327.8 760217428 760317743 760477364 761077821 762005031 762710333 762888491 762970984 763347030 763724625 763935566
1348.2 763935566 764169216 764395535 764349222 764087081 764152110 764529049 764145911 762797058 761748254 761254907
1368.6 761254907 761004508 760950089 760635734 760114491 759698868 759105027 758894265 760334730 762763560
1386.9 762763560 764353096 765620768 767438948 768817425 769121945 768761992 768436790 768663526 768618286
1405.3 768618286 768037856 767697036 767489910 767257392 767674804 768456519 767700851 766023099 765053630
1423.7 765053630 764687121 765052259 765541613 765819371 767070770 768574953 768230975 767340600 767280579
1442 767280579 767746985 768269539 767982185 767188489 767528474 769646287 771463931 769675553 767387450
1460.4 767387450 767432630 768217385 768499374 770143867 774031699 777838886 779403567 780049205 781037211
1478.7 781037211 782280505 783473134 785058081 787181437 788140476 786648691 785162091 785104692 784370542
1497.1 784370542 781851828 779880881 780573249 782918334 781733036 777480900 775037467 774844944 776381552
1515.4 776381552 778810859 781958997 785027564 786686599 787721753 788460612 789655328 791790068
1531.8 791790068 793102622 794180751 797493398 800644577 799406648 796700060 794981301 794689298
1548.1 794689298 795161366 795964897 797852516 801527798 803949237 799819767 795862854 794927716 795045197
1566.4 795045197 794876814 793155551 791727841 791373312 788816988 784657240 781684220 779156387 776396692
1584.8 776396692 773682237 771271825 768997908 766593635 763903797 761101186 758366466 755447567
1601.1 755447567 752335846 749682367 747699976 745699644 743649244 742561698 741595626 738362193
1617.4 738362193 735144258 733764708 732087612 729568005 727005124 724785924 724707246 727065504 728548646
1635.8 728548646 727708042 727716744 729623616 733132243 736927569 739286721 742251754 746393561 746972322
1654.1 746972322 745883346 747293591 750398874 753441036 755710304 758750677 762529671 764921844
1670.5 764921844 766606927 768569469 769710958 771068394 774301827 778411448 779400349 777876437
1686.8 777876437 777738750 778774261 780991793 783867061 786170542 787743270 787210524 786147892 786053002
1705.1 786053002 785570443 785118639 785702467 787485480 789706647 789735675 787202120 785522103 785231411
1723.5 785231411 785429895 786132336 787581682 789756060 790688038 789535105 789569736 790746093 791793942
1741.9 791793942 793158889 795233190 797809422 799750268 800441444 801490188 803508937 805765986
1758.2 805765986 808061719 809807003 811151266 813309729 816191971 818956077 820179403 819791853
1774.5 819791853 819839954 820758700 821720898 822401524 822923243 823476732 824802697 826620758 827149332
1792.8 827149332 826622486 826799750 827572703 827866435 827570140 827484846 827940106 828583241 828818202 828668058
1813.2 828668058 828702033 828900874 829102218 829642355 830511689 831125975 831632257 831860900 831160009 830459714
1833.6 830459714 830380559 830516398 830960393 831994176 832585931 831911743 831109643 830664635 830409765 830379009
1854 830379009 830478251 830506742 830420315 830481648 831067860 832092643 832457900 831595838 830721617 830419838
1874.4 830419838 830273211 830235839 830398202 830559313 830607235 830864668 831270516 831222415 830918372 830808342
1894.8 830808342 830836594 830898523 830892444 830873072 831084013 831436217 831471920 831169307 831170380 831755638 832161605
1917.3 832161605 831908703 831714630 831669152 831334829 830980003 830920935 831053019 831033230 830777347 830693364
1937.7 830693364 831072807 831375301 830996633 830460668 830298305 830245674 830049396 829868376 829858720 829837799
1958.1 829837799 829619467 829427660 829594076 829832554 829620123 829193056 829047799 829073787 828940749 828694522
1978.5 828694522 828614891 828696728 828682065 828572571 828644276 828832090 828663468 828195989 827943206 827953815
1998.8 827953815 827915728 827729344 827593625 827589869 827526629 827316284 827183127 827257812 827227890 826838970 826329648
2021.3 826329648 825875282 825516880 825501800 825785220 826064527 826231599 826246142 826178253 826181650 826214552 826143861
2043.7 826143861 826014698 825975895 826059163 826129079 826102316 826085627 826149344 826197803 826192558 826198816 826233149 826278389
2068.2 826278389 826304972 826319933 826372564 826435149 826453626 826455235 826494932 826573133 826641619 826651096 826625586 826632500
2092.7 826632500 826668382 826675415 826648653 826649785 826686919 826679289 826614022 826581895 826606691 826611340 826574206 826560855
2117.1 826560855 826589048 826613426 826605082 826592267 826627254 826687694 826690555 826663375 826712787 826803744 826840520 826842427
2141.6 826842427 826890349 826982856 827035785 827063203 827164233 827312648 827393055 827417076 827499151 827640414 827710867
2164.1 827710867 827672958 827654719 827798188 828044772 828200221 828287303 828443050 828606427 828664958 828698456
2184.5 828698456 828842819 829030156 829114556 829137027 829221725 829335392 829354823 829314828 829376340 829519570 829558134
2206.9 829558134 829481125 829465568 829541445 829562724 829493940 829478443 829585671 829648435 829563379 829492927 829544544
2229.3 829544544 829582036 829513788 829477549 829563141 829631925 829559743 829460263 829484880 829546988 829497337 829422891
2251.8 829422891 829468071 829543531 829513431 829442561 829468250 829552233 829525530 829395056 829365134 829470575 829509556
2274.2 829509556 829426169 829403281 829501569 829540253 829439700 829343319 829334676 829288006 829110503 828944504 828893840
2296.6 828893840 828800797 828564525 828357875 828282833 828181803 827917933 827578008 827339470 827195406 826925755
2317 826925755 826447725 825968266 825618267 825313568 824990094 824643493 824271619 823895097 823518097 823189735
2337.4 823189735 822905242 822526455 822109401 822293043 823511958 824777603 824884772 823803008 822538078
2355.8 822538078 821588039 820957720 820732474 820852876 821058095 821307838 821786761 822480321 823158979 823756337
2376.2 823756337 824434698 825247467 825970531 826398790 826620221 826809168 826918721 826831758 826658607 826582253
2396.6 826582253 826569319 826457322 826260209 826152682 826130509 826007366 825782120 825656295 825646162 825543463
2417 825543463 825300753 825121462 825085521 824998319 824776292 824609756 824590266 824555993 824378490 824176073 824105382
2439.4 824105382 824068606 823902309 823699117 823619962 823578119 823405802 823184252 823087752 823043108 822886944
2459.8 822886944 822685480 822600484 822581708 822460115 822249115 822115541 822084427 821995378 821816802 821693480
2480.2 821693480 821658969 821579218 821383774 821188569 821091473 821013391 820858777 820698798 820632994 820560992 820366502
2502.6 820366502 820172310 820100248 820042551 819885850 819712758 819655359 819645643 819529235 819350302 819264770 819255054
2525.1 819255054 819162667 818987131 818880498 818849623 818752527 818580449 818458855 818405092 818306267 818144083
2545.5 818144083 818047941 818052888 818017185 817871392 817717969 817634344 817564011 817430496 817295790 817260802 817241013
2567.9 817241013 817122161 816978455 816904962 816853821 816734910 816558123 816421211 816340506 816217601 816043079
2588.3 816043079 815921068 815846145 815707564 815499902 815333426 815244973 815131724 814941227 814767778 814666092
2608.7 814666092 814549148 814345419 814138174 814011455 813879609 813664854 813441217 813285232 813160717 812998950
2629.1 812998950 812818468 812672913 812543929 812367558 812143862 811946809 811787963 811612487 811408162 811219692
2649.5 811219692 811076045 810925066 810721874 810531914 810413539 810288370 810093284 809895337 809749305 809629440
2669.9 809629440 809484661 809298575 809111714 808954775 808771551 808524907 808293700 808105946 807900548 807671487
2690.3 807671487 807457089 807277501 807109416 806916475 806708872 806509435 806303263 806080818 805869460 805665314
2710.7 805665314 805442452 805211008 805006802 804863811 804753363 804614186 804444551 804247737 804012358 803781152
2731.1 803781152 803599060 803461671 803330541 803168595 803002715 802873790 802779794 802686512 802540064 802331924
2751.4 802331924 802123547 801949322 801779807 801598668 801408947 801207662 800982475 800739527 800551176 800452769
2771.8 800452769 800339937 800104737 799771249 799421608 799121678 798904300 798759282 798617065 798362136 797974288
2792.2 797974288 797575951 797257483 796926796 796473801 795976460 795528889 795107901 794678390 794196665 793629467
2812.6 793629467 793015718 792421222 791875601 791334033 790731788 790051520 789319456 788555086 787749052 786916316
2833 786916316 786091208 785251617 784209073 782815337 781184494 779378057 777381003 775510073 774252474
2851.4 774252474 773707867 773589432 773662984 773760736 773661911 773321211 772865474 772367418 771917880 771604002
2871.8 771604002 771234334 770630777 770004272 769513011 769059300 768587172 768108726 767634809 767159939 766700149
2892.2 766700149 766301870 765860558 765266597 764692366 764261305 763813853 763236523 762577236 761807084 760715365
2912.6 760715365 759174943 757495761 756225944 755630851 755633235 756030083 756673515 757433116 758089662
2930.9 758089662 758614302 759221673 759998858 760890126 761941075 763121247 764183521 764962554 765582681
2949.3 765582681 766245604 766865551 767318964 767789543 768417656 769119024 769796371 770470083 771238625 772121549
2969.7 772121549 773094714 774118304 775085747 775985420 776811242 777413070 777819216 778218389 778650939
2988 778650939 779165626 779698133 779996872 780105650 780151069 780118644 780114532 780158520 780203044 780383527 780731857
3010.5 780731857 780983865 780917883 780597806 780230343 779935658 779732108 779548347 779293180 779055715 778919101
3030.9 778919101 778812706 778568208 778126657 777778924 777650893 777445495 776966095 776376367 775948763 775629938
3051.3 775629938 775185049 774647772 774103940 773559451 773122549 772829235 772596359 772244513 771639526 770980775
3071.7 770980775 770567000 770467520 770447314 770155907 769607425 769052744 768485785 767896235 767385960 766880810
3092.1 766880810 766319215 765794754 765393138 764986575 764386654 763752937 763334155 763008952 762514830 761989653
3112.4 761989653 761715949 761506021 761052966 760260820 759201884 758199215 757483184 756936312 756330371
3130.8 756330371 755604088 754927635 754439294 753941119 753145039 752180457 751322269 750587940 750007927 749567211
3151.2 749567211 748900473 747825503 746700585 745777547 744962096 744124472 743240058 742368996 741493285
3169.6 741493285 740542114 739567578 738656402 737746537 736769974 735772550 734769523 733751357 732733428
3187.9 732733428 731693447 730628848 729577541 728521526 727414429 726271093 725141048 724058449
3204.2 724058449 723017335 721947968 720852852 719798982 718737245 717644274 716527224 715320289
3220.5 715320289 714078248 712929726 711864173 710807741 709797323 708846807 707736969 706403315
3236.9 706403315 705080986 703879058 702808619 701856792 700845122 699657917 698466122 697449505
3253.2 697449505 696513236 695472777 694378018 693367422 692434251 691562712 690834165 690273881 689610660
3271.5 689610660 688612163 687434733 686303735 685297370 684371889 683452427 682533324 681683421 680961311
3289.9 680961311 680213451 679243326 678073764 676792264 675561607 674580097 673797607 672842801 671390176
3308.2 671390176 669582427 667786121 666149557 664573491 662977457 661394179 659837306 658243358
3324.6 658243358 656456053 654461026 652454376 650528312 648703575 646984220 645130754 642984033
3340.9 642984033 640711188 638412714 636210799 634236634 632161677 629695237 627093792 624642074
3357.2 624642074 622337639 620012701 617651224 615479231 613446951 611152649 608466446 605769694
3373.5 605769694 603394389 601247609 599170208 597124398 595154762 593370199 591889083 590723813
3389.8 590723813 589445591 587689877 585897326 584623694 583642602 582256615 580445230 578875601
3406.1 578875601 577700853 576633394 575569868 574443340 573327541 572441280 571697414 570963919 570383489
3424.5 570383489 570055306 569909275 569801092 569789886 569954395 570009410 569831371 569754362 570014536 570523500
3444.9 570523500 571058273 571542084 572135985 572933316 573877990 574942648 576137125 577287614 578374565
3463.2 578374565 579720378 581265450 582518399 583374560 584242940 585383177 586863756 588459194 589712620
3481.6 589712620 590835810 592253327 593703449 594996989 596403539 597997189 599629939 601249456
3497.9 601249456 602973819 604683757 606027842 607233226 608680010 610266268 611933887 613611102
3514.2 613611102 615161598 616809785 618821383 621051788 623038590 624629200 626085162 627647161
3530.6 627647161 629489303 631616592 633698702 635616362 637832224 640482783 642918527 644638181
3546.9 644638181 646223247 648142993 650033653 651945949 654236794 656818509 659589708 662682474
3563.2 662682474 665687859 667699218 669096053 670993805 673399150 675995350 678705633 681552052
3579.5 681552052 684763014 688585460 692330241 694712520 696512520 699188352 702251315 705091715
3595.8 705091715 707953691 710759640 713421822 716582954 720217586 723395109 726068377 728795767
3612.1 728795767 731629074 734625876 737102926 738551855 740278542 743396163 747262895 749540150
3628.5 749540150 749987364 751041532 752699852 754422665 756258965 758183062 760617137 764193296
3644.8 764193296 768146098 769901514 769083858 768927336 769877255 770579576 771273136 772262096 773441553
3663.1 773441553 775470972 778292358 780232191 781320810 783057988 783500671 782212377 781775594 782314122
3681.5 782314122 783780038 786384284 788938940 789505959 788577139 788131416 788560390 789527476 790563583
3699.8 790563583 790908933 790995538 792124152 794201672 795684755 795160830 794101954 794173896 794998705
3718.2 794998705 795920134 796631396 796925068 796840072 797375500 799165606 801331818 802115858 800928533
3736.5 800928533 799936771 800841212 802131474 801733732 801539242 802335799 801415503 799157083 798301339
3754.9 798301339 798554778 798296094 797559619 797520101 798002779 798332334 798014879 797050297 796487331 796873033
3775.3 796873033 797654033 797796011 797314465 797009170 796758175 796475887 796448231 796793401 797549367 798448563
3795.7 798448563 799503386 800324380 799819112 799102962 798677862 797507524 796804190 797652423 799076915
3814.1 799076915 799769580 800367832 800588548 799179971 798003078 797823429 797977865 798459828 799213409
3832.4 799213409 800262630 800915837 800274730 799120724 798077285 797164440 797183692 798875868 801485658
3850.8 801485658 801708996 798633695 796963096 797254145 798088253 798587978 798549056 798805594 798913598
3869.1 798913598 798152387 797281682 796715975 796917796 797501564 797709346 797830641 797371328 796695054 796698630
3889.5 796698630 796374440 795760691 796187162 797417343 798337221 798297644 797161996 795576096 794604599
3907.9 794604599 794359982 794539273 795074642 795550525 795475245 795130968 794970214 794848144 794697523 794827163
3928.3 794827163 795040607 794824302 794331431 794020832 794031560 794225037 794267535 794214427 794286966 794238806
3948.7 794238806 793979406 793750763 793604076 793484807 793436766 793388963 793256462 793167531 793180466 793214321
3969.1 793214321 793240964 793238521 793168426 793074787 793021739 793023348 793058693 793052435 792966008 792853713 792766035 792723179
3993.5 792723179 792699158 792649925
3997.6 792649925
##END=$$ End of the data block
