##TITLE=Carvao M $$ Begin of the data block
##JCAMP-DX=5.00 $$ ACD/SpecManager v 10.08
##SPECTROMETER/DATA SYSTEM=Alpha
##DATE=25 Jun 2015 13:07:00
##DATA TYPE=INFRARED SPECTRUM
##DATA CLASS=XYDATA
##ORIGIN=
##OWNER=
##NPOINTS=1765
##FIRSTX=399.76428223
##LASTX=3997.64306641
##MAXX=3997.64306641
##MINX=399.76428223
##MAXY=0.34471571
##MINY=0.16301422
##XFACTOR=1.0000000000
##YFACTOR=1.000000000000000e-9
##FIRSTY=0.34308141
##DELTAX=2.03961372
##XUNITS=1/CM
##YUNITS=ARBITRARY UNITS
##XYDATA=(X++(Y..Y))
399.8 343081415 344068378 344715714 344511867 343925029 343328267 342484623 341336042 339919031 338200569
418.1 338200569 337068230 336720854 336048454 335073143 334386975 333774447 332874149 331841111 330908835
436.5 330908835 330013156 329105616 328186125 327283978 326545328 325876594 325006545 324133575 323442817 322588205
456.9 322588205 321773291 321420014 321220130 320953101 320790768 320654154 320365489 320277244 320468485 320541948
477.3 320541948 320543677 320632875 320711374 320803672 321012914 321194112 321238339 321291268 321361482 321334541 321180820
499.7 321180820 320939213 320733368 320576429 320304304 319879472 319560081 319377720 319068670 318782717 318735182
520.1 318735182 318673670 318513155 318469107 318392634 318056703 317646950 317277133 316893727 316588074 316317022
540.5 316317022 315872401 315307826 314778179 314268321 313817590 313481212 313105255 312637389 312273711 312007189
560.9 312007189 311627477 311202019 310924351 310749471 310628235 310575664 310528874 310467273 310454011 310479283 310505569
583.3 310505569 310628623 310810983 310853958 310861617 311017573 311190099 311302364 311420798 311505377 311537355 311598301
605.8 311598301 311744779 311933517 312123448 312290102 312371939 312432051 312595218 312788367 312941104 313185483
626.2 313185483 313528478 313748628 313804835 313866377 313981146 314152777 314397007 314580649 314637721 314672530
646.6 314672530 314705819 314676255 314670295 314763367 314827412 314858824 314961880 315065414 315161467 315201521 314974457
669 314974457 314800471 314799964 314790428 314729840 314679444 314629614 314478934 314249068 313998729 313696921 313378602
691.4 313378602 313219726 313277066 313371837 313447922 313542247 313522190 313376278 313246101 313076407 312853277 312740117
713.9 312740117 312685281 312551081 312424928 312363446 312281877 312168151 312036425 311877400 311763436 311726183
734.3 311726183 311631829 311436296 311273843 311131865 310911804 310743660 310680598 310538739 310324878 310130477
754.7 310130477 309878260 309604973 309424460 309217423 308868676 308522671 308207214 307775408 307291210 306867659
775.1 306867659 306478530 306228966 306260854 306384027 306368411 306227088 305936098 305486768 305047840 304725260
795.4 304725260 304510742 304541200 304906726 305366278 305782557 306238413 306574017 306689203 306818783 306962252
815.8 306962252 306941599 306877106 306870848 306797236 306663930 306549489 306384981 306165278 306023747 305943668 305786610
838.3 305786610 305624068 305521250 305338889 305094928 304944724 304785788 304496378 304219455 303966254 303627878
858.7 303627878 303293526 303011507 302668482 302230000 301692307 300985813 300192177 299549788 299151301 298937559
879.1 298937559 298888654 298943281 298972756 298951119 298910111 298807859 298648864 298490375 298297822 298082560 297928721
901.5 297928721 297758996 297472417 297187001 296979725 296736777 296452612 296230555 295996964 295682430 295395106
921.9 295395106 295112997 294753045 294417024 294150144 293836087 293463647 293101400 292707384 292287797 291916072
942.3 291916072 291528344 291075796 290654898 290263802 289810807 289334595 288871408 288353562 287803203 287291795
962.7 287291795 286777109 286247194 285766870 285302937 284777313 284248739 283779085 283282667 282744467 282237291
983.1 282237291 281744897 281258047 280812144 280380636 279939055 279525191 279107422 278615147 278113782 277687311
1003.5 277687311 277252287 276744574 276254773 275801718 275326878 274844915 274361253 273856968 273358107 272855788
1023.9 272855788 272297233 271703124 271118999 270507365 269828647 269126803 268445224 267800361 267241955 266765654
1044.3 266765654 266311079 265931308 265717864 265635371 265607983 265609622 265571058 265425920 265243798 265048891
1064.7 265048891 264766246 264426887 264095277 263731360 263317198 262919724 262588352 262333781 262151927 262021571
1085.1 262021571 261923969 261905104 262002796 262149036 262311637 262528390 262776941 263001084 263183266 263323188
1105.5 263323188 263441235 263558388 263667613 263789922 263955086 264149785 264328688 264459938 264572233 264683574
1125.9 264683574 264785051 264924288 265127361 265333533 265502453 265655398 265819669 265985072 266117394 266217470
1146.3 266217470 266321212 266458571 266621083 266764462 266870856 266933233 266915917 266856074 266866922 266972125
1166.7 266972125 267125219 267333716 267591000 267827928 268038362 268284023 268551826 268777668 268983454 269218743
1187.1 269218743 269443870 269634485 269835174 270041078 270227492 270429045 270645291 270850509 271085888 271341324
1207.5 271341324 271549195 271754682 272018522 272276074 272492796 272721410 272970110 273218423 273469567 273713440
1227.9 273713440 273943603 274188578 274460942 274739444 275017053 275303185 275587261 275873274 276199102 276533008
1248.2 276533008 276820630 277105182 277411133 277689934 277943730 278218627 278501421 278755754 279000700 279246986
1268.6 279246986 279479474 279737681 280036628 280312628 280559748 280814052 281041712 281238049 281445801 281626612
1289 281626612 281752914 281881481 282017827 282119155 282206118 282297134 282362312 282399893 282427222 282430619 282395333
1311.5 282395333 282367289 282358497 282320738 282294959 282311112 282300174 282263428 282258511 282251269 282195866 282120287 282001644
1336 282001644 281810254 281691223 281738549 281789601 281744480 281669915 281591356 281494081 281388789 281273395 281106204
1358.4 281106204 280846059 280575842 280437887 280339360 280143350 279874563 279522985 279179364 278963387 278703779
1378.8 278703779 278258294 277771950 277511388 277583629 277854770 278014064 277838111 277509302 277304620 277184278
1399.2 277184278 277126163 277049631 276884705 276759624 276660621 276508480 276339084 276125282 275727719 275321990
1419.6 275321990 275251389 275285304 275233984 275125384 274964541 274859369 274733096 274411440 274204701 274307400
1440 274307400 274385542 274291277 274042785 273779094 273666233 273584098 273296684 272671849 272314996 272629082
1460.4 272629082 272901893 272815824 272736937 272836924 272743970 272366762 272214502 272395313 272568673 272604972
1480.8 272604972 272598565 272528887 272239089 271837324 271701366 271823049 271764457 271451145 271273971 271320522
1501.2 271320522 271285504 270716071 269935429 269979119 270330250 270395577 270198584 269943714 269638151 269205630
1521.6 269205630 269005626 269028634 269050211 269089282 268921494 268569291 268407434 268105477 267312944 266866952
1542 266866952 267037779 267262220 267258883 267042756 266777843 266456664 265970707 265146554 264776736 265190661
1562.4 265190661 265428692 265297055 264951169 264666259 264632761 264412850 264013112 264019012 264172137 264167279
1582.8 264167279 264122099 264089584 264019549 263907284 263797164 263697743 263588369 263411611 263088882 262635827
1603.2 262635827 262098551 261438429 260654747 259841889 258962601 257762611 256544590 255962789 255510032
1621.5 255510032 254832178 254290849 253901422 253617793 253515601 253344595 253204435 253725141 254643530 255491912
1641.9 255491912 256172448 256806761 257840127 259003371 259762824 260821491 262469888 263884097 264865339
1660.3 264865339 265605658 266398430 267097324 267417580 267707407 268201411 268542916 268852085 269290328 269515693
1680.7 269515693 269239873 268922567 269302934 269799203 270045906 270072430 269691885 269210637 268899322 268854499
1701.1 268854499 269224614 269481391 269592613 269756675 269804955 269632339 269189566 268736094 268884093 269346565
1721.5 269346565 269547701 269549638 269492120 269350231 269034564 268554926 268564641 268893719 268946171 268918514 268957078
1743.9 268957078 268925399 268784374 268601954 268662810 268911004 268949300 268838376 268736601 268657655 268724978
1764.3 268724978 268724203 268505216 268164277 267871261 267958552 268218249 268270820 268186480 268102884 267981827 267883688
1786.7 267883688 267743200 267367721 267059892 267139137 267225176 267076135 266921103 266921282 266945899 266893864 266777664
1809.2 266777664 266644925 266574621 266524494 266428858 266351372 266274810 266074002 265837789 265683830 265526026
1829.6 265526026 265498608 265613526 265613943 265499890 265397340 265170246 264772385 264640152 264808476 264882803
1850 264882803 264796376 264686078 264590740 264464438 264337391 264243215 264107585 263832867 263522536 263454735 263590068
1872.4 263590068 263641506 263551205 263428569 263309687 263184935 263067901 262935936 262752563 262629509 262593985
1892.8 262593985 262525856 262432545 262341589 262253284 262182087 262106508 261996984 261870801 261770695 261688590 261552185
1915.2 261552185 261340082 261184812 261117786 261057377 261026949 261003941 260931343 260815561 260693371 260594010 260495722
1937.7 260495722 260348022 260165006 260063589 260034770 259965092 259869695 259779125 259682000 259593338 259498447 259367555
1960.1 259367555 259236813 259121716 258991420 258883417 258829504 258765876 258657515 258553833 258479059 258393019
1980.5 258393019 258287311 258178473 258051455 257913470 257779956 257674575 257616311 257563412 257493764 257404476
2000.9 257404476 257299244 257205606 257128567 257054567 256970495 256868273 256736010 256591141 256445765 256260365
2021.3 256260365 256000668 255759984 255734801 255878419 255975366 255981922 255945742 255900711 255835325 255747944 255701095
2043.7 255701095 255687118 255636752 255554169 255474836 255395949 255327106 255290449 255259067 255188018 255095840 255030960
2066.2 255030960 254982710 254928172 254881293 254831076 254770994 254737765 254724920 254688561 254642963 254615933 254582793
2088.6 254582793 254546046 254524380 254482180 254411221 254360557 254336119 254310071 254276931 254230887 254170179 254117191
2111 254117191 254086643 254049957 253997564 253960669 253933191 253892779 253845930 253797829 253750861 253714442 253681421 253640234
2135.5 253640234 253601938 253570437 253519952 253469169 253454506 253448546 253419578 253359258 253277034 253207654 253170073 253147930
2160 253147930 253123373 253089458 253038943 252982378 252947271 252931952 252902746 252852172 252813786 252798647 252764076 252693743
2184.5 252693743 252638131 252606362 252561957 252522677 252506047 252479911 252430886 252386957 252355933 252316356 252277523
2206.9 252277523 252239466 252179235 252110869 252054811 252008110 251961112 251918197 251883209 251840860 251789480 251738012
2229.3 251738012 251681030 251619667 251579404 251557589 251514852 251464009 251419187 251360416 251310915 251283675 251247287
2251.8 251247287 251194328 251147419 251105487 251057148 251023173 250997752 250942200 250868201 250810951 250758857 250695288
2274.2 250695288 250636280 250583857 250528306 250484377 250444502 250393510 250345349 250297844 250236154 250170678 250122488
2296.6 250122488 250068873 250000179 249960944 249938220 249885589 249827251 249788567 249746695 249710619 249681681 249620199
2319.1 249620199 249534279 249472961 249450862 249414012 249336809 249265581 249184370 249060705 248938575 248817727 248670921
2341.5 248670921 248487547 248323813 248409435 248705864 248919025 248937532 248906225 248832569 248671114 248518422
2361.9 248518422 248425245 248355150 248267904 248151407 248026982 247934029 247902617 247919932 247954056 247985765 248007506
2384.3 248007506 248023272 248024017 248002335 247970492 247933224 247897834 247874647 247843444 247793928 247752666 247709692 247641012
2408.8 247641012 247584119 247557208 247522846 247469962 247402802 247335732 247305036 247289106 247240379 247181520 247138500
2431.2 247138500 247085854 247024119 246982068 246947974 246896654 246853486 246832833 246789590 246727794 246692225 246664807
2453.7 246664807 246612594 246549919 246497527 246458843 246435910 246399924 246332526 246265844 246208474 246155381 246123120
2476.1 246123120 246115625 246104449 246061563 246003956 245949641 245885894 245818958 245767385 245711878 245635659 245572209 245533898
2500.6 245533898 245497808 245466962 245433182 245377570 245321646 245281488 245234653 245169118 245119154 245102987 245085195
2523 245085195 245038062 244976342 244917512 244863614 244833291 244821966 244800925 244762331 244707406 244656682 244631022 244604096
2547.5 244604096 244535342 244459242 244423717 244391933 244342580 244311959 244288072 244235158 244179383 244137734 244094849
2569.9 244094849 244056717 244031250 243997753 243937626 243877485 243831739 243794680 243770704 243749678 243716434 243670091
2592.4 243670091 243622288 243560866 243482009 243420899 243377194 243333116 243308648 243295491 243253231 243201241 243181169
2614.8 243181169 243154466 243082240 243004620 242946252 242903545 242882878 242865145 242833257 242794499 242750689 242705882
2637.2 242705882 242660537 242603078 242539629 242495805 242467970 242421791 242367864 242332965 242288202 242217273 242162764
2659.7 242162764 242128208 242075279 242024124 241990700 241948888 241910458 241898090 241882056 241834626 241781950 241739333
2682.1 241739333 241683066 241610005 241551489 241504639 241440460 241383299 241363361 241351649 241318911 241266713 241196901
2704.5 241196901 241124094 241074502 241042331 240995839 240942776 240909725 240884885 240856498 240815520 240757063 240700230
2727 240700230 240661949 240639880 240607381 240550041 240485311 240434527 240405500 240383416 240350321 240296870 240228906 240167320
2751.4 240167320 240118742 240079269 240040049 239988163 239936888 239897266 239857242 239830479 239818364 239781156 239718527
2773.9 239718527 239662483 239613727 239546910 239464432 239400148 239351884 239307106 239270583 239218578 239160851 239135683
2796.3 239135683 239102617 239036500 238979980 238922969 238840282 238763228 238708645 238660201 238605171 238541692 238486439
2818.8 238486439 238438725 238380626 238321677 238257796 238185421 238145441 238121629 238053963 237956688 237856224 237738669
2841.2 237738669 237609655 237494931 237378031 237235814 237104133 236998200 236906275 236863852 236871630 236857444
2861.6 236857444 236792728 236707598 236604586 236488909 236402616 236333936 236249700 236184314 236151159 236105919 236046597
2884 236046597 236003309 235954329 235881791 235817209 235774040 235731378 235684559 235641360 235574096 235491738 235446468 235407725
2908.5 235407725 235348165 235306501 235252485 235138804 235001177 234888449 234804243 234726146 234660342 234645516 234689012
2930.9 234689012 234737545 234757319 234784335 234833047 234868497 234878123 234875962 234859094 234829515 234805405 234769061 234678626
2955.4 234678626 234532565 234377384 234244317 234106004 233930558 233731389 233542919 233414263 233382687 233416513
2975.8 233416513 233491331 233647734 233855441 234025493 234161541 234282315 234351739 234377399 234402955 234428614
2996.2 234428614 234435186 234416351 234380454 234348550 234327346 234310061 234285235 234239012 234175295 234100536 234029517 233975336
3020.7 233975336 233902186 233805463 233732358 233679026 233623341 233560488 233481854 233399853 233341202 233314112 233299017
3043.1 233299017 233240321 233116850 233000502 232929841 232869670 232788816 232683703 232599273 232553884 232493326 232405692
3065.5 232405692 232333258 232274383 232214943 232154474 232074693 231983572 231901780 231814846 231708243 231602192 231514379
3088 231514379 231421664 231309608 231194839 231093481 231015056 230943874 230847836 230736911 230636895 230533719 230414644
3110.4 230414644 230294958 230184823 230087787 229999930 229875699 229696319 229517281 229358211 229196072 229046166
3130.8 229046166 228915483 228778601 228627563 228470013 228316963 228164196 227992356 227823839 227684647 227542430
3151.2 227542430 227360278 227136314 226907000 226714373 226542681 226367548 226190239 225992680 225762933 225506052
3171.6 225506052 225250110 225024655 224806964 224559352 224268183 223958686 223658264 223382488 223140985 222872332
3192 222872332 222525313 222160593 221846208 221566409 221286461 221014783 220737606 220410213 220055684 219729379
3212.4 219729379 219418064 219090819 218766183 218453258 218107000 217716441 217346519 217013434 216694951 216395617
3232.8 216395617 216065943 215689436 215330780 215001464 214683339 214383364 214085087 213767752 213466167 213198036
3253.2 213198036 212931931 212672785 212415934 212131530 211847425 211587399 211353362 211148053 210924298 210645199
3273.6 210645199 210336760 210038856 209765643 209492534 209186420 208862677 208521515 208137155 207759127 207398832
3294 207398832 206995830 206561819 206144437 205753848 205385864 204965547 204411879 203796357 203228563 202719659
3314.4 202719659 202174932 201542959 200901970 200272307 199593261 198856413 198122829 197408572 196657211 195878163
3334.8 195878163 195125669 194373369 193554401 192676395 191783935 190868720 189930320 188971028 187966213
3353.1 187966213 186954722 185994834 185065955 184111506 183112085 182104051 181133553 180181235 179203436
3371.5 179203436 178215936 177245557 176321745 175469980 174644887 173828050 173067883 172397152 171833783 171285316
3391.9 171285316 170630500 169961944 169426173 168961346 168404669 167757288 167157769 166661963 166212186 165746272
3412.3 165746272 165279984 164864376 164511204 164206758 163933128 163690835 163484678 163307205 163188159 163147151
3432.7 163147151 163146764 163131967 163067251 163014218 163060382 163190633 163356021 163552582 163773701 164001852 164265439
3455.1 164265439 164592296 164962709 165316463 165648922 166053146 166536361 166983694 167343944 167692974 168086782
3475.5 168086782 168493822 168895110 169301212 169724584 170178622 170639023 171074301 171498790 171958178 172463045
3495.9 172463045 172963768 173449665 173943415 174459651 174990922 175480634 175942078 176472783 177053228 177580029
3516.3 177580029 178054467 178557560 179131970 179739505 180311412 180833578 181394473 182031542 182649657 183208868
3536.7 183208868 183768123 184362233 184973091 185584709 186202049 186841145 187489480 188152343 188838482 189513728
3557.1 189513728 190188318 190871656 191514879 192078963 192691892 193538278 194493383 195359305 196132481 196896538
3577.5 196896538 197732404 198639110 199524432 200277954 200983733 201900139 202905074 203783050 204641759
3595.8 204641759 205556348 206463233 207388043 208310157 209110871 209812179 210538507 211309910 212118074 212899819
3616.2 212899819 213567600 214317024 215253294 216097176 216551080 216690719 217176765 218049034 218807235 219377249
3636.6 219377249 219869331 220347866 220803916 221114337 221148804 221046209 221306369 221928403 222385705 222643256
3657 222643256 222982258 223294139 223503366 223709807 223789692 223602504 223500878 223555103 223417029 223446548
3677.4 223446548 223812059 224217832 224594310 224802911 224670112 224420771 224549457 224962384 225280523 225437492
3697.8 225437492 225479096 225439921 225493491 225619465 225591391 225349620 225164831 225355268 225680545 225835770
3718.2 225835770 225830942 225725591 225579366 225540861 225666761 225736618 225602657 225353330 225203231 225385427
3738.6 225385427 225674719 225538895 225120232 225156352 225218087 224868774 224779978 225092083 225293636 225310832
3759 225310832 225397259 225499272 225467369 225398108 225311115 225288883 225439176 225577801 225534067 225382745 225321010
3781.4 225321010 225320980 225274310 225246593 225265816 225302204 225290358 225192964 225132793 224986777 224711254 224656239 224613085
3805.9 224613085 224539191 224775732 225064680 225014403 224699005 224497348 224319786 224258944 224529162 224719256
3826.3 224719256 224703863 224621311 224562779 224551290 224366039 224060044 223988622 224082872 224176064 224341705 224531978
3848.7 224531978 224388421 223681763 223295733 223765627 224263251 224338546 224099919 223884642 223816484 223705202
3869.1 223705202 223682776 223857835 224020392 224105135 224000782 223872691 223882675 223807216 223798424 223838925 223727047
3891.6 223727047 223754585 223927751 223878011 223618954 223393604 223277345 223375589 223636925 223809183 223847345
3912 223847345 223803371 223661393 223515615 223516881 223598152 223605379 223592415 223579004 223485529 223427802 223521054 223632410
3936.4 223632410 223633900 223570183 223497301 223470882 223457456 223371714 223327145 223398298 223486707 223522946 223490387 223394781
3960.9 223394781 223318949 223321229 223329768 223306865 223289475 223278970 223267704 223261788 223246321 223240644 223283127 223330513
3985.4 223330513 223306313 223240420 223210514 223190233 223149478 223123744
3997.6 223123744
##END=$$ End of the data block
