##TITLE=Carvao M $$ Begin of the data block
##JCAMP-DX=5.00 $$ ACD/SpecManager v 10.08
##SPECTROMETER/DATA SYSTEM=Alpha
##DATE=09 Jun 2015 08:49:18
##DATA TYPE=INFRARED SPECTRUM
##DATA CLASS=XYDATA
##ORIGIN=
##OWNER=
##NPOINTS=1765
##FIRSTX=399.76428223
##LASTX=3997.64306641
##MAXX=3997.64306641
##MINX=399.76428223
##MAXY=1.00230682
##MINY=0.80101651
##XFACTOR=1.0000000000
##YFACTOR=0.000000010000000
##FIRSTY=1.00000000
##DELTAX=2.03961372
##XUNITS=1/CM
##YUNITS=ARBITRARY UNITS
##XYDATA=(X++(Y..Y))
399.8A00000000n07611Q5658K24197l03150l50254J89781K23887j58036p2914K47836
420.2I9579394r7168n48005k70760K23279k4462m26512r3991K83289m5234l15833M2915
442.6I8306912K45339j87242l81881P0715K72351j15961k56013J09261J54477k58344
463I7959614k83724J87504K73234j53357k46418J30451J62172k04306j94049J90222
483.4I7821343J57350k15000j37764K43819J44476k49643j36190K72500J73098k38573
503.8I7835416j47224J95658N0682k80356j09929K48337R0581k75332j23012K21539
524.2I7706360P0780k46560p1252J90324k1607k77710o9982J96046J5891k47092q0519
546.6I7164679J57690l2676k65574n9587J64372n2238k64525m3011J84041j502j95825
$$ plain form
399.8 100000000 99492389 99578047 99802244 99499094 99148840 99338621 99562508 99404472 99331558 99579394
420.2 99579394 99482226 98934221 98663461 98886740 98862278 98435766 98341775 98625064 98579830 98263997 98306912
442.6 98306912 98552251 98365009 97983128 98053843 98326194 98210233 97954220 98063481 98217958 97959614
463 97959614 97675890 97863394 98136628 97983271 97736853 97867304 98029476 97825170 97631121 97821343
483.4 97821343 97978693 97763693 97625929 97869748 98014224 97764581 97628391 97900891 98073989 97835416
503.8 97835416 97688192 97883850 97934532 97654176 97544247 97792584 97883165 97607833 97484821 97706360
524.2 97706360 97777140 97530580 97459328 97649652 97628045 97350335 97280353 97476399 97492290 97245198 97164679
546.6 97164679 97322369 97289693 97024119 96964532 97128904 97076666 96812141 96769130 96953171 96951669 96755844
569.1I6755844Q333K11197J0413j88082K6309K05499k1487j84948O2806K43968m763
591.5I7125089j91569N3727K26778k5290j85806Q0562K33507l2812j83046P8475K21956
613.9I7401571n2589j91247J04475K50137j9122j42723J24437K30759m5007j58394
634.3I7502297J13148K25365n9259j71739J20598K16156q5544j77384J15687K02006
654.7I8001331q2314j51038J43689K18403n3692k02644Q1492K00879p0220j30290J26046
677.2I8081642J71370r4974j32978J33812J62536j03277j17338J44911J54698j04690
697.5I8295712j24955J28746J54233r9748j26296J24043J49602r2388j16795J14375
717.9I8406529J40220p5614q8698J25242J37436q4108j09959J07104J36941q1533j19674
$$ plain form
569.1 96755844 96764177 96975374 96985787 96797705 96824014 97029513 97008026 96823078 96885884 97129852 97125089
591.5 97125089 96933520 96987247 97214025 97188735 97002929 97083491 97316998 97284186 97101140 97179615 97401571
613.9 97401571 97348982 97157735 97262210 97512347 97493225 97350502 97474939 97705698 97660691 97502297
634.3 97502297 97615445 97840810 97781551 97609812 97730410 97946566 97861022 97683638 97799325 98001331
654.7 98001331 97919017 97767979 97911668 98130071 98076379 97873735 97955227 98156106 98085886 97955596 98081642
677.2 98081642 98253012 98158038 98025060 98158872 98321408 98218131 98100793 98245704 98400402 98295712
697.5 98295712 98170757 98299503 98453736 98353988 98227692 98351735 98501337 98408949 98292154 98406529
717.9 98406529 98546749 98471135 98382437 98507679 98645115 98561007 98451048 98558152 98695093 98613560 98493886
740.4I8493886R2804J33676o5232r7692J03862J41704n7215r3907R7829J29527o2156
762.8I8817086j00153R0992J33985n8508j11436P2264J28377m2844q8519Q9520J41537
785.3I9072301m1598j10978N7984J23340m0180j00326P1531J52785m482q2952P7063
807.7I9174488J56605o068r0712O7866J47807k1255j12092N1844J37502k5779j09905
830.1I9370301M9001J33741k5255j14000M3685J34998j8066j07443M3726J31362k6625
852.6I9615425j23805K7245J16092m0978j30647K7698J18154m4310j48463J341J03712
875I9521464m0448j34760J2523J13970k2369j23954O842J00124l4928j24866J1331
897.4I9284929J02752k5105j03605K9528J08683k8562j23918j061Q7315l6937j24055
$$ plain form
740.4 98493886 98586690 98720366 98655134 98557442 98661304 98803008 98745793 98651886 98749715 98879242 98817086
762.8 98817086 98716933 98807925 98941910 98883402 98771966 98844230 98972607 98929763 98841244 98930764 99072301
785.3 99072301 99030703 98919725 98977709 99101049 99060869 98960543 99032074 99184859 99180377 99097425 99174488
807.7 99174488 99331093 99325025 99234313 99302179 99449986 99428731 99316639 99368483 99505985 99480206 99370301
830.1 99370301 99419302 99553043 99527788 99413788 99457473 99592471 99574405 99466962 99510688 99642050 99615425
852.6 99615425 99491620 99518865 99634957 99593979 99463332 99491030 99609184 99564874 99416411 99417752 99521464
875 99521464 99481016 99346256 99358779 99472749 99450380 99326426 99333268 99433392 99398464 99273598 99284929
897.4 99284929 99387681 99362576 99258971 99288499 99397182 99368620 99244702 99243641 99330956 99294019 99169964
919.9I9169964l767Q0186m1253j31690j5122P6687l8594j36357l0518O3873m1563j38312
944.3I8813534m2206M3213n8156j48428n1444L9762n8699j58769o8372L2335m9978
966.8I8292792j46711o8998K3257n5676j51903q1479J3446n0657j41454p3958K4385
989.2I7583044l3284j26904o5827L5643j8644j20616p0184L2490j9437j31631r2739
1011.6I6971911J3310k2119j26410q8054K2990j1760j23054r2191J8931l487j05625
1034.1I6454442p7582L3844J7136q9061p2050L5655K1714q5717p2772L4541K5720p9751
1058.6I6146119p1806M3315M4643p3188q1164L2491L8349o9505n9282P1728Q9514k1642
1083I6089572l3343P5322Q3381l2753m7940O8385Q0257m3135o3867N0825O7222n4747
$$ plain form
919.9 99169964 99166197 99246383 99205130 99073440 99058318 99135005 99096411 98960054 98929536 98993409 98951846 98813534
944.3 98813534 98771328 98814541 98756385 98607957 98556513 98596275 98537576 98378807 98310435 98342770 98292792
966.8 98292792 98146081 98077083 98100340 98044664 97892761 97811282 97824728 97774071 97632617 97558659 97583044
989.2 97583044 97549760 97422856 97357029 97392672 97374028 97253412 97183228 97215718 97196281 97064650 96971911
1011.6 96971911 96985221 96963102 96836692 96748638 96771628 96759868 96636814 96544623 96563554 96560067 96454442
1034.1 96454442 96376860 96410704 96427840 96338779 96266729 96302384 96324098 96238381 96165609 96200150 96225870 96146119
1058.6 96146119 96074313 96117628 96162271 96089083 96007919 96040410 96078759 96009254 95949972 96021700 96111214 96089572
1083 96089572 96056229 96131551 96214932 96182179 96134239 96202624 96282881 96239746 96175879 96226704 96293926 96239179
1107.5I6239179q1658L3140O1006m7821o9541M9096Q1241l4266o6066N8019J15329
1129.9I6337658K3163o992J00517J26118O294k7961Q7089J17176n716n0515N8943R7377
1154.4I6863151j9002o3759M7409R0891j3190m2981Q1104J32799K8354j1808R8008
1176.9I7190976J39970K6571k3609Q1277J26684J8978k9659P2097J13625L916n0694
1199.3I7670132M5633R7221R585k9344O9929J16670J7857l5906N5433J06859J7202
1221.7I8141271l5471M9359R7984P820m8727L2920Q9770J6404l3623M3833R5218J7345
1246.2I8474103m2063K1732P4405J0764m2683K0468P4620J0263m8279Q970P0524K2310
1270.7I8655134l4022K0194Q2517L1423l4397J0132P6908M2004j8520J6743P9930M8584
$$ plain form
1107.5 96239179 96157521 96190661 96251667 96203846 96134305 96183401 96264642 96230376 96164310 96222329 96337658
1129.9 96337658 96360821 96353829 96454346 96580464 96586758 96558797 96645886 96763062 96757346 96706831 96765774 96863151
1154.4 96863151 96844149 96780390 96827799 96918690 96905500 96862519 96943623 97076422 97104776 97092968 97190976
1176.9 97190976 97330946 97357517 97333908 97415185 97541869 97560847 97531188 97603285 97716910 97720826 97670132
1199.3 97670132 97715765 97812986 97822571 97793227 97863156 97979826 97997683 97961777 98017210 98124069 98141271
1221.7 98141271 98105800 98155159 98253143 98260963 98212236 98245156 98334926 98351330 98317707 98361540 98456758 98474103
1246.2 98474103 98432040 98453772 98528177 98538941 98496258 98516726 98591346 98601609 98553330 98562300 98632824 98655134
1270.7 98655134 98621112 98641306 98723823 98755246 98720849 98730981 98807889 98849893 98831373 98848116 98928046 98976630
1295.2I8976630j7595R626P6574N6159n662J4746P8553N8198j2344J311O4796L8875
1319.6I9339867l5662j9109N0539M1759k7281k8116M0704N7465l487m1866p612Q881
1344.1I9376082l4403l6371K5231L3140k9970m2819L2812O5672l2037j09285m1134
1366.6I9206918Q059l1418m0161k0749n3244j29700j73062q9896P5770J32560O6251
1389I8951328Q6009J36978M8548m9103k6333O38k2704n7274k5707K2769k1076m1628
1413.5I9002445P6294J47777k3937j48844n3978P116k2375n6786o079R9849N9182j18280
1437.9I8962384r7620Q988L279k2543j97J3859J6659P9542J32674n8382k11472j07264
1462.4I8719907J2892K6524M4138J30975J55610K7799j01125j08331j4729O5488Q0591
$$ plain form
1295.2 98976630 98959035 98968661 99045235 99101394 99095732 99110478 99189031 99247229 99234885 99236196 99300992 99339867
1319.6 99339867 99304205 99285096 99335635 99377394 99350113 99321997 99362701 99420166 99416679 99374813 99367201 99376082
1344.1 99376082 99341679 99305308 99330539 99363679 99333709 99290890 99323702 99389374 99357337 99248052 99206918
1366.6 99206918 99214977 99183559 99143398 99122649 99069405 98939705 98766643 98676747 98752517 98885077 98951328
1389 98951328 99037337 99174315 99222863 99173760 99147427 99148065 99125361 99068087 99042380 99065149 99044073 99002445
1413.5 99002445 99078739 99226516 99202579 99053735 98999757 99006873 98984498 98927712 98921633 99021482 99080664 98962384
1437.9 98962384 98864764 98873752 98877031 98854488 98854291 98868150 98884809 98964351 99097025 99038643 98827171 98719907
1462.4 98719907 98732799 98759323 98803461 98934436 99090046 99117845 99016720 98908389 98893660 98959148 99039739
1484.9I9039739Q4418P1532j2457n2286P457L4273k7025m5359P7319K53451J26099
1507.3I9557161k11227k02912k9707J14727J16057N1260j3620q8972j14584j33669
1527.7I9044514o0356O5714L0798j2410J48422K00015j07479k67118j93733o2728m53
1550.1I8785186O014Q1116K22993J58191l07990l18533q4877J9479J2094q1671o0588
1572.6I8431414K7860p9281j89870j06931m1366m5341n4544m6104n1499q2069j14477
1595I7647792j20908j11705j28639j60122j59514j59639k16013k52521j78140j43975
1615.4I6016616k81525k75755j33407j23149j72001j73962j32102K0653J80477J24496
1635.8I5050341m0621J7852J63108K92182L67677L01022K75063L57795J77991k1606
$$ plain form
1484.9 99039739 99124157 99195689 99183232 99130946 99138403 99172676 99145651 99100292 99177611 99431062 99557161
1507.3 99557161 99345934 99143022 99113315 99228042 99344099 99395359 99381739 99292767 99178183 99044514
1527.7 99044514 98984158 99049872 99080670 99068260 99216682 99416697 99309218 99042100 98848367 98785639 98785186
1550.1 98785186 98791200 98872316 99095309 99253500 98945510 98626977 98542100 98561579 98573673 98492002 98431414
1572.6 98431414 98459274 98379993 98190123 98083192 98041826 97996485 97941941 97895837 97844338 97762269 97647792
1595 97647792 97526884 97415179 97286540 97126418 96966904 96807265 96591252 96338731 96160591 96016616
1615.4 96016616 95735091 95459336 95325929 95202780 95030779 94856817 94724715 94745368 94925845 95050341
1635.8 95050341 95009720 95027572 95190680 95482862 95850539 96151561 96426624 96784419 96962410 96940804
1656.2I6940804R2697K16370K36172J90663K15549K56341J75423J14989J16265N0866
1676.6I8606139O7085K12545K86215O9636j27768l8809L8916R3788J54626J61803R6196
1699I9620372p7665j22160m2361o0057q1438q631J09238J56593r006k03306j39087
1721.5I9142492l6401j1122L2699J27483J95503J10596n1659k539P5215M6640L7450
1743.9I9666357R4265J27244L8534q0734m7493K2375J6117N269m011o473L0380O3456
1768.4I9925286P4714M113j01579q2647m518K5963J866k8682k0033M9633Q2827q941
1792.8I9918002p0864j1426K7787j4489n4080l1715O824J7029p200k2960j0937j2004
1817.3I9733967j4514J9657M6510K3478J4854R536m3374n8418k9493n257K4581N3787
$$ plain form
1656.2 96940804 97033501 97249871 97486043 97676706 97892255 98148596 98324019 98439008 98555273 98606139
1676.6 98606139 98673224 98885769 99171984 99241620 99113852 99075043 99113959 99207747 99362373 99524176 99620372
1699 99620372 99542707 99420547 99378186 99318129 99236691 99228060 99337298 99493891 99484885 99281579 99142492
1721.5 99142492 99106091 99094969 99127668 99255151 99450654 99561250 99509591 99507052 99582267 99628907 99666357
1743.9 99666357 99760622 99887866 99926400 99845666 99798173 99820548 99836665 99841934 99837923 99831450 99861830 99925286
1768.4 99925286 100000000 100004113 99902534 99819887 99815369 99841332 99843198 99814516 99794483 99844116 99926943 99918002
1792.8 99918002 99847138 99835712 99863499 99849010 99794930 99763215 99770039 99787068 99779868 99756908 99745971 99733967
1817.3 99733967 99719453 99739110 99785620 99809098 99823952 99833488 99790114 99731696 99702203 99696946 99721527 99775314
1841.8I9775314K8301l3564m5508l9118l4666j3149M083m733j4389N377M4471O2179
1866.3I9734598J1230o1125n8019k9206k0862m244J1856Q34j4758M894K0903j4806
1890.7I9581295l4260o629R299q369k8932j8525Q792Q511j4436j5104J0026K2453j925
1917.3I9512196k5106r018j1832l7378k0134J1599J299k5659j8722R119J7822j91j6194
1943.8I9387801q685j3995l3474k0498P725J091k2751j4365J2153J3793j0544k4766
1968.3I9273485j2392r245k3162j2559J3745O187k1153j7578P200J0628n645j1879
1992.7I9197632k891p039k4837j9515K742R18j5390p391J0222M703j2475j9574k1762
2019.2I9085343m0388r1452r1898K8992J06680N1087J967O491R620J55M65R859L713
$$ plain form
1841.8 99775314 99803615 99770051 99724543 99685425 99650759 99637610 99641693 99636960 99622571 99627948 99672419 99734598
1866.3 99734598 99745828 99684703 99626684 99597478 99576616 99572372 99584228 99585062 99570304 99575198 99596101 99581295
1890.7 99581295 99547035 99540406 99549705 99541336 99512404 99493879 99502671 99511182 99496746 99481642 99491668 99514121 99512196
1917.3 99512196 99487090 99478072 99466240 99428862 99408728 99420327 99421626 99395967 99377245 99386364 99404186 99403995 99387801
1943.8 99387801 99379116 99365121 99331647 99311149 99318874 99319965 99297214 99282849 99295002 99308795 99298251 99273485
1968.3 99273485 99261093 99251848 99228686 99216127 99229872 99236059 99214906 99197328 99204528 99215156 99209511 99197632
1992.7 99197632 99194741 99187702 99162865 99143350 99146092 99147010 99131620 99124229 99134451 99139154 99126679 99107105 99085343
2019.2 99085343 99044955 98953503 98861605 98890597 98997277 99048364 99050331 99056822 99066442 99066597 99067062 99076921 99080634
2045.8I9080634j3006j0389N293O312j716k51R549R006m261j0908m321O79p69K986
2074.3I9068838R448O777l553o467K957R876Q023O622Q029O979J437r48L916N651J299
2104.9I9128884l28N889J1015O276j877k027M507N882L708O336J1301Q416j520l034
2133.5I9183428M256N615L129P379J3167Q046l236n227P74K504J412P981J4914P134
2162I9251276r030j4329j627J4120J5700R245R131R179j78m548L028N191n30L493J4013
2192.6I9304134J1092l141p576K051P939K843K897J1581J0538l201j0335j854M995
2219.1I9331963K86J896J3136J0443p927j2863K658J2196N233L028J0460M530j1503
2245.6I9363536r543N704N597o825m029J0765J0067n913j1688N3N222n097k122J3507
$$ plain form
2045.8 99080634 99067628 99057239 99062532 99068844 99067128 99066877 99076426 99085432 99081171 99070263 99065942 99066621 99065852 99068838
2074.3 99068838 99078286 99085063 99081510 99075043 99078000 99087876 99095899 99102521 99110550 99117529 99118966 99118018 99121934 99127585 99128884
2104.9 99128884 99128556 99134445 99145460 99151736 99149859 99147832 99152339 99158221 99161929 99168265 99179566 99187982 99186462 99183428
2133.5 99183428 99187684 99193299 99196428 99203807 99216974 99225020 99221784 99216557 99217331 99219835 99221247 99229228 99244142 99251276
2162 99251276 99242246 99227917 99226290 99240410 99256110 99265355 99274486 99283665 99283487 99278939 99281967 99287158 99286628 99290121 99304134
2192.6 99304134 99315226 99312085 99304509 99306560 99314499 99317342 99320239 99331820 99342358 99339157 99328822 99326968 99331963
2219.1 99331963 99332249 99334145 99347281 99357724 99349797 99336934 99339592 99351788 99357021 99360049 99370509 99375039 99363536
2245.6 99363536 99353993 99359697 99365294 99358469 99354440 99365205 99375272 99369359 99357671 99357724 99362946 99357849 99355727 99369234
2274.2I9369234Q249r298p534O395N514q303q541M732J460j7726k2727j3536j3262
2300.7I9294657k1035k3466k0808k4569l8237m0435k5380k6995m9865n4258l1263j9485
2325.2I8918861l7420m9543k9486r555j7476k2549q505o265n829N1373J04422M6146
2349.7I8934174o9154j19942q5384n5986m4698j9807K0326N8603P6163Q2081R4956
2372.1I8871332R9105Q8149Q5670R1601Q0692N2184K9504K1840J6689M047n662k247
2396.6I9432904L880J204k986K032Q273L094n228l862j007l410K86R680R221j836r084
2427.2I9443161n930k4J198j484j156M756L892o646q821j747Q65O43O616J3555L945
2457.8I9452823j0967r775k337L88J568N739R937M363n079m977j216j794k807J740
$$ plain form
2274.2 99369234 99377483 99368185 99360651 99367046 99372560 99364257 99355716 99360448 99361908 99344182 99321455 99307919 99294657
2300.7 99294657 99273622 99250156 99229348 99204779 99166542 99126107 99100727 99073732 99023867 98969609 98938346 98918861
2325.2 98918861 98881441 98831898 98802412 98792857 98775381 98752832 98744327 98738062 98732233 98783606 98888028 98934174
2349.7 98934174 98865020 98745078 98659694 98603708 98559010 98539203 98559529 98618132 98694295 98776376 98871332
2372.1 98871332 98970437 99058586 99144256 99235857 99316549 99368733 99398237 99420077 99436766 99440813 99435151 99432904
2396.6 99432904 99436784 99437988 99435002 99437034 99445307 99448401 99443173 99439311 99438304 99434894 99435180 99444860 99454081 99452245 99443161
2427.2 99443161 99437231 99437207 99438405 99436921 99435765 99440521 99444413 99437767 99428946 99427199 99428064 99428707 99435323 99448878 99452823
2457.8 99452823 99441856 99432081 99429744 99430132 99431700 99437439 99447376 99451739 99446660 99441683 99440467 99438673 99435866 99437606
2486.3I9437606P958L534q047j0699j996L451l52n4P195N746m816r221m322J610L129
2516.9I9430722M470Q893P064k599r167p111j794j91K378R048P087m697r602l803J49
2547.5I9430847k497j323N072K754o968j0067l130N579N377K074N537M989m291q923
2576I9425030n359k324k265K134R125Q732K587o419j1903n895O14J370M083O122K593
2606.6I9428225k748p165n322K253K771k461k093R0k307l987k587l231k831L499O753
2637.2I9408859J532m637n979m005l159n66O669R120M47j1128j3668o199K939O062
2665.8I9386287K479J2N01k211p552n740L069N836Q3l225J103J222q815j2631l457
2696.4I9356961L231J252R23M518N91j1570j4049k771O717R060N859M12m405j0181
$$ plain form
2486.3 99437606 99445564 99449098 99441051 99430352 99428356 99431807 99431455 99431401 99438596 99444342 99439526 99430305 99425983 99427593 99430722
2516.9 99430722 99435192 99444085 99451149 99448550 99439383 99432272 99430478 99430287 99432665 99441713 99448800 99444103 99434501 99430698 99430847
2547.5 99430847 99428350 99427027 99432099 99434853 99427885 99417818 99414688 99420267 99425644 99427718 99433255 99438244 99433953 99425030
2576 99425030 99419671 99417347 99415082 99417216 99426341 99435073 99437660 99431241 99419338 99413443 99414057 99415427 99419510 99425632 99428225
2606.6 99428225 99425477 99418312 99412990 99415243 99418014 99415553 99413460 99413550 99411243 99407256 99404669 99401438 99398607 99402106 99408859
2637.2 99408859 99410391 99405754 99399775 99395770 99392611 99392045 99398714 99407834 99408281 99397153 99383485 99377286 99380225 99386287
2665.8 99386287 99388766 99388778 99389279 99387068 99379516 99373776 99376845 99382681 99382764 99379539 99380642 99381864 99373049 99360418 99356961
2696.4 99356961 99360192 99361444 99362367 99366885 99367476 99355906 99341857 99339086 99345803 99354863 99360722 99361134 99356729 99346548
2724.9I9346548j1474n471L379M441l690l647J299l636r334l254N090N674M208J431
2753.5I9331564n061j1474j2296n031L034L225J8k51m29k128p862j2761q505j652K832
2784.1I9273223Q171O682n871j3423j0872k795L731k378r960r990r668p891n734r615
2812.6I9203610j0955m411l463r131j3405j5885j4102j0300q380q268j0526j5521k9135
2839.1I9050128m6622n0539m3899m0418m3362m3982l3910j9365l547M536r83m768k158
2865.7I8721111k897n162P27R84j2761j3543K742J1111L242r739j5170j5318j9294
2892.2I8646033k1118j7756j9890k5529k8026k7758k5761k3592j9479j4275k1499m2612
2916.6I8358738n4210m9198l9041k7954m703K9194L7670K2668K3305L7706M3422L9310
$$ plain form
2724.9 99346548 99335074 99329603 99332982 99337423 99333733 99330086 99331385 99327749 99318415 99315161 99320251 99325925 99330133 99331564
2753.5 99331564 99326503 99315029 99302733 99297702 99300736 99303961 99303979 99303728 99303299 99301171 99293309 99280548 99272043 99270391 99273223
2784.1 99273223 99281394 99288076 99282205 99268782 99257910 99255115 99258846 99256468 99246508 99236518 99226850 99218959 99213225 99203610
2812.6 99203610 99192655 99188244 99184781 99175650 99162245 99146360 99132258 99121958 99113578 99105310 99094784 99079263 99050128
2839.1 99050128 99003506 98952967 98909068 98868650 98825288 98781306 98747396 98728031 98724484 98729020 98728037 98723269 98721111
2865.7 98721111 98718214 98713052 98713779 98714763 98702002 98688459 98691201 98702312 98705554 98695815 98680645 98665327 98646033
2892.2 98646033 98624915 98607159 98587269 98561740 98533714 98505956 98480195 98456603 98437124 98422849 98401350 98358738
2916.6 98358738 98304528 98255330 98216289 98188335 98183632 98212826 98250496 98273164 98296469 98334175 98377597 98416907
2941.1I8416907L2729K1475j997k5987l0297k9838l7265l3826j1974J7851L8248M2683
2965.6I8398709M2373N0009O3610O3246M5872L8582L9244K1660M607Q923J3745J5014
2990.1I8805594J6040R185N210j294j3321q685J955k915l141J5354K0373l373k3938
3016.6I8817044k2143j7684k0790k0767j8012j1665j269K402q667k1314j5694n043
3041.1I8656398o646j5533k5248k9070k4575j8829k0039k7841k8336j5318l648Tj6028
3067.6I8421639l0327l2240k4712q559P892M35k2519l3289l5423l7253l4028k9421
3092.1I8142195k7573k4188j8459k1852l9017m7600l1698j5545k0826k6774j6391j1546
3116.5I7840726k6542n2410p0584o0683l3939k2107l3969m7434m3445l2711l7122n6660
$$ plain form
2941.1 98416907 98449636 98471111 98469114 98443127 98412830 98382992 98345727 98311901 98299927 98317778 98356026 98398709
2965.6 98398709 98441082 98491091 98554701 98617947 98663819 98702401 98741645 98763305 98767912 98776835 98790580 98805594
2990.1 98805594 98821634 98830819 98836029 98834735 98821414 98812729 98814684 98811769 98808628 98823982 98844355 98840982 98817044
3016.6 98817044 98794901 98777217 98756427 98735660 98717648 98705983 98704714 98707116 98698449 98677135 98661441 98656398
3041.1 98656398 98649752 98634219 98608971 98579901 98555326 98536497 98516458 98488617 98460281 98444963 98441315 98437667 98421639
3067.6 98421639 98391312 98359072 98334360 98325801 98333693 98334128 98311609 98278320 98242897 98205644 98171616 98142195
3092.1 98142195 98114622 98090434 98071975 98050123 98011106 97963506 97931808 97916263 97895437 97868663 97852272 97840726
3116.5 97840726 97814184 97761774 97691190 97630507 97596568 97574461 97540492 97493058 97449613 97416902 97379780 97323120
3141I7323120o1548m8739m3511l9458l2819m5228o7937p3379o4421n5438n4527o2704
3165.5I6673411o6292o4850p0119p3349o5613o0749o7884p5477p4745p3623p9847q4853
3189.9I5816010q0472p8905q8280r3716q8549q7541r5749r3437p8171p3230q3858r3204
3214.4I4780898q9931q7005r8187j10459j03760q4180p6550p8517p9876r2900j06418
3236.9I3773115j02026r0092p9584p6449q2278q6958q1807p0566o9243p6139p5876
3259.3I2882097p2992p2593o7347n4115m4715o0535q6510r3067q8274q6069q6922q4483
3283.8I1984475q4359q9246q2069p7445r7435j19287j24646j20276j04868q8930j03081
3306.2I0892833j44672j74588j74779j61200j55914j64318j72574j67059j61875j80501
$$ plain form
3141 97323120 97261572 97212833 97169322 97129864 97097045 97051817 96983880 96910501 96846080 96790642 96736115 96673411
3165.5 96673411 96607119 96542269 96472150 96398801 96333188 96272439 96204555 96129078 96054333 95980710 95900863 95816010
3189.9 95816010 95735538 95656633 95568353 95474637 95386088 95298547 95202798 95109361 95031190 94957960 94874102 94780898
3214.4 94780898 94690967 94603962 94505775 94395316 94291556 94207376 94130826 94052309 93972433 93879533 93773115
3236.9 93773115 93671089 93580997 93501413 93424964 93342686 93255728 93173921 93103355 93034112 92957973 92882097
3259.3 92882097 92809105 92736512 92669165 92615050 92570335 92509800 92423290 92330223 92241949 92155880 92068958 91984475
3283.8 91984475 91900116 91810870 91728801 91651356 91553921 91434634 91309988 91189712 91084844 90995914 90892833
3306.2 90892833 90748161 90573573 90398794 90237594 90081680 89917362 89744788 89577729 89415854 89235353
3326.6H9235353k04241k09093k03788j94097j88136j99056k14582k23518k32958k30575
3347H7135309k17676k30622k61331k66320k44850k27612k30956k36565k21860k08593
3367.4H4788924k29001k63178k62940k28906k02387j95474j99174k01321j91122j68848
3387.8H2646573j40644j37835j67710j71834j32555j11508j44828j81067j63674j25349
3408.2H1169569j10840j12135j16217j14715j05250j02383r9670p7486m8894l2455
3428.6H0249524k9510k6232j5897j9622l3515k3097O145K5517K8211K4408L2073M5711
3453.1H0263716N6326P7349R8312R2042Q5282J08618J25962J00762O4951P3206J07199
3475.5H1253725J30606J37073J16646R9659J12277J22965J28120J38849J40118J39767
$$ plain form
3326.6 89235353 89031112 88822019 88618231 88424134 88235998 88036942 87822360 87598842 87365884 87135309
3347 87135309 86917633 86687011 86425680 86159360 85914510 85686898 85455942 85219377 84997517 84788924
3367.4 84788924 84559923 84296745 84033805 83804899 83602512 83407038 83207864 83006543 82815421 82646573
3387.8 82646573 82505929 82368094 82200384 82028550 81895995 81784487 81639659 81458592 81294918 81169569
3408.2 81169569 81058729 80946594 80830377 80715662 80610412 80508029 80408359 80330873 80281979 80249524
3428.6 80249524 80220014 80193782 80177885 80158263 80124748 80101651 80107796 80133313 80161524 80185932 80218005 80263716
3453.1 80263716 80320042 80397391 80495703 80587745 80673027 80781645 80907607 81008369 81073320 81146526 81253725
3475.5 81253725 81384331 81521404 81638050 81737709 81849986 81972951 82101071 82239920 82380038 82519805
3495.9H2519805J47236J57249J56504J35290J21922J33520J48821J57338J55294J45817
3516.3H3978796J48529J73068K05165K01523J60343J34146J43862J70350J87027J77181
3536.7H5679990J62476J86289K27529K19655J67733J52671J77116J86574J86592K02710
3557.1H7549335K23219K33561K48212K59590K21967J63389J64169K02095K28244K36959
3577.5H9730740K52640K75844K95764L01332K54798K05451K24930K56926K61932K63185
3597.9I2323542K57688K46442K64174L00431L07423K75057K56711K58631K50870K31802
3618.3I4972771J95432J82748K31487K88605K74027J67369J05972J21581J48034J70851
3638.7I6858877J86258K08545K60335L00539K23029M3332r882M5919P0614N6636N8544
$$ plain form
3495.9 82519805 82667041 82824290 82980794 83116084 83238006 83371526 83520347 83677685 83832979 83978796
3516.3 83978796 84127325 84300393 84505558 84707081 84867424 85001570 85145432 85315782 85502809 85679990
3536.7 85679990 85842466 86028755 86256284 86475939 86643672 86796343 86973459 87160033 87346625 87549335
3557.1 87549335 87772554 88006115 88254327 88513917 88735884 88899273 89063442 89265537 89493781 89730740
3577.5 89730740 89983380 90259224 90554988 90856320 91111118 91316569 91541499 91798425 92060357 92323542
3597.9 92323542 92581230 92827672 93091846 93392277 93699700 93974757 94231468 94490099 94740969 94972771
3618.3 94972771 95168203 95350951 95582438 95871043 96145070 96312439 96418411 96539992 96688026 96858877
3638.7 96858877 97045135 97253680 97514015 97814554 98037583 98080915 98071033 98116952 98187566 98244202 98302746
3661.1I8302746P9435J24317J69802J59001J07193Q4836L5077n7733o8206k1493M7326
3683.5I8962301J31547J73718Q7047n2381p0661j1867L5482M8650K9218J7470O1172
3706I9411696J16223J00178J454o4486m1497J1093M7934M0763L445j4478J6314Q5223
3730.4I9713862J32978P7772l2353n0903Q488M9746M8119L6907J5384n3221j04803
3752.9I9841976o2811j3769j7667l2323o873J8579J1730r715l3766l3254O116M5538
3777.3I9713761K7775k9659m5490k5219j1623l385J9985N6285Q0454P7677N0872j01
3801.8I9911332l8028m0018n3978m1610K6494P1299N9927L9887J0789n0229p0095l7587
3826.3I9788183m160K7459N8753P4792N4973n704o1667q1152o8331q267Q2070J32662
$$ plain form
3661.1 98302746 98382181 98506498 98676300 98835301 98942494 99027330 99062407 99004674 98936468 98914975 98962301
3683.5 98962301 99093848 99267566 99354613 99302232 99231571 99219704 99255186 99303836 99333054 99350524 99411696
3706 99411696 99527919 99628097 99629551 99565065 99523568 99534661 99582595 99623358 99626803 99612325 99628639 99713862
3730.4 99713862 99846840 99924612 99892259 99841356 99849844 99899590 99947709 99984616 100000000 99946779 99841976
3752.9 99841976 99779165 99765396 99747729 99715406 99708533 99727112 99738842 99729127 99695361 99662107 99668223 99713761
3777.3 99713761 99741536 99711877 99666387 99641168 99629545 99626160 99646145 99702430 99782884 99860561 99911433 99911332
3801.8 99911332 99873304 99833286 99779308 99737698 99764192 99835491 99895418 99935305 99946094 99895865 99825770 99788183
3826.3 99788183 99784023 99811482 99870235 99945027 100000000 99994296 99932629 99851477 99783146 99774879 99856949 99989611
3850.8I9989611N8263q6903r8908k9737L4273M4453O270k414J7751J567m2093n2928
3875.2I9839205j3429L6710L6991M738j4782k0343j0490j3828k3115J0598O0868P2676
3899.7I9965799L4201k6333p8231p5180k9319K0110L9798L1716J6767O068M935N871
3924.2I9916202O866J7613J6797p546j8245l564J4013K6309K4116P439l34J538m53
3950.7A00000751K432J3041J5474J2934J2076K789m637M721J5771J2434R203J3399
3975.2A00110388J2374N388O115J7286J3923L243J0991K2423K0719P832o974
3997.6A00223708
$$ plain form
3850.8 99989611 100047874 99960971 99862063 99832326 99866599 99911052 99917322 99914908 99932659 99934226 99892133 99839205
3875.2 99839205 99825776 99862486 99899477 99904215 99889433 99869090 99858600 99844772 99821657 99832255 99893123 99965799
3899.7 99965799 100000000 99973667 99895436 99820256 99790937 99811047 99850845 99882561 99899328 99905396 99910331 99916202
3924.2 99916202 99923068 99940681 99957478 99949932 99931687 99928123 99942136 99968445 99992561 100000000 99999666 100001204 100000751
3950.7 100000751 100003183 100016224 100031698 100044632 100056708 100059497 100054860 100059581 100075352 100087786 100096989 100110388
3975.2 100110388 100122762 100128150 100134265 100151551 100165474 100168717 100179708 100202131 100222850 100230682 100223708
3997.6 100223708
##END=$$ End of the data block
