##TITLE=$$ Begin of the data block
##JCAMP-DX=5.00 $$ ACD/SpecManager v 10.08
##SPECTROMETER/DATA SYSTEM=Varian
##DATE=02 Apr 2013 14:57:24
##DATA TYPE=INFRARED SPECTRUM
##DATA CLASS=XYDATA
##ORIGIN=
##OWNER=
##NPOINTS=3735
##FIRSTX=399.26403809
##LASTX=4000.35498047
##MAXX=4000.35498047
##MINX=399.26403809
##MAXY=68.70892334
##MINY=29.81811905
##XFACTOR=1.0000000000
##YFACTOR=0.000000100000000
##FIRSTY=40.42041779
##DELTAX=0.96440572
##XUNITS=1/CM
##YUNITS=TRANSMITTANCE
##XYDATA=(X++(Y..Y))
$$ plain form
399.3 404204178 375615883 420499763 362226181 451652412 551805458 588176842 523344269
406 523344269 385568390 358800240 404701233 527971916 555583954 517096748 495711212
412.8 495711212 475274467 477372971 451269341 464631805 481562920 455886307 687089233
419.5 687089233 620601501 498085899 363616982 352173996 498188896 593260078 604759674
426.3 604759674 511635437 434636917 467210999 501253777 479354057 456504250 459213295 475337906
434 475337906 486733360 492798195 459223518 427419319 452039223 454664192 462931786 565392685
441.7 565392685 603351898 498064995 450535088 453820839 467439919 475733376 509202576 523533249
449.4 523533249 512862930 497499657 441879768 452384987 464855156 418196831 402299957
$$ packed form
399.3D04204178k8588295M4883880n8273582Q9426231J00153046L6371384o4832573
406E23344269j37775879k6768150M5900993J23270683K7612038l8487206k1385536
412.8D95711212k0436745K098504k6103630J3362464J6931115k5676613K31202926
419.5F87089233o6487732j22515602j34468917j1442986J46014900R5071182J1499596
426.3F04759674r3124237p6998520L2574082L4042778k1899720k2849807K709045J6124611
434D75337906J1395454O064835l3574677l1804199K4619904K624969Q267594J02460899
441.7E65392685L7959213j05286903m7529907L285751J3619080Q293457L3469200J4330673
449.4E23533249j0670319j5363273n5619889J0505219J2470169m6658325j5896874
$$ plain form
456.2 402299957 363537483 394996948 481862450 510583000 511902657 458406029 428056602 406504402
463.9 406504402 448668518 516133232 487188492 487871170 493927269 470873184 479349251 510258713
471.6 510258713 523485756 491264458 458242378 437979431 489755211 488230591 424500542 435605621
479.3 435605621 451867676 435181961 403987885 393929787 424109268 443088799 457930527
486.1 457930527 475825310 456729240 443935966 493036842 491625061 451322174 472272568 476226730
493.8 476226730 487914352 531772156 518459587 452784615 436308441 453216286 475141602
500.5 475141602 517035561 485564346 435379028 406292114 393797417 433717308 442585983 451225929
508.2 451225929 496711960 521657028 517218819 493160553 460151367 440504417 441755219 448227272
$$ packed form
456.2D02299957l8762474L1459465Q6865502K8720550J319657n3496628l0349427k1552200
463.9D06504402M2164116O7464714k8944740O82678O056099k3054085Q476067L0909462
471.6E10258713J3227043l2221298l3022080k0262947N1775780j524620o3730049J1105079
479.3D35605621J6262055j6685715l1194076j0058098L0179481J8979531J4841728
486.1D57930527J7894783j9096070j2793274M9100876j411781m0302887K0950394L954162
493.8D76226730J1687622M3857804j3312569o5674972j6476174J6907845K1925316
500.5D75141602M1893959l1471215n0185318k9086914j2494697L9919891Q868675Q639946
508.2D51225929M5486031K4945068m438209k4058266l3009186j9646950J250802O472053
$$ plain form
516 448227272 450795555 445491371 465738487 465620575 457939415 475640640 452283020 452973709 473653717
524.6 473653717 464111176 488886642 505479660 485199051 462987175 453450279 440764427 432286949
532.4 432286949 440434837 451714363 451760635 451990662 466606636 461552887 444773369 439251404
540.1 439251404 453615494 473696442 475358009 483329201 478247452 460522308 463518410 480799065
547.8 480799065 480540314 455513878 447002411 442532959 453228836 467658539 455415726 448686829
555.5 448686829 450686455 466997414 466002426 449376678 454073067 456085434 440141296 436378326
563.2 436378326 472664986 486339798 467614288 460781708 455006180 458147469 452003441 450389977
570.9 450389977 464502144 463184357 453789024 450637207 453328629 455329018 457882309 455985413
$$ packed form
516D48227272K568283n304184K0247116j17912p681160J7701225k3357620O90689K0680008
524.6D73653717r542541K4775466J6593018k0280609k2211876r536896j2685852q477478
532.4D32286949Q147888J1279526M6272K30027J4615974n053749j6779518n521965
540.1D39251404J4364090K0080948J661567P971192n081749j7725144K996102J7280655
547.8D80799065k58751k5026436q511467m469452J0695877J4429703j2242813o728897
555.5D48686829J999626J6310959r94988j6625748M696389K012367j5944138l762970
563.2D36378326L6286660J3674812j8725510o832580n775528L141289o144028j613464
570.9D50389977J4112167j317787r395333l151817K691422K000389K553291j896896
$$ plain form
578.6 455985413 453691673 462367630 472653427 468672066 457396927 460835228 467476654 466464157
586.4 466464157 459020767 454677925 458285103 451885605 451269226 454314995 450039444 448852348 446720200
595 446720200 458175316 470749435 469840431 472150497 469107246 460524025 459482536 459717712 459552765
603.7 459552765 466247101 471091690 458227386 443964310 444308701 451197662 457949829 456343727
611.4 456343727 455809212 457693634 455498962 458839111 466318436 473204956 466984138 461448174 465870590
620.1 465870590 464481583 460582886 441619644 428895836 442727585 452143974 447007866 440564575
627.8 440564575 451854477 460586357 451789589 452867165 461946907 465108223 454653320 449161072
635.5 449161072 458100510 460209694 465236320 470525742 464517899 460750046 464621620 467468567
$$ packed form
578.6D55985413k293740Q675957J0285797l981361j1275139L438301O641426j012497
586.4D66464157p443390m342842L607178o399498o16379L045769m275551j187096k132148
595D46720200J1455116J2574119r09004K310066l043251q583221j041489K35176j64947
603.7D59552765O694336M844589j2864304j4263076L44391O888961O752167j606102
611.4D56343727n34515J884422k194672L340149P479325O886520o220818n535964M422416
620.1D65870590j389007l898697j8963242j2723808J3831749R416389n136108o443291
627.8D40564575J1289902Q731880q796768J077576R079742L161316j0454903n492248
635.5D49161072Q939438K109184N026626N289422o007843l767853L871574K846947
$$ plain form
643.3 467468567 457439117 449979973 461926193 471986351 469148140 463316231 456634102 457098961
651 457098961 464380760 465625687 456507492 445011444 444689178 459596939 474501953 471984100
658.7 471984100 463373642 464774246 470899048 471755676 460164070 452269516 458983574 465321159
666.4 465321159 481350746 494597015 448060837 443422661 457163849 466501961 469682007 466481514
674.1 466481514 458212204 452432899 456152840 461290855 459008675 458232765 458597260 459741249 463860474
682.8 463860474 465157204 465194931 468184128 471995430 468170052 458075066 456023636 456814651 450270729
691.5 450270729 448756981 452030602 453715935 451834946 446075211 449653816 457798767 460172348
699.2 460172348 460012398 459236031 458300171 454105301 454838905 459713364 458863907 455343399 454476509
$$ packed form
643.3D67468567j0029450p459144J1946220J0060158k838211n831909o682129M64859
651D57098961P281799J244927r118195j1496048l22266J4907761J4905014k517853
658.7D71984100q610458J400604O124802Q56628j1591606p894554O714058O337585
666.4D65321159J6029587J3246269m6536178m638176J3741188R338112L180046l200493
674.1D66481514q269310n779305L719941N138015k282180p75910L64495J143989M119225
682.8D63860474J296730L7727K989197L811302l825378j0094986k051430P91015o543922
691.5D50270729j513748L273621J685333j880989n759735L578605Q144951K373581
699.2D60172348j59950p76367r35860m194870P33604M874459q49457l520508q66890
$$ plain form
707.9 454476509 460639839 460174637 447740822 446616783 458118706 464384079 463223648 461722031
715.6 461722031 463519707 462277641 456064758 454546852 455532074 455361633 454759903 453375473 450966949
724.3 450966949 448804550 450015678 447216377 450372887 464934273 471801147 466509590 455179520
732 455179520 453395424 459379272 458933830 456131401 453855667 451941872 451126785 456899452 461367035
740.7 461367035 457739029 457818832 457238884 457949066 463537178 460804138 454073181 450581093 448986855
749.3 448986855 450732346 451026154 452060013 456577606 459047050 461800117 466499367 467289314 454565125
758 454565125 441502838 447006569 456007538 454481239 449862213 451319504 450813980 447826462 453617516
766.7 453617516 456865196 454607048 455650330 456332245 451079750 448668823 455913353 459286919 453866882
$$ packed form
707.9D54476509O163330m65202j2433815j124039J1501923O265373j160431j501617
715.6D61722031J797676j242066o212883j517906R85222j70441o01730j384430k408524
724.3D50966949k162399J211128k799301L156510J4561386O866874n291557j1330070
732D55179520j784096N983848m45442k802429k275734j913795q15087N772667M467583
740.7D61367035l628006P9803n79948P10182N588112k733040o730957l492088j594238
749.3D48986855J745491K93808J033859M517593K469444K753067M699250P89947j2724189
758D54565125j3062287N503731R000969j526299m619026J457291n05524k987518N791054
766.7D53617516L247680k258148J043282O81915n252495k410927P244530L373566n420037
$$ plain form
775.4 453866882 451675224 459516220 462983513 459098740 455924377 449605408 450614929 453847122
783.1 453847122 449938011 451480942 457627792 457673340 451428795 445102768 443206978 450399094 454668312
791.8 454668312 451187248 451734428 448492012 443175049 450785217 461260681 457685547 454525642
799.5 454525642 458890305 458354836 457378883 455729294 452940598 448838348 444486771 446883926 448664169
808.2 448664169 449121666 451203804 451313057 452636452 455842552 456582947 454801331 450605202 448268166
816.9 448268166 451117096 449715233 447404404 451337738 454579239 450571442 449532318 459751205
824.6 459751205 463129692 458910599 455349159 453447723 457416000 459269753 459128532 458831749 459013138
833.3 459013138 457675858 451414261 449732933 450959663 450847397 450809402 449559441 447565956 444961472
$$ packed form
775.4D53866882k191658P840996L467293l884773l174363o318969J009521L232193
783.1D53847122l909111J542931O146850M5548o244545o326027j895790P192116M269218
791.8D54668312l481064N47180l242416n316963P610168J0475464l575134l159905
799.5D54525642M364663n35469r75953j649589k788696m102250m351577K397155J780243
808.2D48664169M57497K082138J09253J323395L206100P40395j781616m196129k337036
816.9D48268166K848930j401863k310829L933334L241501m007797j039124J0218887
824.6D59751205L378487m219093l561440j901436L968277J853753j41221k96783J81389
833.3D59013138j337280o261597j681328J226730j12266l7995j249961j993485k604484
$$ plain form
841.9 444961472 442077827 440727081 442882423 449147720 452471657 446532211 446768303 453019714 453910484
850.6 453910484 454799728 448357162 445835152 452322426 451420174 452402229 452404404 453256302 462288933
859.3 462288933 462709656 453963356 445007629 443727226 450821838 454532967 454973831 449862366 444171524
868 444171524 446761017 447902451 449981499 453310890 452666969 450757217 445956841 447829628 451959801
876.7 451959801 448100204 446797791 447370911 449542389 452136574 449328232 448749046 449101486 448033104
885.3 448033104 450402184 451068077 446453438 443489647 447386894 450482559 450106621 449690323 445881538
894 445881538 445959244 452190971 455839806 455085220 454537201 454927788 448755035 447396736 451979103
902.7 451979103 450191765 451552353 451176529 445193405 441513443 444383278 450950623 448746529 448509483
$$ packed form
841.9D44961472k883645j350746K155342O265297L323937n939446K36092O251411Q90770
850.6D53910484Q89244o442566k522010O487274r02252R82055K175Q51898R032631
859.3D62288933M20723q746300q955727j280403P094612L711129M40864n111465n690842
868D44171524K589493J141434K079048L329391o43921j909752m800376J872787M130173
876.7D51959801l859597j302413N73120K171478K594185k808342n79186L52440j068382
885.3D48033104K369080O65893m614639k963791L897247L095665l75938m16298l808785
894D45881538P7706O231727L648835p54586n48019L90587o172753j358299M582367
902.7D51979103j787338J360588l75824n983124l679962K869835O567345k204094k37046
$$ plain form
911.4 448509483 451026726 445634499 441791382 441190643 444305077 447704964 447262459 446913109 448571739
920 448571739 452743340 451817513 448465919 449566689 448060608 441479530 437744598 442924881 449950447
928.7 449950447 450873108 445199852 440135269 440927734 439796677 438201065 439628105 442558098 446834106
937.4 446834106 447997208 446881142 443784485 441481133 442163200 442860909 444338036 441812096 438500900
946.1 438500900 439132347 440701675 442547531 441147537 441326485 445357170 445383720 440642204 438110695
954.8 438110695 439027176 436208687 433798447 436258507 438802185 439358253 438197327 437910385 438405838
963.4 438405838 440116196 439179764 433606033 432337723 433744736 434476891 436422653 438567772 439766808
972.1 439766808 435670204 430581627 429939156 430245132 432945900 437606812 439363480 438074379 434836807
$$ packed form
911.4D48509483K517243n392227l843117o00739L114434L399887m42505l49350J658630
920D48571739M171601r25827l351594J100770j506081o581078l734932N180283P025566
928.7D49950447R22661n673256n064583P92465j131057j595612J427040K929993M276008
937.4D46834106J163102j116066l096657k303352O82067O97709J477127k525940l311196
946.1D38500900O31447J569328J845856j399994J78948M030685K6550m741516k531509
954.8D38110695R16481k818489k410240K460060K543678N56068j160926k86942M95453
963.4D38405838J710358r36432n573731j268310J407013P32155J945762K145119J199036
972.1D39766808m096604n088577o42471L05976K700768M660912J756668j289101l237572
$$ plain form
980.8 434836807 431984406 430324821 430296974 433641586 433896446 433596191 436034012 430688324 426728973
989.5 426728973 429952240 431075439 431107216 431528091 433610840 432565269 430159950 430308685 426416054
998.2 426416054 423740311 427046776 432387505 432157288 428535309 428840752 427560310 426725311 427452888
1006.8 427452888 427124023 429251785 431003685 428098221 425236168 425885887 425560875 427475967 430114594
1015.5 430114594 430221596 431871605 431114349 428791885 427776909 426827431 423128433 422546539 428617249
1024.2 428617249 428172112 425197487 424319267 420813179 419971428 421927872 424256096 425630226 426636696
1032.9 426636696 428324699 425146637 420621910 422599907 421964226 419593048 424526062 426813736
1040.6 426813736 423400078 421077957 423110390 423904343 421259232 422485580 421607475 420401192 423294487
$$ packed form
980.8D34836807k852401j659585k7847L344612K54860l00255K437821n345688l959351
989.5D26728973L223267J123199L1777M20875K082749j045571k405319J48735l892631
998.2D26416054k675743L306465N340729k30217l621979L05443j280442q34999P27577
1006.8D27452888l28865K127762J751900k905464k862053O49719l25012J915092K638627
1015.5D30114594J07002J650009p57256k322464j014976r49478l698998n81894O070710
1024.2D28617249m45137k974625q78220l506088q41751J956444K328224J374130J006470
1032.9D26636696J688003l178062m524727J977997o35681k371178M933014K287674
1040.6D26813736l413658k322121K032433P93953k645111J226348q78105j206283K893295
$$ plain form
1049.3 423294487 422162094 419757729 422899590 425686340 423042068 422625961 423373566 421142654 421200638
1058 421200638 425821648 427515030 422508774 421871071 423711433 423600502 423824730 420587387 418520088
1066.6 418520088 420110931 419292984 415226898 413096123 413611298 416227951 417231522 415254707 419480515
1075.3 419480515 423734818 420856972 416878548 415870552 420749321 427292519 427675362 421727753
1083 421727753 419521332 423366280 423680000 418176727 415209732 418684540 421873436 424646416 426515846
1091.7 426515846 424875565 421848755 417649918 417607994 419746323 418500443 419304085 419590569 415010605
1100.4 415010605 414138908 416024284 415368347 416258354 419902802 424635773 424296532 419587212 417152405
1109.1 417152405 415812111 416922722 418811531 419815712 420279922 418851967 418522453 419544029 419104691
$$ packed form
1049.3D23294487j132393k404365L141861K786750k644272m16107P47605k230912N7984
1058D21200638M621010J693382n006256o37703J840362j10931K24228l237343k067299
1066.6D18520088J590843q17947m066086k130775N15175K616653J003571j976815M225808
1075.3D19480515M254303k877846l978424j007996M878769O543198L82843n947609
1083D21727753k206421L844948L13720n503273k966995L474808L188896K772980J869430
1091.7D26515846j640281l026810m198837m1924K138329j245880Q03642K86484m579964
1100.4D15010605q71697J885376o55937Q90007L644448M732971l39241m709320k434807
1109.1D17152405j340294J110611J888809J004181M64210j427955l29514J021576m39338
$$ plain form
1117.7 419104691 416099091 415403557 417574348 415680885 413366737 415576172 417689056 418550224 419422569
1126.4 419422569 417259827 413856964 412852249 413409958 415961266 417237663 415975876 418121262
1134.1 418121262 419134598 416254578 418018951 419900589 417373199 416718102 417630424 419462891 420385208
1142.8 420385208 418283691 418877983 420604744 419092484 419091682 419793358 417084503 414602165 416702347
1151.5 416702347 420329628 419325104 418442535 420440178 421407242 422720833 424181023 425096436 422627869
1160.2 422627869 417910995 416506691 417447701 418577309 416633301 416611710 420155487 420222473 418544807
1168.9 418544807 416399460 415890617 417654915 418769379 420643349 423309593 423445930 420487213 419633484
1177.5 419633484 419968567 419367905 420960503 421983070 420312004 418734055 420780754 425021477 426885147
$$ packed form
1117.7D19104691l005600o95534K170791j893463k314148K209435K112884Q61168Q72345
1126.4D19422569k162742l402863j004715N57709K551308J276397j261787K145386
1134.1D18121262J013336k880020J764373J881638k527390o55097R12322J832467R22317
1142.8D20385208k101517N94292J726761j512260q02P01676k708855k482338K100182
1151.5D16702347L627281j004524q82569J997643R67064J313591J460190R15413k468567
1160.2D22627869m716874j404304R41010J129608j944008k1591L543777O6986j677666
1168.9D18544807k145347n08843J764298J114464J873970K666244J36337k958717q53729
1177.5D19633484L35083o00662J592598J022567j671066j577949K046699M240723J863670
$$ plain form
1186.2 426885147 425666847 422055321 420577011 421793671 421568565 421993179 423529968 423555984 421291084
1194.9 421291084 419753990 421210365 420839806 420449409 423174324 424427032 423173904 421069412 421185112
1203.6 421185112 423216705 423588142 422156029 420954132 421611137 421891403 421952820 423800812 425295334
1212.3 425295334 424454041 423035393 422043076 421757355 424206047 425720444 424178963 423787384 425610886
1220.9 425610886 425171394 422953911 424122887 423528976 422104912 423891640 425620689 427109604 426719551
1229.6 426719551 427701263 428129807 424529533 422365036 422693863 424977493 425362892 424694481 425671272
1238.3 425671272 425835304 426541252 427575645 428051949 426925163 425116158 424973068 425215149 426135559
1247 426135559 428267899 428727188 427215118 427064514 426172295 424489059 425858040 428812675 430405045
$$ packed form
1186.2D26885147j218300l611526j478310J216660k25106M24614J536789K6016k264900
1194.9D21291084j537094J456375l70559l90397K724915J252708j253128k104492J15700
1203.6D21185112K031593L71437j432113j201897O57005K80266O1417J847992J494522
1212.3D25295334q41293j418648r92317k85721K448692J514397j541481l91579J823502
1220.9D25610886m39492k217483J168976n93911j424064J786728J729049J488915l90053
1229.6D26719551R81712M28544l600274k164497L28827K283630L85399o68411R76791
1238.3D25671272J64032P05948J034393M76304j126786j809005j43090K42081R20410
1247D26135559K132340M59289j512070j50604q92219j683236J368981K954635J592370
$$ plain form
1255.7 430405045 429882927 429373856 428828964 427081871 425323715 424081306 423221016 424523773 426823616
1264.3 426823616 425826797 425520439 428048630 428830223 427420502 427088318 428719559 429232903 429368591
1273 429368591 428710365 427878571 428822327 429438629 430765114 430893745 430144653 430821991 432013626 434010048
1282.7 434010048 433288383 430684624 429613419 429599457 429129181 428098183 429755516 432001877 431620102
1291.3 431620102 430618172 429754753 429589500 430760345 431362610 430473099 429762802 430496216 430619659
1300 430619659 430112152 431631546 432879105 432335854 431518707 431139183 430684891 431197166 432995110
1308.7 432995110 432138214 431468964 431450653 430082436 430359917 430005989 429183502 428707085 429379654 431938095
1318.3 431938095 433331604 432544899 430811005 431201859 432241249 430936127 428684921 429128723 430972099
$$ packed form
1255.7D30405045n22118n09071n44892j747093j758156j242409q60290J302757K299843
1264.3D26823616r96819l06358K528191P81593j409721l32184J631241N13344J35688
1273D29368591o58226q31794R43756O16302J326485J28631p49092O77338J191635J996422
1282.7D34010048p21665k603759j071205j3962m70276j030998J657333K246361l81775
1291.3D31620102j001930q63419j65253J170845O02265q89511p10297P33414J23443
1300D30619659n07507J519394J247559n43251q17147l79524m54292N12275J797944
1308.7D32995110q56896o69250j8311j368217K77481l53928q22487m76417O72569K558441
1318.3D31938095J393509p86705j733894L90854J039390j305122k251206M43802J843376
$$ plain form
1327 430972099 429749298 429104767 429383087 429615097 429761353 428279533 427895088 428608818 430619354
1335.7 430619354 431548920 430420265 430912971 431775665 432758408 432182350 431796761 432037086 431788750
1344.4 431788750 431925163 431013412 430613823 430217171 429364166 429546852 429402313 430236588 431176758 430041847
1354 430041847 428568001 429382439 430314445 429037704 428890572 430145340 430753098 430482788 428965111
1362.7 428965111 427494812 427533417 428656845 429919777 430790558 431158562 428758850 426885262 428089828
1371.4 428089828 429716949 428521614 426507721 427577095 428529358 429145966 428002357 425883980 425954819
1380.1 425954819 427122231 428131409 427495003 426314468 424974632 424378433 426605835 428164597 427395439
1388.7 427395439 427575569 428241119 427745171 427179489 427621078 427702827 426947556 426689873 428215904 428085594
$$ packed form
1327D30972099j222801o44531K78320K32010J46256j481820l84445P13730K010536
1335.7D30619354R29566j128655M92706Q62694R82743n76058l85589K40325k48336
1344.4D31788750J36413r11751l99589l96652q53005J82686j44539Q34275R40170j134911
1354D30041847j473846Q14438R32006j276741j47132J254768O07758k70310j517677
1362.7D28965111j470299L8605J123428J262932Q70781L68004k399712j873588J204566
1371.4D28089828J627121j195335k013893J069374R52263O16608j143609k118377P0839
1380.1D25954819J167412J009178o36406j180535j339836n96199K227402J558762p69158
1388.7D27395439J80130O65550m95948n65682M41589Q1749p55271k57683J526031j30310
$$ plain form
1398.4 428085594 424732780 424177475 424729958 425317001 425574760 426384964 426869965 426342354 426263237 425541420
1408 425541420 425402374 425009727 425255356 426076775 425297737 424765053 424278374 423695297 423646889 425947876
1417.7 425947876 429561119 426484985 422966232 423798027 425546799 425887985 423050194 422181053 422592163
1426.3 422592163 422558708 423264999 423575439 422659569 421936569 421347351 421875496 422275848 421707268 420577888
1436 420577888 419792709 422309799 423184929 422812805 422283020 422434464 422378349 421775513 422110977 422171326
1445.6 422171326 421608200 422121620 422766571 422942314 423109589 422257843 421377831 420598183 420052719 420381813
1455.3 420381813 417073021 409368439 413021927 418812866 420651016 420804138 420650253 420758743 422909966
1464 422909966 424139938 421617889 420066795 420445671 421963806 421184158 421689682 422396927 420914879
$$ packed form
1398.4D28085594l352814n55305N52483N87043K57759Q10204M85001n27611p9117p21817
1408D25541420j39046l92647K45629Q21419p79038n32684m86679n83077m8408K300987
1417.7D25947876L613243l076134l518753Q31795J748772L41186k837791q69141M11110
1426.3D22592163l3455P06291L10440r15870p23000n89218N28145M00352n68580j129380
1436D20577888p85179K517090Q75130l72124n29785J51444n6115o02836L35464O0349
1445.6D22171326n63126N13420O44951J75743J67275q51746q80012p79648n45464L29094
1455.3D20381813l308792p704582L653488N790939J838150J53122j53885J08490K151223
1464D22909966J229972k522049j551094L78876J518135p79648N05524P07245j482048
$$ plain form
1472.6 420914879 421197166 421092606 422444878 419992599 419317017 420649719 420492554 421573410 421776314
1481.3 421776314 420312347 420776100 423057098 423134842 421922188 420325279 418417969 420401268 419648132
1490 419648132 416709557 418887177 421982841 423051338 421895485 422206230 420804443 420626221 418924255
1498.7 418924255 418993721 422582169 422695923 420820503 419145126 418525734 416856613 416974564 424759598
1507.3 424759598 418932228 419916916 420209846 419211578 417606201 417168694 418944931 418813744 418669472
1516 418669472 420267868 421440887 421318665 421729546 421117935 413969421 413557510 415031853 415275764
1524.7 415275764 414873962 416841888 417861137 414525146 414838524 417189827 419005089 420379639 420730820
1533.4 420730820 419294319 417520065 416271210 416510544 418513870 421215935 416470413 418649750
$$ packed form
1472.6D20914879K82287j04560J352272k452279o75582J332702j57165J080856K02904
1481.3D21776314j463967M63753K280998P7744j212654j596909j907310J983299p53136
1490D19648132k938575K177620L095664J068497j155853L10745j401787j78222j701966
1498.7D18924255O9466L588448J13754j875420j675377o19392j669121J17951P785034
1507.3D24759598n827370R84688K92930r98268j605377m37507J776237j31187j44272
1516D18669472J598396J173019j22222M10881o11611p148514m11911J474343K43911
1524.7D15275764m01802J967926J019249l335991L13378K351303J815262J374550L51181
1533.4D20730820j436501j774254j248855K39334K003326K702065m745522K179337
$$ plain form
1541.1 418649750 419902115 415085487 412726440 412012329 412155724 412922440 414200211 415906296 416456032
1549.8 416456032 414604111 414150085 415492363 415683441 411536827 411829758 413607483 414980087 416085892
1558.5 416085892 409774857 409654503 414717712 416125870 415977554 417849884 414660454 411933861 413759079
1567.1 413759079 412807083 411027565 411796227 413822021 414387550 413801918 414497414 415379791 416508598
1575.8 416508598 411994553 410133514 411205788 412297478 412343063 411878319 412573624 412014732 410832596
1584.5 410832596 411053619 411187286 410881805 410768051 411194916 411991539 412267456 411521797 411973534 411945953
1594.1 411945953 410139236 410681038 411688805 412158241 413093491 412088585 409719505 409385529 410019302
1602.8 410019302 410745926 410838127 409333115 408750801 408858032 410197182 410913010 408920212 407722168
$$ packed form
1541.1D18649750J252365m816628k359047p14111J43395P66716J277771J706085N49736
1549.8D16456032j851921m54026J342278J91078m146614K92931J777725J372604J105805
1558.5D16085892o311035j20354N063209J408158j48316J872330l189430k726593J825218
1567.1D13759079r51996j779518P68662K025794N65529n85632O95496Q82377J128807
1575.8D16508598m514045j861039J072274J091690M5585m64744O95305n58892j182136
1584.5D10832596K21023J33667l05481j13754M26865P96623K75917p45659M51737k7581
1594.1D11945953j806717N41802J007767M69436R35250j004906k369080l33976O33773
1602.8D10019302P26624R2201j505012n82314J07231J339150P15828j992798j198044
$$ plain form
1611.5 407722168 405903320 404762573 404099960 404713860 406734657 401741676 400955200 401909180 403233986
1620.2 403233986 403822098 403495598 402107391 399623184 399395370 400029030 401966095 401873665 400678558
1628.9 400678558 400355759 400163651 401073456 401687584 401828804 401434555 401830139 402183838 402126045 401770172
1638.5 401770172 402286453 403385277 403298531 403700180 403197632 403035278 403657875 404476967 408351059
1647.2 408351059 405604668 404925423 406732521 408075829 409523773 401484947 402024994 407165451 408615494
1655.9 408615494 409822617 410906830 411626472 411060028 410808601 411596680 410618401 410876465 414154434
1664.5 414154434 416305008 416761818 417406464 418868713 417608986 415712051 415569420 415713463 417047386
1673.2 417047386 418491364 417758484 415722847 416600266 417651291 418361244 418023338 417153511 417815170
$$ packed form
1611.5D07722168j818848j140747o62613O13900K020797m992981p86476R53980J324806
1620.2D03233986N88112l26500j388207k484207k27814O33660J937065r2430j195107
1628.9D00678558l22799j92108R09805O14128J41220l94249L95584L53699n7793l55873
1638.5D01770172N16281J098824q6746M01649n02548j62354O22597Q19092L874092
1647.2D08351059k746391o79245J807098J343308J447944q038826N40047N140457J450043
1655.9D08615494J207123J084213P19642n66444k51427P88079r78279K58064L277969
1664.5D14154434K150574M56810O44646J462249j259727j896935j42631J44043J333923
1673.2D17047386J443978p32880k035637Q77419J051025P09953l37906q69827O61659
$$ plain form
1681.9 417815170 416778450 407842827 409078865 416950226 418433456 417514992 417573090 419054871 418310127
1690.6 418310127 418996353 419238129 418472404 419435806 419276237 416686363 417138062 417968254 419211845
1699.3 419211845 410830803 408972740 415352020 417429047 418296814 419620094 419979744 417805901 416240463
1707.9 416240463 416710358 417816124 418363800 418634338 418846283 419082527 417136040 413599586 414237404
1716.6 414237404 416469650 414795151 415834160 417200089 417627296 418098907 417825012 417561646 418269501
1725.3 418269501 418824196 418391876 417574158 417818146 416588364 415089722 415155334 414948082 413967972
1734 413967972 411882629 415302124 417187462 417952385 419470367 418678246 416484261 416590958 417124825
1742.7 417124825 416910934 416516838 416980095 416387062 415937576 415017052 414974480 416910133 416139832 415306358
$$ packed form
1681.9D17815170j036720q935623J236038P871361J483230r18464N8098J481781p44744
1690.6D18310127O86226K41776p65725R63402j59569k589874M51699Q30192J243591
1699.3D19211845q381042j858063O379280K077027Q67767J323280L59650k173843j565438
1707.9D16240463M69895J105766N47676K70538K11945K36244j946487l536454O37818
1716.6D14237404K232246j674499J039009J365929M27207M71611k73895k63366P07855
1725.3D18269501N54695m32320q17718K43988j229782j498642O5612k07252r80110
1734D13967972k085343L419495J885338P64923J517982p92121k193985J06697N33867
1742.7D17124825k13891l94096M63257n93033m49486r20524m2572J935653p70301q33474
$$ plain form
1752.3 415306358 416393509 416209717 416085548 416002274 413938217 415873642 418772202 418948059 418602028
1761 418602028 415939827 415180244 416850777 416840324 416461868 417795601 418282051 415881920 416027260
1769.7 416027260 415505638 413817978 414707298 414146576 415331917 416360016 416219521 416643257 416374893
1778.3 416374893 415924911 416606789 415662918 414823189 416635361 416958084 415753326 415988693 416166496
1787 416166496 416153717 415349998 414846115 414969025 416364059 416452522 414420128 415619316 416077919 414575424
1796.7 414575424 414933739 416613045 416483803 414740410 415461311 415039215 414556885 414459457 413509789
1805.3 413509789 414501305 415286026 415202179 416834183 417817268 415540810 414311485 414739342 415445747
1814 415445747 416000710 414921570 414445419 414945259 414533043 413357048 413163605 414255333 413597794
$$ packed form
1752.3D15306358J087151j83792j24169q3274k064057J935425K898560J75857l46031
1761D18602028k662201p59583J670533j0453l78456J333733M86450k400131J45340
1769.7D16027260n21622j687660Q89320n60722J185341J028099j40495M23736k68364
1778.3D16374893m49982O81878r43871q39729J812172L22723j204758K35367J77803
1787D16166496j2779q03719n03883J22910J395034Q8463k032394J199188M58603j502495
1796.7D14575424L58315J679306j29242j743393P20901m22096m82330r7428r49668
1805.3D13509789R91516P84721q3847J632004R83085k276458j229325M27857P06405
1814D15445747N54963j079140m76151M99840m12216j175995j93443J091728o57539
$$ plain form
1822.7 413597794 413826828 415265160 414479408 413715401 413637314 414657974 415102425 413110008 413623962
1831.4 413623962 414639397 414303131 413588486 413963203 414145241 413611259 413352394 414025993 414508286
1840.1 414508286 414325294 414382973 414799042 416392670 415106354 413514557 413624268 413318176 412917671
1848.7 412917671 412245216 412288818 412618523 412919273 413327255 412858620 412468071 412054634 413000374 414032860
1858.4 414032860 413106003 412727814 412436600 412266731 412788048 412865753 412519493 412363625 412691765 412980080
1868 412980080 412599602 412121010 412200546 412124367 412223053 412211838 411712914 411139717 411475639 412642593
1877.7 412642593 411810913 410945892 411593819 411648369 411719437 411763954 412238846 412444077 411757393 411421051
1887.3 411421051 411279755 411524773 411654968 411671677 411971626 411598434 410242844 409587021 410235481 409938126
$$ packed form
1822.7D13597794K29034J438332p85752p64007p8087J020660M44451j992417N13954
1831.4D13623962J015435l36266p14645L74717J82038n33982k58865O73599M82293
1840.1D14508286j82992N7679M16069J593628j286316j591797J09711l06092m00505
1848.7D12917671o72455M3602L29705L00750M07982m68635l90549m13437R45740J032486
1858.4D14032860r26857l78189k91214j69869N21317P7705l46260j55868L28140K88315
1868D12980080l80478m78592P9536p6179R8686j1215m98924n73197L35922J166954
1877.7D12642593q31680q65021O47927N4550P1068M4517M74892K05231o86684l36342
1887.3D11421051j41296K45018J30195J6709K99949l73192j355590o55823O48460k97355
$$ plain form
1896.9 409938126 409279938 409276924 410132523 410847664 411076469 411155815 409892540 409772568 410838852 410617790
1906.6 410617790 410379601 409988251 410154686 411041412 410810966 410467072 410295715 410384827 410487976 409761124
1916.2 409761124 409535942 409390678 408916245 409691048 410375328 410628662 410659714 409761200 409310150 409720688
1925.9 409720688 410251045 410024529 409854355 409538040 408535385 408439026 408560829 408576126 409762764 410537453
1935.5 410537453 409594193 408833618 408417892 407579575 407886314 408232956 406915894 406143379 407708969
1944.2 407708969 409584274 409558945 408741150 408100014 407758293 407849503 407394981 407675705 407846756 407615433
1953.8 407615433 408311272 407598114 406804504 407607651 407602463 407104836 407165794 407433739 408286934 408780594
1963.5 408780594 408136749 408024101 408048210 407557068 407719994 407259064 406175117 405908508 406679039 407324944
$$ packed form
1896.9D09938126o58188l014Q55599P15141K28805P9346j263275j19972J066284k21062
1906.6D10617790k38189l91350J66435Q86726k30446l43894j71357Q9112J03149p26852
1916.2D09761124k25182j45264m74433P74803O84280K53334L1052q98514m51050M10538
1925.9D09720688N30357k26516j70174l16315j002655r6359J21803J5297J186638P74689
1935.5D10537453r43260p60575m15726q38317L06739L46642j317062p72515J565590
1944.2D07708969J875305k5329q17795o41136l41721R1210m54522K80724J71051k31323
1953.8D07615433O95839p13158p93610Q03147n188m97627O0958K67945Q53195M93660
1963.5D08780594o43845j12648K4109m91142J62926m60930j083947k66609P70531O45905
$$ plain form
1973.1 407324944 406841507 407196312 408259621 407801895 407105408 407081757 406883888 406638374 406745300 407406998
1982.8 407406998 407370949 405934639 404979973 405195312 405910492 406070290 405990067 406842880 407075882 406027985
1992.4 406027985 405094185 405321388 406079979 405821228 405593224 405184822 404535408 404660797 404815598 404501991
2002.1 404501991 404573326 406306648 407212105 406604424 406639977 406000671 405044594 405082893 404673920 404020119
2011.7 404020119 404899216 405538979 404515381 404260368 404971733 404719772 404185257 404109650 403748207 404427376
2021.3 404427376 405057945 404253006 404469795 404387398 403844147 403995895 403528214 402939911 402562485 402691727
2031 402691727 403354950 404325867 404961243 404450264 404205322 405194168 405690193 404925880 404451828 403597565
2040.6 403597565 402878685 403472023 403652802 403438721 403374710 404070244 404958115 405014420 404482384 403719444
$$ packed form
1973.1D07324944m83437L54805J063309m57726o96487k3651j97869k45514J06926O61698
1982.8D07406998l6049j436310r54666K15339P15180J59798q0223Q52813K33002j047897
1992.4D06027985r33800K27203P58591k58751k28004m08402o49414J25389J54801l13607
2002.1D04501991P1335J733322R05457o07681L5553o39306r56077L8299m08973o53801
2011.7D04020119Q79097O39763j023598k55013P11365k51961n34515p5607l61443O79169
2021.3D04427376O30569q04939K16789q2397n43251J51748m67681n88303l77426J29242
2031D02691727O63223R70917O35376n10979k44942R88846M96025p64313m74052q54263
2040.6D03597565p18880N93338J80779k14081o4011O95534Q87871N6305n32036p62940
$$ plain form
2050.3 403719444 403249893 403025551 403264503 403235512 403339462 403392105 402540932 403041801 404607048 405285072
2059.9 405285072 404314842 403806458 404423294 403476639 402487259 402240219 402449646 403253975 403118896 402995491
2069.6 402995491 402957878 402111778 401944618 402820816 403774834 404346924 403132439 401443596 401886482
2078.2 401886482 402465248 402358475 402093811 401608009 402032204 403053856 403919830 403635101 402384834
2086.9 402384834 402018051 402182083 402724953 403514519 402573128 401352005 401955414 402950592 403627586
2095.6 403627586 403493004 402316933 401733818 402149010 402502327 402223740 401885147 401665916 401890450
2104.3 401890450 403173180 404226151 404582939 404395714 403253517 402099953 401425514 401382942 401299438
2113 401299438 400883026 401339073 401740799 402249413 403388824 403307571 401877022 400777702 401101265 401652908
$$ packed form
2050.3D03719444m69551k24342K38952k8991J03950N2643q51173N00869J565247O78024
2059.9D05285072r70230n08384O16836r46655r89380k47040K09427Q04329j35079j23405
2069.6D02995491l7613q46100j67160Q76198R54018N72090j214485j688843M42886
2078.2D01886482N78766j06773k64664m85802M24195J021652Q65974k84729j250267
2086.9D02384834l66783J64032N42870P89566r41391j221123O03409R95178O76994
2095.6D03627586j34582j176071n83115M15192L53317k78587l38593k19231K24534
2104.3D01890450J282730J052971L56788j87225j142197j153564o74439m2572q3504
2113D01299438m16412M56047M01726N08614J139411q1253j430549j099320L23563N51643
$$ plain form
2122.6 401652908 402291451 403005219 402237740 401310387 401481209 401920891 401470108 401075783 401455879 400993843
2132.3 400993843 400435448 400892029 401622353 401461411 401334419 402119637 402334785 402011032 401344528 401042023
2141.9 401042023 401341286 401413460 402098846 403052940 402463837 400902290 400788307 401223335 400986404 400922546
2151.5 400922546 401026688 401209488 401174736 401127281 400995789 401138115 401475487 401419067 401620750 401852684
2161.2 401852684 402103729 400926476 399463234 399911079 399539871 399502487 401179390 401534271 400258675
2169.9 400258675 399589005 400422211 401451111 401897430 402371635 402491875 401369057 400328445 399907379
2178.5 399907379 399272690 399263344 399606934 400022774 401087685 401859818 401369667 400383835 400637512 401225662
2188.2 401225662 400243950 399496994 400203018 400763245 400774803 400516968 399912872 399071007 399341125 400558167
$$ packed form
2122.6D01652908O38543P13768p67479r27353J70822M39682m50783l94325L80096m62036
2132.3D00993843n58395M56581P30324j60942j26992P85218K15148l23753o66504l02505
2141.9D01042023K99263P2174O85386R54094n89103j561547j13983M35028k36931o3858
2151.5D00922546J04142J82800l4752m7455j31492J42326L37372n6420K01683K31934
2161.2D01852684K51045j177253j463242M47845l71208l7384J676903L54881j275596
2169.9D00258675o69670Q33206J028900M46319M74205J20240j122818j040612m21066
2178.5C99907379o34689r346L43590M15840J064911P72133m90151r85832K53677N88150
2188.2D01225662r81712p46956P06024N60227J1558k57835o04096q41865K70118J217042
$$ plain form
2197.8 400558167 400866127 401182747 400848351 399890442 400179825 400398026 400470772 400638580 400833435 400778847
2207.5 400778847 399642525 399063950 399263077 398985405 398556137 399360390 400158348 398962288 398890686
2216.1 398890686 400504112 400555382 399718628 399958687 400480881 399489746 398669891 399125443 399027252 399342728
2225.8 399342728 400061722 400608521 401457672 400714531 399128380 398363762 398285332 398269539 397990456 398816605
2235.4 398816605 399665794 399384880 398953590 399151039 399871445 400023537 399344406 398191109 397936172
2244.1 397936172 397596130 396572952 396789017 397423782 398268776 398300095 398374557 400439606 400811234 399436913
2253.8 399436913 399138451 399003639 398637848 399265785 400143623 399322395 397902565 397650070 398228493
2262.4 398228493 398567963 398366356 398319092 398470154 398298302 398559227 399394417 398921204 397635231 397105865
$$ packed form
2197.8D00558167L07960L16620l34396r57909K89383K18201P2746J67808J94855n4588
2207.5D00778847j136322n78575J99127k77672m29268Q04253P97958j196060p1602
2216.1C98890686J613426N1270q36754K40059N22194r91135q19855M55552r8191L15476
2225.8C99342728P18994N46799Q49151p43141j586151p64618p8430j5793k79083Q26149
2235.4C98816605Q49189k80914m31290J97449P20406J52092o79131j153297k54937
2244.1C97936172l40042j023178K16065O34765Q44994L1319P4462K065049L71628j374321
2253.8C99436913k98462j34812l65791O27937Q77838q21228j419830k52495N78423
2262.4C98228493L39470k01607m7264J51062j71852K60925Q35190m73213j285973n29366
$$ plain form
2272.1 397105865 397413559 398475914 398913536 398685951 398575325 398203239 398103218 397939148 397893829 398647232
2281.7 398647232 398896790 398778229 398602448 398001137 397803230 397633629 397348595 397793198 398317413 398071289
2291.4 398071289 397863884 398167343 397885475 397093582 397301636 398427277 398181229 396778183 396312370
2300 396312370 396655006 397522430 397703438 396340256 395653191 396022530 395434227 395379181 397134857 397529640
2309.7 397529640 396870537 397335167 396650085 395453148 396362724 396445656 395132446 394987144 394972305 395029678
2319.3 395029678 395053215 396391563 398685188 398665047 398547592 397884483 395683479 394766617 396005135
2328 396005135 394591446 392665863 397383537 397696114 394199715 395072861 395221481 396459045 397048874
2336.7 397048874 394491692 394115257 396992798 397924805 395668755 393955765 393297729 393610115 393183784
$$ packed form
2272.1C97105865L07694J062355M37622k27585j10626l72086j00021j64070m5319P53403
2281.7C98647232K49558j18561j75781o01311j97907j69601k85034M44603N24215k46124
2291.4C98071289k07405L03459k81868p91893K08054J125641k46048j403046m65813
2300C96312370L42636Q67424J81008j363182o87065L69339n88303n5046J755676L94783
2309.7C97529640o59103M64630o85082j196937R09576Q2932j313210j45302j4839N7373
2319.3C95029678K3537J338348K293625k0141j17455o63109k201004r16862J238518
2328C96005135j413689j925583M717674L12577l496399Q73146J48620J237564N89829
2336.7C97048874k557182l76435K877541R32007k256050j712990o58036L12386m26331
$$ plain form
2345.4 393183784 393011894 392719879 392454453 393064842 393652458 394126511 393759232 394210777 394182434 394168701
2355 394168701 395889206 397492142 398399200 393249016 392636375 395532532 393123436 392757759 391409569
2363.7 391409569 388615379 387790909 392094269 394706345 393193588 394313545 394316025 394565849 396181068
2372.4 396181068 395139503 393209381 393859177 393933601 393109169 394629936 395430641 395510826 395566826 395122986
2382 395122986 395374184 395619469 395711288 395624847 395143661 393973083 393636017 394995613 395984383 396076279
2391.7 396076279 395171471 394307518 394351540 394619064 394384384 393506317 394045715 395788803 395650749 394146004
2401.3 394146004 393884392 394154320 393966408 394117470 394594498 394526711 394564743 395137291 394763985 394799652
2410.9 394799652 395539131 395707512 395437241 394512749 394235840 394694023 395619316 395489235 394222221
$$ packed form
2345.4C93183784j71890k92015k65426O10389N87616M74053l67279M51545k8343j3733
2355C94168701J720505J602936R07058n150184o12641K896157k409096l65677j348190
2363.7C91409569k794190q24470M303360K612076j512757J119957K480K49824J615219
2372.4C96181068j041565j930122O49796P4424q24432J520767Q00705Q0185N6000m43840
2382C95122986K51198K45285R1819q6441m81186j170578l37066J359596R88770R1896
2391.7C96076279r04808q63953M4022K67524k34680q78067N39398J743088j38054j504745
2401.3C94146004k61612K69928j87912J51062M77028o7787L8032N72548l73306L5667
2410.9C94799652P39479J68381k70271r24492k76909M58183R25293j30081j267014
$$ plain form
2419.6 394222221 394365311 394090958 393620529 393946953 393894463 393900642 393982124 394092445 393789062 393053093
2429.3 393053093 392852592 393326187 393999710 394671669 394786453 395076790 395325432 394201393 393209305
2438 393209305 392737045 393787575 394409332 392622452 392201424 392570915 393315277 394066238 393674316 393665733
2447.6 393665733 394147949 395039787 394660721 393938599 393535347 392943954 393619232 393262939 392221756
2456.3 392221756 391844521 391890144 392736702 392491684 392043571 392539902 392665825 393029137 393711510 393719635
2465.9 393719635 393543510 393438721 392899399 391825562 391511955 393009872 394322548 394058838 393060188
2474.6 393060188 392331619 391907082 391760521 392449303 392871552 392443314 392093620 392556458 393043251 392306557
2484.2 392306557 391609955 392308846 393274918 392849083 392590256 392786751 391306725 390438728 391539536
$$ packed form
2419.6C94222221J43090k74353m70429L26424n2490O179Q1482J10321l03383p35969
2429.3C93053093k00501M73595O73523O71959J14784K90337K48642j124039r92088
2438C93209305m72260J050530O21757j786880m21028L69491P44362P50961l91922q583
2447.6C93665733M82216Q91838l79066p22122m03252n91393O75278l56293j041183
2456.3C92221756l77235M5623Q46558k45018m48113M96331J25923L63312O82373Q125
2465.9C93719635j76125j04789n39322j073837l13607J497917J312676k63710r98650
2474.6C93060188p28569m24537j46561O88782M22249m28238l49694M62838M86793p36694
2484.2C92306557o96602O98891R66072m25835k58827J96495j480026q67997J100808
$$ plain form
2492.9 391539536 392378960 392378502 392162590 392274055 392381401 392004623 392331963 392740364 391914864 391896629
2502.6 391896629 391962128 391207504 391532097 391778755 391636276 391382408 391010704 391489449 391448326 391133041
2512.2 391133041 391446686 391459503 391329956 390979614 391228981 392409897 392272987 391202888 391172600 391173782
2521.9 391173782 390958138 391553345 391281357 390637093 391462975 392049370 391786537 391181564 390748444 390395737
2531.5 390395737 390332451 391468925 391505699 390443306 390090866 390161743 390446129 390713158 390995255 391226425
2541.1 391226425 391861763 391922264 391683769 391415253 390528183 390984497 390751991 390368347 390831108 389848862
2550.8 389848862 389990692 390785027 390560989 389934845 389661140 390196190 389999352 389509811 389421921 389814148
2560.4 389814148 390525475 390646553 390130348 390206375 390957565 390725632 390349693 390118904 389586525 389604225
$$ packed form
2492.9C91539536Q39424m58k15912J11465J07346l76778L27340M08401q25500j8235
2502.6C91896629O5499p54624L24593K46658j42479k53868l71704M78745m1123l15285
2512.2C91133041L13645J2817j29547l50342K49367J180916j36910j070099l0288J182
2521.9C91173782k15644N95207k71988o44264Q25882N86395k62833o04973m33120l52707
2531.5C90395737o3286J136474L6774j062393l52440P0877K84386K67029K82097K31170
2541.1C91226425O35338O0501k38495k68516q87070M56314k32506l83644M62761r82246
2550.8C89848862J41830P94335k24038o26144k73705N35050j96838m89541q7890L92227
2560.4C89814148P11327J21078n16205P6027P51190k31933l75939k30789n32379J7700
$$ plain form
2570.1 389604225 389847488 390207405 390914345 390455399 388937645 388907509 389703064 390613174 390394135 389309921
2579.7 389309921 389935684 389852791 389477577 389264412 388745880 389344711 389536972 389568367 388966293 388678665
2589.4 388678665 388974533 388979301 390318069 390611000 389677544 389025650 388662872 388609390 388843918 389432106
2599 389432106 389192963 389840126 390521507 389760628 389856796 390393677 389879417 389096870 390101929 391036797
2608.6 391036797 390405884 389491425 388265610 387633743 388052940 389334488 390117149 389718895 389465256
2617.3 389465256 389330292 389374962 390260239 391075630 390548668 390237923 389875412 388441467 387891731 387977676
2627 387977676 388579178 389669266 389801369 389423103 389175835 388781967 388272972 388111038 388584290 389202499
2636.6 389202499 389242134 388985672 388387985 387813454 387344818 386782036 387811394 388621483 388064880 388800201
$$ packed form
2570.1C89604225K43263L59917P06940m58946j517754l0136P95555R10110k19039j084214
2579.7C89309921O25763q2893l75214k13165n18532N98831J92261L1395o02074k87628
2589.4C88678665K95868M768J338768K92931r33456o51894l62778n3482K34528N88188
2599C89432106k39143O47163O81381p60879R6168N36881n14260p82547J005059R34868
2608.6C91036797o30913r14459j225815o31867M19197J281548P82661l98254k53639
2617.3C89465256j34964M4670Q85277Q15391n26962l10745l62511j433945n49736Q5945
2627C87977676O01502J090088J32103l78266k47268l93868n08995j61934M73252O18209
2636.6C89202499L9635k56462n97687n74531m68636n62782J029358Q10089n56603P35321
$$ plain form
2646.3 388800201 389722023 388608627 387240219 387507286 387731514 388401337 389413834 388689957 388041191
2654.9 388041191 387550125 386742058 386636620 387589378 388570328 388052177 387888718 388488388 388796844 388064003
2664.6 388064003 386130028 385802917 387369270 388144302 387336540 387079849 387691574 387333527 387039146
2673.3 387039146 387325401 387262001 387286530 387275085 386881943 387471771 388462143 387844353 386836624 386853561
2682.9 386853561 387051468 386367874 386247292 387645569 388312073 387692909 386961555 386694679 387032242
2691.6 387032242 387445374 387386551 387189636 387071342 387014122 387212486 386834259 386120872 385870895 386184502
2701.2 386184502 386836319 386950378 387103271 387597961 387522087 386579132 386269913 387005539 387171097 386799622
2710.9 386799622 385950890 386069031 386968956 386912689 387215080 387432480 387686539 387522545 386051521 385199127
$$ packed form
2646.3C88800201R21822j113396j368408K67067K24228O69823J012497p23877o48766
2654.9C88041191m91066q08067j05438R52758R80950n18151j63459N99670L08456p32841
2664.6C88064003j933975l27111J566353P75032q07762k56691O11725l58047k94381
2673.3C87039146K86255o3400K4529j1445l93142N89828R90372o17790j007729J6937
2682.9C86853561J97907o83594j20582J398277O66504o19164p31354k66876L37563
2691.6C87032242M13132n8823j96915j18294n7220J98364l78227p13387k49977L13607
2701.2C86184502O51817J14059J52893M94690p5874r42955l09219P35626J65558l71475
2710.9C86799622q48732J18141Q99925n6267L02391K17400K54059j63994j471024q52394
$$ plain form
2720.5 385199127 385137444 386284256 387853966 388038940 387363701 386775436 386580429 385680923 385111694
2729.2 385111694 385772057 385701027 385433350 385805130 386095085 386488686 386746254 387037354 387059937 386295471
2738.8 386295471 386302681 385792885 384287643 384483185 385400505 386180916 386442986 385780983 385816841 386178932
2748.5 386178932 386421242 386270256 385684853 385886230 385774727 384995003 384477463 384482155 385257378 385328712
2758.1 385328712 385146103 385872574 386038322 385960846 386156197 386040382 385269661 384331284 384397202 384043846
2767.8 384043846 383209991 383435974 383602219 383465157 383843384 385091095 385966377 385076866 384773293
2776.4 384773293 385675659 386130295 386252785 385449409 384715309 384840012 384634018 384727974 384605789 384000549
2786.1 384000549 383975677 384414139 385383530 385933685 385452766 385372963 385815926 385074387 383880577 383808823
$$ packed form
2720.5C85199127o1683J146812J569710J84974o75239n88265j95007q99506n69229
2729.2C85111694O60363p1030k67677L71780K89955L93601K57568K91100K2583p64466
2738.8C86295471P210n09796j505242J95542R17320P80411K62070o62003L5858L62091
2748.5C86178932K42310j50986n85403K01377j11503p79724n17540M692P75223P1334
2758.1C85328712j82609P26471J65748p7476J95351j15815p70721r38377O5918l53356
2767.8C84043846q33855K25983J66245j37062L78227J247711Q75282q89511l03573
2776.4C84773293R02366M54636J22490q03376p34100J24703k05994R3956j22185o05240
2786.1C84000549k4872M38462R69391N50155m80919p9803M42963p41539j193810p1754
$$ plain form
2795.7 383808823 384278297 384816895 384747772 384263649 383574677 382573357 382376709 382898865 383653259 383776131
2805.4 383776131 383451767 384026871 384685402 384171600 383227921 383814240 384967155 385143318 385071602 384725647
2815 384725647 384967995 385414848 384102135 383307915 384453430 385472832 385764503 384485550 382834473
2823.7 382834473 382985649 383790207 384186401 383526993 383397064 383843460 382820663 382327385 382898407
2832.4 382898407 383669548 383929749 382784538 381684990 381745224 382339096 382388496 381980553 381199951 381306229
2842 381306229 382876320 383346252 382965851 382251244 381202927 382117500 383194466 382260551 382159653
2850.7 382159653 382702332 382478485 382436829 382020683 381816444 381924362 382084961 382673225 382653885 381756096
2860.3 381756096 380532188 380326118 381079292 381855125 381691475 381125603 381555328 381069031 380589066
$$ packed form
2795.7C83808823M69474N38598o9123m84123o88972j001320j96648N22156P54394J22872
2805.4C83776131l24364N75104O58531n13802r43679N86319J152915J76163p1716l45955
2815C84725647K42348M46853j312713p94220J145515J019402K91671j278953j651077
2823.7C82834473J51176Q04558L96194o59408j29929M46396j022797m93278N71022
2832.4C82898407P71141K60201j145211j099548O0234N93872M9400m07943p80602J06278
2842C81306229J570091M69932l80401p14607j048317R14573J076966r33915j00898
2850.7C82159653N42679k23847m1656m16146k04239J07918J60599N88264j9340q97789
2860.3C81756096j223908k06070P53174P75833j63650n65872M29725m86297m79965
$$ plain form
2869 380589066 380946693 380928650 381092072 380973282 381232147 381921577 382141571 381676826 381563301 382427711
2878.7 382427711 382319679 381293602 380699043 380860062 381119652 381449127 381924706 381862183 381845322 382199707
2888.3 382199707 382513962 381761818 380843811 380460854 379990807 379836044 379616165 380393677 381341515 381620255
2897.9 381620255 381728554 380278053 379027405 379494171 380543327 380776443 380569649 380663414 380059090
2906.6 380059090 379085007 379101830 381025620 382145805 380946808 379990158 379630737 379394188 379675636
2915.3 379675636 380029144 379264832 378729019 379182625 379470367 379300461 378692932 378618279 377770004 377046471
2925 377046471 378105202 378684883 378368683 377848892 378972931 380782089 379989281 378309479 378108253
2933.6 378108253 378689117 379420624 380172157 380110893 379542847 378821030 378401947 378587151 378690796 378814049
$$ packed form
2869C80589066L57627j8043J63422j18790K58865O89430K19994m64745j13525Q64410
2878.7C82427711j08032j026077n94559J61019K59590L29475M75579o2523j6861L54385
2888.3C82199707L14255p52144r18007l82957m70047j54763k19879P77512R47838K78740
2897.9C81620255J08299j450501j250648M66766J049156K33116k06794R3765o04324
2906.6C80059090r74083J6823J923790J120185j198997r56650l59421k36549K81448
2915.3C79675636L53508p64312n35813M53606K87742j69906o07529p4653q48275p23533
2925C77046471J058731N79681l16200n19791J124039J809158p92808j679802k01226
2933.6C78108253N80864P31507P51533o1264n68046p21817m19083J85204J03645J23253
$$ plain form
2943.3 378814049 378679695 378858337 379399681 379414978 378946152 378296967 378516579 379698677 380328598 379196930
2952.9 379196930 378157349 378437462 378799477 379043045 379237709 379405975 378826294 378374138 378788528
2961.6 378788528 379264526 379476089 379165764 379528732 379974403 379867401 379290886 378776512 379092407 378635368
2971.2 378635368 378610535 379179001 379079361 378592911 377886810 378406906 379822197 381000061 380697632 379861717
2980.9 379861717 379745865 379085388 378463097 378241615 378854485 378971481 378449326 379391594 379636269 378896866
2990.5 378896866 378678436 378986282 379662666 380141640 379824715 378811836 378659248 379123077 379270554
2999.2 379270554 379176483 379256706 379191780 377917061 377614250 379160042 379693832 378880463 378642998 378783836
3008.8 378783836 378473473 378449631 378065033 377626457 378526115 379406738 379503288 378897743 378001862 378194427
$$ packed form
2943.3C78814049j34354J78642N41344J5297m68826o49185K19612J182098O29921j131668
2952.9C79196930j039581K80113L62015K43568J94664J68266n79681m52156M14390
2961.6C78788528M75998K11563l10325L62968M45671j07002n76515n14374L15895m57039
2971.2C78635368k4833N68466r9640m86450p06101N20096J415291J177864l02429q35915
2980.9C79861717j15852o60477o22291k21482O12870J16996n22155R42268K44675p39403
2990.5C78896866k18430L07846O76384M78974l16925j012879j52588M63829J47477
2999.2C79270554r4071Q0223o4926j274719l02811J545792N33790q13369k37465J40838
3008.8C78783836l10363k3842l84598m38576Q99658Q80623R6550o05545q95881J92565
$$ plain form
3018.5 378194427 378656387 377829628 376534615 376519623 377752953 378526688 378611946 378342056 378350182 378685913
3028.1 378685913 378229599 378147469 378176270 377591515 377638702 377904816 378296432 378258324 377589951 377350883
3037.8 377350883 377626686 378079300 378138618 377739639 377283592 377076797 376986618 376944466 376923332 377180786
3047.4 377180786 377665672 377717781 378191795 378335533 377854805 377495728 376284103 376486816 378167114
3056.1 378167114 377622757 375929489 375238342 375708084 377014198 377028275 375902061 376143265 376659279
3064.8 376659279 376579552 376320877 375477905 375317688 376014748 376971130 377952728 377846336 376877632 376499100
3074.4 376499100 376632271 376604538 376203728 376175766 377324409 377276077 376257439 376449280 376107254 375177536
3084.1 375177536 374716988 374426765 373936310 373776703 374784737 375429878 375296249 375418129 375423355 375232887
$$ packed form
3018.5C78194427M61960q26759j295013j4992J233330P73735Q5258k69890Q126L35731
3028.1C78685913m56314q2130K8801n84755M7187K66114L91616l8108o68373k39068
3037.8C77350883K75803M52614N9318l98979m56047k06795r0179m2152k1134K57454
3047.4C77180786M84886N2109M74014J43738m80728l59077j211625K02713J680298
3056.1C78167114n44357j693268o91147M69742J306114J4077j126214K41204N16014
3064.8C76659279p9727k58675q42972j60217O97060R56382R81598j06392r68704l78532
3074.4C76499100J33171k7733m00810k7962J148643m8332j018638J91841l42026r29718
3084.1C75177536m60548k90223m90455j59607J008034O45141j33629J21880N226j90468
$$ plain form
3093.7 375232887 375450859 375663376 375415192 375384293 375121117 374865837 375219994 374996414 374690666 374606171
3103.4 374606171 374301949 374669189 374793396 374268723 374332161 374437943 374092064 373874702 373978043 373635445
3113 373635445 373049126 373124962 373318863 373211670 373045998 373415794 373618050 373797112 375107918 374678841
3122.6 374678841 372197075 371685181 372815170 373179855 373284264 373092194 372218590 372339859 372514992
3131.3 372514992 372171059 372632256 373432121 373234787 372073593 371274796 370005226 369438591 370594635
3140 370594635 371061363 371286697 371906090 371598320 370420036 370476875 371155128 371118774 370704575 369658470
3149.6 369658470 370882683 373030472 371956177 369882889 369145966 369905014 370831375 370837440 370606117
3158.3 370606117 370058556 369414139 369793243 369787827 368637810 368703995 369801826 370022125 368796806 367465324
$$ packed form
3093.7C75232887K17972K12517k48184l0899k63176k55280L54157k23580l05748q4495
3103.4C74606171l04222L67240J24207n24673O3438J05782l45879k17362J03341l42598
3113C73635445n86319P5836J93901j07193j65672L69796K02256J79062J310806m29077
3122.6C74678841k481766n11894J129989L64685J04409j92070q73604J21269J75133
3131.3C72514992l43933M61197P99865j97334j161194p98797j269570n66635J156044
3140C70594635M66728K25334O19393l07770j178284N6839O78253l6354m14199j046105
3149.6C69658470J224213K147789j074295k073288p36923P59048R26361O065k31323
3158.3C70606117n47561o44417L79104n416j150017O6185J097831K20299j225319j331482
$$ plain form
3168 367465324 367379456 367940445 367772675 367542648 368605232 368216705 367160225 367815170 368202286 367666397
3177.6 367666397 367219696 368347511 368411674 367047501 367511482 368399734 368387260 367000771 365983124
3186.3 365983124 367080727 368039169 367050781 365499687 365316048 365542488 365041046 364069405 365015526
3195 365015526 366675034 365921707 364990234 364152374 363329811 363459015 364170914 364621124 363723831 363121071
3204.6 363121071 363262825 363083382 362852592 363109665 363217239 362747765 362410812 362330055 362599068 361838455
3214.3 361838455 361292953 361796150 360827904 360308037 360771294 360400124 360491600 361096916 360991821 360685234
3223.9 360685234 360517883 360192451 359712334 358883400 358435440 358224144 358407974 358902435 358820763 359645844
3233.5 359645844 359497986 357701530 357432556 358095016 358228035 357117004 356288719 356745720 356433220
$$ packed form
3168C67465324q5868N60989j67770k30027J062584l88527j056480O54945L87116n35889
3177.6C67666397m46701J127815O4163j364173M63981Q88252j2474j386489j017647
3186.3C65983124J097603R58442r88388j551094j83639K26440n01442r71641R46121
3195C65015526J659508p53327r31473q37860q22563J29204P11899M50210q97293o02760
3204.6C63121071J41754j79443k30790K57073J07574m69474l36953q0757K69013p60613
3214.3C61838455n45502N03197r68246n19867M63257l71170R1476O05316j05095l06587
3223.9C60685234j67351l25432m80117q28934m47960k11296J83830M94461q1672Q25081
3233.5C59645844j47858j796456k68974O62460J33019j111031q28285M57001l12500
$$ plain form
3242.2 356433220 356293411 356664047 356579742 356304703 356094856 356969070 356930313 355488052 355563660 355386353
3251.9 355386353 354503403 354554482 354255257 354198494 354438362 354128647 354387741 354939728 354977493 354358711
3261.5 354358711 353620224 353446655 352770157 351974335 352274590 352463913 352571983 353414955 353960075 353811874
3271.2 353811874 353123856 351811676 351249313 351577606 351217575 350616608 350356598 350588531 351764374
3279.8 351764374 352945747 352465286 350670395 350003319 350303307 350066757 349715118 349471092 349274292
3288.5 349274292 349357567 349663925 349982567 350503616 351151619 350803261 348933067 348029785 348837395 348701363
3298.2 348701363 347639427 346653938 346383820 346104202 345778236 346497383 346233673 345944977 346612434
3306.8 346612434 347006989 346628265 345244675 344348869 343520241 343947678 345373306 344829216 343786621
$$ packed form
3242.2C56433220j39809L70636q4305k75039k09847Q74214l8757j442261P5608j77307
3251.9C55386353q82950N1079k99225n6763K39868l09715K59094N51987L7765o18782
3261.5C54358711p38487j73569o76498p95822L00255J89323J08070Q42972N45120j48201
3271.2C53811874o88018j312180n62363L28293l60031o00967k60010K31933J175843
3279.8C51764374J181373m80461j794891o67076K99988k36550l51639k44026j96800
3288.5C49274292Q3275L06358L18642N21049O48003l48358j870194r03282Q07610j36032
3298.2C48701363j061936r85489k70118k79618l25966P19147k63710k88696O67457
3306.8C46612434L94555l78724j383590q95806q28628M27437J425628n44090j042595
$$ plain form
3315.5 343786621 343371124 343116722 343036308 342842636 341776505 341159859 340439758 339017601 339466934
3324.2 339466934 339445152 338821869 338564034 337776337 338276596 339017754 339040833 338368759 337740479 336980095
3333.8 336980095 335434990 335040283 334610519 333874283 334160881 334319611 333942299 333526764 333360939
3342.5 333360939 333463326 333295517 332615471 332175674 331967316 331586151 331038208 330588799 329625435 327937469
3352.2 327937469 326571312 325703812 325604210 325594826 325664597 325029068 323489647 323600121 323856125 323555069
3361.8 323555069 323642273 323530769 323386726 323033371 322020302 320712051 319952774 319199104 319309864
3370.5 319309864 318629398 316734467 316478882 316082878 316093330 315841236 314538898 313740730 313192863
3379.2 313192863 313648453 313319836 312742195 312440319 312032070 311965084 310856457 310702839 311130390 310923767
$$ packed form
3315.5C43786621m15497k54402q0414j93672j066131o16646p20101j422157M49333
3324.2C39466934k1782o23283k57835p87697N00259P41158K3079o72074o28280p60384
3333.8C36980095j545105l94707m29764p36236K86598J58730l77312m15535j65825
3342.5C33360939J02387j67809o80046m39797k08358l81165n47943m49409r63364j687966
3352.2C27937469j366157q67500r9602r384O9771o35529j539421J10474K56004l01056
3361.8C23555069Q7204j11504j44043l53355j013069j308251p59277p53670J10760
3370.5C19309864o80466j894931k55585l96004J0452k52094j302338p98168n47867
3379.2C13192863M55590l28617n77641l01876m08249o6986j108627j53618M27551k06623
$$ plain form
3388.8 310923767 310127296 309157772 309395046 309255295 309173965 309194469 308441887 308762989 308987026 307632561
3398.4 307632561 306977539 306248417 304740868 304844799 305908909 306668644 306255398 305379658 305108833
3407.1 305108833 304670105 304459515 303955269 303904877 304103642 303104477 301911831 301142387 301190910 301227894
3416.8 301227894 300974369 300763550 300363846 300576916 301158619 301283207 301073799 300549870 299979782 300343418
3426.4 300343418 300928860 300958176 301188469 302570267 302965641 300952511 300386028 299639511 298181190
3435.1 298181190 298555126 298441696 298367157 299144592 300408249 300962887 299858589 298920193 298464127
3443.8 298464127 298661652 300084152 302007885 301508083 299491062 299115028 299557781 300117226 300630608
3452.5 300630608 301855278 302210064 300524445 299333229 299441051 300715656 301796741 301123543 300552273
$$ packed form
3388.8C10923767p96471r69524K37274j39751q1330K0504p52582L21102K24037j354465
3398.4C07632561o55022p29122j507549J03931J064110P59735m13246q75740k70825
3407.1C05108833m38728k10590n04246n0392J98765r99165j192646p69444M8523L6984
3416.8C01227894k53525k10819l99704K13070N81703J24588k09408n23929n70088L63636
3426.4C00343418N85442K9316K30293J381798L95374k013130n66483p46517j458321
3435.1B98181190L73936j13430p4539P77435J263657N54638j104298r38396m56066
3443.8B98464127J97525J422500J923733m99802k017021l76034M42753N59445N13382
3452.5C00630608J224670L54786j685619j191216J07822J274605J081085o73198n71270
$$ plain form
3461.1 300552273 301302032 301635246 301588631 301703167 302164116 303625469 303948441 302796478 302501049
3469.8 302501049 303742771 304916840 305259247 305559063 305398312 304478817 303618374 304637794 306182404
3478.5 306182404 306013050 305109806 304426193 305507011 306713238 306500168 306587181 307358990 308002281
3487.2 308002281 308079319 308429127 308610668 308399658 308184490 308280811 309038200 309086418 308301811 309046955
3496.8 309046955 310804081 309903355 308511772 309626255 310220623 309440880 310361900 312985249 313615246
3505.5 313615246 312660561 312081642 311837502 311542816 311663265 313185883 314469719 314905987 315293312
3514.2 315293312 315692673 315570679 315064735 315527725 315669651 316175060 317001152 316589375 317315464 318427200
3523.8 318427200 317680588 316779823 316818790 317711601 318938847 319652901 320208092 320233650 319621048 320439568
$$ packed form
3461.1C00552273P49759L33214m6615J14536M60949J461353L22972j151963k95429
3469.8C02501049J241722J174069L42407K99816j60751r19495q60443J019420J544610
3478.5C06182404j69354r03244o83613J080818J206227k13070Q7013P71809O43291
3487.2C08002281P7038L49808J81541k11010k15168R6321P57389M8218p84607P45144
3496.8C09046955J757126r00726j391583J114483N94368p79743R21020K623349O29997
3505.5C13615246r54685n78919k44140k94686J20449J522618J283836M36268L87325
3514.2C15293312L99361j21994n05944M62990J41926N05409Q26092m11777P26089J111736
3523.8C18427200p46612r00765L8967Q92811J227246P14054N55191K5558o12602Q18520
$$ plain form
3533.5 320439568 321530838 321839867 321474037 321154938 321982803 322251740 322375450 322681046 322557945
3542.1 322557945 322571793 323436928 323832970 323688660 325009155 325335159 325806046 326254196 326510658 327844849
3551.8 327844849 326925507 325918007 325275764 325854836 327722778 327441292 327829971 329589920 330315399
3560.5 330315399 329461670 329940453 331155930 331345863 333854103 334743958 333254471 333204994 332285461
3569.1 332285461 333415184 333341560 332851181 333615379 333990402 334774399 335996246 336656151 336205406
3577.8 336205406 336383324 337212296 337306747 337807732 339009247 339278450 338757935 339632492 341602745
3586.5 341602745 343629570 342313499 339299431 340265198 341854744 342938919 343086319 343138809 343692207
3595.2 343692207 342049332 343086128 345454521 346090088 346625824 346469154 346703606 347122688 347529907
$$ packed form
3533.5C20439568J091270L09029l65830l19099Q27865K68937J23710L05596j23101
3542.1C22557945J3848Q65135L96042j44310J320495L26004M70887M48150K56462J334191
3551.8C27844849r19342j007500o42243N79072J867942k81486L88679J759949P25479
3560.5C30315399q53729M78783J215477J89933K508240Q89855j489487m9477r19533
3569.1C32285461J129723p3624m90379P64198L75023P83997J221847O59905m50745
3577.8C36205406J77918Q28972R4451N00985J201515K69203n20515Q74557J970253
3586.5C41602745K026825j316071l014068R65767J589546J084175J47400N2490N53398
3595.2C43692207j642875J036796K368393O35567N35736j56670K34452M19082M07219
$$ plain form
3603.9 347529907 348977280 349993019 349886093 350050697 351262741 351283112 352010689 353115196 350694275
3612.5 350694275 350380020 353002777 351958694 352077713 353642654 353851280 354025993 352560005 353395615
3621.2 353395615 356020164 356889267 356477814 355950737 356620560 357615891 360192490 361739235 353957138
3629.9 353957138 354831505 356935349 358590965 359027176 359267502 360895996 361291428 361832428 361798363
3638.6 361798363 361022415 360355492 359879608 361073189 362640610 363338394 363946228 365057678 361868706
3647.3 361868706 360973282 367389107 369518204 366650009 362057610 361568565 362378769 363809013 366326065
3655.9 366326065 362747498 362366562 364061470 364978790 365291557 363698730 363637314 363779373 364001465
3664.6 364001465 364230232 363322525 365208855 367392769 366423187 365530777 362559967 364261169 368041115
$$ packed form
3603.9C47529907J447373J015739j06926J64604J212044K0371P27577J104507k420921
3612.5C50694275l14255K622757j044083J19019J564941K08626J74713j465988Q35610
3621.2C53395615K624549Q69103m11453n27077O69823R95331K576599J546745p782097
3629.9C53957138Q74367K103844J655616M36211K40326J628494L95432N41000l4065
3638.6C61798363p75948o66923m75884J193581J567421O97784O07834J111450l188972
3647.3C61868706q95424O415825K129097k868195m592399m89045Q10204J430244K517052
3655.9C66326065l578567l80936J694908R17320L12767j592827o1416J42059K22092
3664.6C64001465K28767r07707J886330K183914r69582q92410k970810J701202L779946
$$ plain form
3673.3 368041115 370274277 367141838 357879639 360705414 365132523 366822739 366241951 366285896 366388168
3682 366388168 366641808 366902046 365868187 365579376 367615700 370179558 365995445 362769852 366066780
3690.6 366066780 365407753 364420013 365420837 365026512 365300484 366489639 368288918 367971497 366766510
3699.3 366766510 368741798 370003700 366530647 364490623 366223259 367308693 366640434 366259346 366695671
3708 366695671 368129463 367254944 368270302 368500366 363209343 364876099 366260185 366102066 366373520
3716.7 366373520 366997833 366105843 364304352 365671539 368568230 369223251 366748734 366672287 367865295
3725.4 367865295 369050064 367504921 366169739 365922470 365220146 367345047 367855225 367867851 371346092
3734 371346092 369273949 363467369 364018669 366137695 365541344 366036873 367357712 365395622 366553230
$$ packed form
3673.3C68041115K233162l132439r262199K825775M427109J690216n80788M3945J02272
3682C66388168K53640K60238j033859k88811K036324K563858m184113l225593L296928
3690.6C66066780o59027r87740J000824l94325K73972J189155J799279l17421j204987
3699.3C66766510J975288J261902l473053k040024J732636J085434o68259l81088M36325
3708C66695671J433792q74519J015358K30064n291023J666756J384086j58119K71454
3716.7C66373520O24313q91990j801491J367187K896691O55021k474517p6447J193008
3725.4C67865295J184769j545143j335182k47269p02324K124901N10178J2626L478241
3734C71346092k072143n806580N51300K119026n96351M95529J320839j962090J157608
$$ plain form
3742.7 366553230 370779343 372266464 365191803 364430122 365597076 368952217 368353691 363992653 367874374
3751.4 367874374 364767990 361820030 363422508 365066452 366685638 364621010 366760406 370688057
3759.1 370688057 369328156 367755470 366974945 366609421 367647667 368881187 365943413 364022408 365599823
3767.8 365599823 367499886 368936539 364983215 365308723 366684074 366321297 367326012 367461357 366794891
3776.5 366794891 366682205 368066673 367711258 364917946 366817398 367271118 366206741 367198219 367380981
3785.2 367380981 366762695 366569214 365970993 365660896 365700378 365912285 365658264 365345306 366117630 367152214
3794.8 367152214 368320618 366762619 363373985 364266243 366568146 368439407 367486763 364568672 364597015
3803.5 364597015 364642982 366162682 368877449 367528763 366007195 366690865 367154388 368333473 368498917
$$ packed form
3742.7C66553230M226113J487121p074661p61681J166954L355141n98526m361038L881721
3751.4C67874374l106384k947960J602478J643944J619186k064628K139396L927651
3759.1C70688057j359901j572686p80525l65524J038246J233520k937774j921005J577415
3767.8C65599823J900063J436653l953324L25508J375351l62777J004715J35345o66466
3776.5C66794891j12686J384468l55415k793312J899452M53720j064377R91478J82762
3785.2C67380981o18286j93481n98221l10097L9482K11907k54021l12958P72324J034584
3794.8C67152214J168404j557999l388634Q92258K301903J871261r52644k918091K8343
3803.5C64597015M5967J519700K714767j348686j521568O83670M63523J179085J65444
$$ plain form
3812.2 368498917 367111549 367190971 368392067 366000519 361371498 363607292 366433411 368202591 367615166
3820.8 367615166 361694450 363416862 365606804 366712723 368326530 367678528 364785652 363834953 364690056
3829.5 364690056 367238350 368064346 365362778 367246590 370348930 367951622 367397728 370721321 365733452
3838.2 365733452 362724152 365928383 364491310 364326172 366083450 365346222 364286118 364493942 364743996
3846.9 364743996 365432587 365870895 364072609 364705887 368545113 367106438 363813095 357173386 360520134
3855.6 360520134 365149498 364373474 363395309 364796028 366980858 368747177 365981674 364950104 366580658
3864.2 366580658 365038643 364284363 366156235 367396736 366687737 362136307 360050049 361949348 365436325
3872.9 365436325 367125397 363889694 365178337 366707191 365612450 365391197 366196327 364003601 362096291
$$ packed form
3812.2C68498917j387368P9422J201096k391548m629021K235794K826119J769180n87425
3820.8C67615166n920716J722412K189942J105919J613807o48002k892876r50699Q55103
3829.5C64690056K548294Q25996k701568J883812L102340k397308n53894L323593m987869
3838.2C65733452l009300L204231j437073j65138J757278p37228j060104K07824K50054
3846.9C64743996O88591M38308j798286O33278L839226j438675l293343o639709L346748
3855.6C60520134M629364p76024r78165J400719K184830J766319k765503j031570J630554
3864.2C66580658j542015p54280J871872J240501p08999m551430k086258J899299L486977
3872.9C65436325J689072l235703J288643J528854j094741k21253Q05130k192726j907310
$$ plain form
3881.6 362096291 364097862 365268860 366212120 366870384 363042488 364063644 364686699 364302101 366465569
3890.3 366465569 366926727 363234329 363133965 364439125 364110413 364005013 364429665 365405540 366308556
3898.9 366308556 363733406 364552612 364528160 363490143 365336189 363828850 364286308 364990425 365175667
3907.6 365175667 366929474 366589584 365251350 364876709 364799690 364586105 364417534 364784698 365515175
3916.3 365515175 364740410 363014984 364485893 365664024 364244347 364166222 363921852 363737640 363860588
3925 363860588 363265877 364102440 365280342 364960022 364302711 364668045 365511055 365437737 364407463 364183006
3934.6 364183006 364000816 364359856 365157928 364187241 363190231 363083839 363590431 363793221 361836243
3943.3 361836243 361680145 363015251 364528542 365015221 363631592 364403534 364648132 362992516 363005638
$$ packed form
3881.6C62096291K001571J170998R43260O58264l827896J021156O23055l84598K163468
3890.3C66465569M61158l692398j00364J305160l28712j05400M24652R75875R03016
3898.9C66308556k575150Q19206k4452j038017J846046j507339M57458P04117J85242
3907.6C65175667J753807l39890j338234l74641p7019k13585j68571L67164P30477
3916.3C65515175p74765j725426J470909J178131j419677p8125k44370j84212J22948
3925C63860588n94711Q36563J177902l20320o57311L65334Q43010p3318j030274k24457
3934.6C64183006j82190L59040P98072r70687r97010j06392N06592K02790j956978
3943.3C61836243j56098J335106J513291M86679j383629P71942K44598j655616J3122
$$ plain form
3952 363005638 363505363 363928871 362859573 362336311 363531380 363508148 364741669 365216560 363005295
3960.7 363005295 362603607 363253632 363517799 363584023 363803215 364808121 364386292 363130379 362470322
3969.3 362470322 362355843 363865013 364882317 363895226 363428459 363624535 364242706 364810295 364114876
3978 364114876 363624153 363317490 362767067 363929100 365694160 364924965 363361969 363649101 364277306
3986.7 364277306 364231873 364270248 365102196 364962425 363536148 364001770 364804649 365090141 365344849 364526138
3996.3 364526138 363605537 362909088 362979279 363371735
4000.2 363371735
$$ packed form
3952C63005638M99725M23508j069298n23262J195069k3232J233521M74891k211265
3960.7C63005295m01688O50025K64167O6224K19192J004906m21829j255913o60057
3969.3C62470322j14479J509170J017304r87091m66767J96076O18171N67589o95419
3978C64114876m90723l06663n50423J162033J765060p69195j562996K87132O28205
3986.7C64277306m5433L8375Q31948j39771j426277M65622Q02879K85492K54708q18711
3996.3C64526138r20601o96449P0191L92456
4000.2C63371735
##END=$$ End of the data block
