##TITLE=Caroteno Padrao $$ Begin of the data block
##JCAMP-DX=5.00 $$ ACD/SpecManager v 10.08
##SPECTROMETER/DATA SYSTEM=Alpha
##DATE=09 Oct 2014 08:27:22
##DATA TYPE=INFRARED SPECTRUM
##DATA CLASS=XYDATA
##ORIGIN=
##OWNER=
##NPOINTS=1765
##FIRSTX=399.76428223
##LASTX=3997.64306641
##MAXX=3997.64306641
##MINX=399.76428223
##MAXY=0.87149101
##MINY=0.49876061
##XFACTOR=1.0000000000
##YFACTOR=1.000000000000000e-9
##FIRSTY=0.78148544
##DELTAX=2.03961372
##XUNITS=1/CM
##YUNITS=ARBITRARY UNITS
##XYDATA=(X++(Y..Y))
399.8 781485438 781521678 780565143 779858768 780054986 779904962 778727293 778000474 778323531 778133810 777052343
420.2 777052343 776777983 776866078 775873661 774438441 774067819 774194360 773393631 772348285 772228897 771984220
440.6 771984220 770700634 769804955 770103276 770073831 769100308 768504202 768664837 768369794 767430961 767086625
461 767086625 767342627 767046571 766124487 765813649 766143322 765738845 764824152 764801145 765284479 764966369
481.3 764966369 764295757 764437735 764699876 764011323 763175368 763251603 763511896 762981772 762246788 762069345
501.7 762069345 761817992 760932684 760203958 760018349 759389579 758002341 756899774 756583035 756301641
520.1 756301641 755605102 755196810 755396307 755289197 754605412 754257143 754414678 754225135 753558159 753190458
540.5 753190458 753310025 753254414 752896667 752876103 753217459 753168643 752687573 752586603 752874553 752763569
560.9 752763569 752291858 752318263 752613187 751907587 750188768 748582125 747534513 746921480 747058988
579.3 747058988 748253465 749766171 750711858 751654744 753332555 754917204 755461454 755655408 756336629
597.6 756336629 756862044 756759584 757086635 758492112 760060549 761243463 762768507 764823198 766475916
616 766475916 767601609 769229591 771548867 773565888 774961948 776550829 778437555 779802978 780567467
634.3 780567467 781653285 783367813 784943402 786147416 787632227 789299548 790253639 790600240 791266263
652.7 791266263 792188048 792699277 793211281 794485033 795999527 796499908 795414388 794556916 795854151
671 795854151 797734916 799736261 801997781 803807318 804166377 803423703 803295076 804693222 806781352
689.4 806781352 808739364 810649395 812279642 813107610 813610554 814505160 815392017 815674365 815730453
707.7 815730453 816155851 816664815 816658020 816407144 816422582 816327214 815665066 814834416 814325154 813953698
728.1 813953698 813900471 815128267 817538440 819582522 820388079 820702612 821274519 821731865 821686983 821684182
748.5 821684182 822211623 822749615 822817624 822886646 823228776 823229849 822577238 821714282 820824265 819569468
768.9 819569468 818164706 817465186 817606151 817885637 818037570 818397343 818829000 818636477 817813694 817207813
789.3 817207813 817166209 817061126 816393018 815465748 814514279 813250065 811799288 810927331 810950160 811288655
809.7 811288655 811366081 811198235 810757875 809707999 808146000 806749344 805684865 804338932 803010046
828.1 803010046 802818418 803582072 804196596 804320753 804254413 803944945 802973568 801382720 799651921 797815859
848.5 797815859 795401514 792424738 789588451 787327588 785564840 784158409 782995641 781926155
864.8 781926155 780950367 780307949 779943407 779281974 777976274 776284695 774513483 773117900 772978365
883.2 772978365 774227858 775711358 776209712 775370419 773622513 771579325 769527256 767540574 765800238
901.5 765800238 764478266 763486028 762709141 762378454 762800694 763797045 764796436 765493512 765991628 766284764
921.9 766284764 766099095 765371740 764377296 763128459 761232853 758576930 755514443 752368212 749436259
940.3 749436259 746993721 744580925 740940094 736024320 731882334 728972435 724975407 718614161
956.6 718614161 710159779 699298680 685635984 672022283 664807498 666584849 672691345 677708805
972.9 677708805 680160165 681137085 682163954 683808744 685734332 687666714 689209700 689790845 689721346
991.3 689721346 690026939 690935850 691724181 692037523 692235887 692453623 692253411 691290617 689671457 687496126
1011.6 687496126 684877336 682566106 681506217 681594193 681709707 681003153 679566264 678049624 677120209
1030 677120209 677045524 677535713 677991211 677959561 677404284 676483810 675351620 674232543 673306704 672515392
1050.4 672515392 671628416 670467675 669113278 667756021 666345954 664738297 663055182 661581159
1066.7 661581159 660377622 659369946 658665657 658359826 658362508 658590555 659080744 659867525 660848737 661885738
1087.1 661885738 662999570 664231718 665435076 666474640 667503774 668712020 669975221 671131611
1103.4 671131611 672258496 673412025 674391210 674955785 675089002 674801886 673920929 672468305 670935690
1121.8 670935690 669843137 669323623 669292927 669690728 670262218 670633733 670854867 671299875 672037661 672671139
1142.2 672671139 672729433 672046006 670799792 669406712 668426335 668194950 668463111 668621182 668280661
1160.5 668280661 667570055 666853726 666253209 665644050 665152073 665216923 665986121 667178810 668748498
1178.9 668748498 670999408 673792303 676344872 678084433 679309726 680915773 683495879 686797440
1195.2 686797440 690198839 693359315 696199417 698643744 700592160 702066541 703200161 704029322
1211.5 704029322 704463363 704430938 704063594 703723073 703644395 703676164 703592598 703491986 703650117 704194427
1231.9 704194427 705102623 706233442 707323074 708087206 708319485 707975805 707109630 705777586 704098105
1250.3 704098105 702315390 700761139 699705899 699284017 699597299 700745642 702708423 705275416 708128214
1268.6 708128214 711050332 713946760 716801524 719744980 722856879 725945234 728705347 730934978
1285 730934978 732549608 733606577 734474599 735718727 737586498 739833474 742087960 744163513 745986462
1303.3 745986462 747487962 748689532 749642670 750316203 750717759 751068294 751699448 752680004 753651738
1321.7 753651738 754190505 754173994 753748178 753135324 752492785 751880586 751411617 751372218 751766801 751912773
1342.1 751912773 751075506 748900056 745259583 740195453 733888805 726430833 718188107 710312784
1358.4 710312784 703454912 696921647 690764606 686337769 684830964 686382651 689166725 691269875
1374.7 691269875 692429781 693233967 693689704 693720639 693975091 695696414 699974418 706676543 715207338
1393.1 715207338 724417984 732371688 738507152 742957115 746023774 748321891 749993801 751136720
1409.4 751136720 751931250 752476156 752808928 752896428 752871275 752938211 752958238 752764344 752505898 752078712
1429.8 752078712 751230240 749927461 747825861 744877934 741885245 738991559 736307800 733991742
1446.1 733991742 731823623 729825199 728031754 726543605 725436211 725250602 726647139 729731143
1462.4 729731143 734890997 741103709 746693194 752285302 759530783 768367112 778084159 788473725
1478.7 788473725 799139977 809375823 818224072 825733185 832115412 837074041 840555727 843347311
1495 843347311 845872760 847780168 849179745 850435078 851632953 852508903 852989435 853415549 853848636
1513.4 853848636 854219079 854566753 854868829 855001807 854985476 854983389 854981065 854938984 854813516 854526579 854309201
1535.8 854309201 854154468 853574514 852557838 851602912 850614250 849542618 848353684 847036660 845531642
1554.2 845531642 843881309 841459155 838356495 836611748 835607529 834679306 833458424 831603527
1570.5 831603527 829664469 827527225 824396729 821049452 817947686 814627707 811094165 807356715
1586.8 807356715 803446472 799480081 795476258 791292846 786954343 782565594 778031826 773271561
1603.2 773271561 768362105 763274252 757794380 751962483 746028185 739125609 730726182 723606884
1619.5 723606884 717937827 712390602 707802594 704595506 702635109 702246964 703300953 705311298
1635.8 705311298 707149088 708447933 709618092 710697234 711618721 712237120 712554812 712412775 711534262
1654.1 711534262 710552216 709536910 708167791 706148148 703631520 701144278 698332667 695113063
1670.5 695113063 692470431 690276086 688421428 687261820 686482072 685261369 682522833 678895593
1686.8 678895593 674632072 669263959 663495123 656538785 648536265 640568733 631629348 623931766
1703.1 623931766 616767704 608684301 601130188 594452143 588700235 583839238 579753101 577172220
1719.4 577172220 576236367 576440394 577729642 580349743 584329784 589709759 597523093 606608331 614624262
1737.8 614624262 623225212 632283211 640366852 647543192 654022694 660543084 667567313 675198853
1754.1 675198853 684303880 694622517 704605222 714174092 722534955 729714692 736778736 744018018
1770.4 744018018 751930654 759516060 765926301 771946371 777949989 783621728 788967669 794039488
1786.7 794039488 798620284 802949905 807292163 811292827 814912677 818433523 821891606 825249374
1803 825249374 828407407 831346869 834085345 836647689 838903368 840784371 842414737 843854785 845076680
1821.4 845076680 846050620 846907794 847783327 848745286 849804640 851026237 852403581 853766739 854994297
1839.8 854994297 856136143 857298076 858350039 859189391 859930277 860679090 861395299 862066388 862772644
1858.1 862772644 863535166 864238024 864799380 865287662 865742505 866142869 866460741 866767764 867113233 867455065
1878.5 867455065 867737532 867984593 868240416 868457437 868580878 868678451 868833780 868941903 868972361 869041741
1898.9 869041741 869186282 869290471 869309485 869341493 869415462 869465232 869493902 869574547 869653761 869687378 869726658
1921.3 869726658 869812429 869922459 869992673 870029390 870080650 870130062 870133460 870131075 870167077 870193899 870145977 870063782
1945.8 870063782 870011210 870000064 869987845 869942963 869898081 869863868 869821370 869758666 869701982 869659066 869590163 869486511
1970.3 869486511 869424403 869428337 869400203 869318724 869265020 869243383 869177282 869097292 869075775 869053245 868952334
1992.7 868952334 868826330 868763447 868745625 868694127 868622243 868601918 868582308 868480682 868366599 868337393 868341327
2015.2 868341327 868294835 868228495 868187129 868141413 868075609 868029952 868013799 867992163 867948532 867909193 867913187 867935181
2039.6 867935181 867898285 867844164 867860734 867883444 867852151 867838204 867890060 867946327 867957354 867963910 868005037 868053436
2064.1 868053436 868078411 868117630 868192196 868257344 868300200 868358493 868436873 868494630 868532777 868592024 868680477
2086.6 868680477 868766129 868821919 868861318 868904412 868957520 869021356 869090378 869151056 869197488 869234025 869277835
2109 869277835 869355321 869457662 869532764 869566441 869618297 869703650 869760871 869790792 869846463 869924009 869989812 870039225
2133.5 870039225 870096922 870167792 870217443 870239437 870281875 870359957 870415151 870432675 870468974 870544732 870601773
2155.9 870601773 870622933 870671093 870753825 870810628 870833099 870871663 870930970 870959163 870959580 871002018 871081769 871120811
2180.4 871120811 871121347 871165335 871252716 871292472 871280611 871303022 871358037 871362925 871344090 871385932 871446550 871451914
2204.8 871451914 871439576 871464789 871486247 871441424 871390462 871421516 871455669 871404588 871363342 871414065 871458709
2227.3 871458709 871433675 871433854 871485531 871491015 871417642 871353507 871340275 871317506 871272922 871277809 871326447 871317923
2251.8 871317923 871239185 871187270 871185064 871166229 871139109 871159792 871184289 871119201 871000171 870934665 870912910
2274.2 870912910 870883763 870863557 870844007 870777786 870679617 870590627 870515883 870408595 870250344 870107174 869980156
2296.6 869980156 869821966 869656980 869495094 869289160 869028091 868769944 868551552 868345618 868134737 867890179
2317 867890179 867550492 867136538 866791546 866609395 866457164 866202831 865916848 865588605 865125716 864739895
2337.4 864739895 864658713 864754200 864944458 865393579 865962625 866174519 865796089 865047514 864378154 863905370
2357.8 863905370 863524497 863349676 863519311 863876402 864251792 864677668 865147233 865554094 865865648 866175532
2378.2 866175532 866551220 866905332 867117286 867163241 867115021 867043018 866942406 866810679 866676271 866558790
2398.6 866558790 866450727 866319895 866173148 866044402 865913928 865771651 865641415 865517974 865388513 865258813
2419 865258813 865146697 865042448 864913285 864770293 864658535 864560246 864415884 864244580 864098608 863965094
2439.4 863965094 863776624 863538206 863350451 863219798 863061965 862880886 862724960 862569749 862367570 862154961
2459.8 862154961 861988544 861839712 861670494 861495972 861339390 861191213 861006916 860797405 860616267 860444725
2480.2 860444725 860246181 860035479 859849691 859695673 859519064 859309554 859121919 858948946 858753681 858547270
2500.6 858547270 858347297 858151913 857943952 857747495 857603490 857458770 857272744 857081473 856904030 856733620
2521 856733620 856554985 856362700 856172085 855981469 855796576 855639637 855469763 855266035 855078280 854903400
2541.4 854903400 854717195 854544818 854397535 854237854 854041815 853847086 853687286 853551507 853421271 853278577
2561.8 853278577 853121877 852972388 852836609 852715015 852615714 852509916 852375805 852253914 852152586 852011859
2582.2 852011859 851828456 851668358 851537347 851386607 851223648 851085901 850950420 850766063 850565791 850413442
2602.6 850413442 850260556 850063860 849882066 849745274 849604130 849421263 849221051 849049270 848897874 848711252
2623 848711252 848519683 848387837 848259211 848080695 847921193 847830474 847723305 847534180 847333968 847171187
2643.4 847171187 846997499 846786916 846575260 846395135 846189439 845911384 845640898 845412493 845177889 844955027
2663.7 844955027 844816387 844778538 844762087 844718277 844700575 844730198 844744384 844709456 844660223 844596803 844473481
2686.2 844473481 844327271 844239771 844186008 844066918 843876481 843689263 843489110 843216360 842906892 842621446
2706.6 842621446 842337072 841967404 841502428 841063023 840732872 840488851 840293229 840138376 840009570 839846015
2727 839846015 839639425 839462519 839320660 839165390 839017749 838903129 838809371 838730395 838650942 838565886 838466585
2749.4 838466585 838305175 838080764 837861121 837662458 837428808 837136984 836827457 836535335 836235702 835905850
2769.8 835905850 835593760 835314929 834982991 834564865 834139884 833747029 833322465 832820892 832279265 831683636
2790.2 831683636 830984712 830229700 829475760 828666449 827706933 826622486 825504184 824383557 823219538
2808.6 823219538 821889341 820272028 818329215 816062510 813655615 811563075 810159504 809363246
2824.9 809363246 808725834 807852387 806552470 804697394 802162111 798774779 794283271 788616538 782214522
2843.2 782214522 775868654 770276368 765664399 761683166 757717788 753304541 748375714 743134916
2859.5 743134916 737807214 732680202 728089094 724300802 721663833 720555365 720909595 722215831
2875.9 722215831 723970532 725737035 727065980 727664471 727485299 726628125 725176454 723095775 720311522
2894.2 720311522 716840506 712808371 708477914 704087913 699599624 694819450 689656973 684247375
2910.5 684247375 678827643 673509717 668337822 663416803 658768833 654312134 650015116 646003962
2926.8 646003962 642483473 639517188 637260318 636041403 635959029 636815727 638348222 640198350 641874075
2945.2 641874075 643137038 644327164 646056116 648424685 650895476 652950287 654446840 655566812
2961.5 655566812 656643987 658184052 660744131 664359093 668514311 672715604 676781356 680897176
2977.8 680897176 685304701 689982951 694941163 700280011 705900252 711628556 717270732 722600996
2994.2 722600996 727665782 732509792 737021923 741332650 745554984 749656498 753769815 757959008
3010.5 757959008 761913121 765268862 767997622 770234346 772007942 773383081 774507821 775528193
3026.8 775528193 776688218 778080881 779532194 780799031 781799257 782917500 784527123 786402583
3043.1 786402583 788031459 789217174 790162563 790952682 791485190 791811168 791998804 792073071 792159140 792344451
3063.5 792344451 792584360 792694032 792532206 792269707 792169809 792297125 792479455 792439342 792175949 791869879
3083.9 791869879 791485667 791073859 790748000 790336668 789799750 789363682 789102256 788821936 788352132 787847042
3104.3 787847042 787542880 787328303 786927402 786479771 786272585 786111653 785726547 785070062 784196854 783350289
3124.7 783350289 782688141 782079220 781381071 780656457 780024171 779504955 778946042 778103709 777049422
3143 777049422 776075482 775264740 774591267 773980498 773153305 772020161 770868719 769806743 768737674
3161.4 768737674 767684937 766674042 765639842 764554858 763445199 762314022 761155725 759989798
3177.7 759989798 758821249 757578731 756227016 754860103 753556013 752263427 750911415 749497771
3194 749497771 748046696 746588469 745130181 743656397 742171764 740684092 739181459 737683415 736190915
3212.4 736190915 734655738 733103335 731561780 729976654 728322983 726632118 724959075 723351777
3228.7 723351777 721846640 720395505 718770146 716924310 715120196 713462055 711872876 710342288
3245 710342288 708828747 707234740 705613971 704083979 702632606 701175451 699683011 698192000 696735978
3263.4 696735978 695331216 693993568 692716181 691353977 689812481 688203633 686586738 684983015
3279.7 684983015 683414698 681818247 680154800 678477645 676878870 675299287 673561513 671613276
3296 671613276 669507504 667375982 665371239 663497627 661535382 659237802 656644821 653986335 651408851
3314.4 651408851 648867726 646252871 643570840 640889287 638184786 635340035 632342815 629301190
3330.7 629301190 626220644 623128593 620129764 617068052 613767207 610324562 606822133 603345692
3347 603345692 599992514 596564591 592876017 589102387 585405529 581752598 578064322 574360192 570780694
3365.4 570780694 567301273 563702703 559905231 556138694 552628696 549328327 546143889 543047249
3381.7 543047249 540053785 537219167 534604311 532239497 529942334 527491629 525031447 522855043
3398 522855043 520912290 518849730 516613424 514546812 512743115 511029840 509363830 507770002 506260812
3416.3 506260812 504886150 503661990 502566755 501611471 500815034 500185311 499675035 499289274 499082357
3434.7 499082357 498957276 498813212 498760611 498930752 499324977 499862820 500475407 501215100 502087891 503031671
3455.1 503031671 504081964 505299091 506602049 507932365 509386003 510971189 512500048 513900340
3471.4 513900340 515383780 517025828 518776655 520591199 522385478 524236500 526224673 528236926
3487.7 528236926 530255914 532391250 534640133 536980808 539348960 541722238 544175506 546650171
3504 546650171 549077570 551622510 554390490 557290494 560219049 563132346 566079795 569152117 572439253
3522.4 572439253 575765789 578970194 582266688 585777104 589394987 593129218 596935928 600676000
3538.7 600676000 604502678 608568788 612764955 616834819 620736420 624737382 628932118 633164763
3555 633164763 637441099 641849160 646277964 650592625 654963613 659763873 664703012 669301867 673773646
3573.4 673773646 678420424 683195114 688041806 692964137 697817206 702580333 707399786 712148368
3589.7 712148368 716642797 721130490 725775719 730434299 734943986 739287496 743474126 747491717
3606 747491717 751547337 755666375 759689212 763574600 767175257 770688057 774383605 777832627 780811548
3624.4 780811548 783549547 786475837 789616704 792410374 794971645 797457755 799783051 801971018
3640.7 801971018 804055095 805986226 807777286 809657931 811580062 813156366 814472795 815898418
3657 815898418 817429721 818712294 819674909 820584059 821487367 822285652 823094010 823813021 824361324 825020492
3677.4 825020492 825805962 826601803 827449143 828364730 829307497 830045998 830566168 831174314 831823230 832323313
3697.8 832323313 832683980 833056986 833478153 833847106 834140480 834358990 834532559 834746540 834954441 835108340
3718.2 835108340 835206747 835240185 835249424 835325420 835507154 835687280 835781455 835855246 836073458 836387038 836517751
3740.6 836517751 836311102 836069584 836199820 836326420 836241543 836260080 836445630 836590946 836642206 836740494
3761 836740494 836872995 836910963 836857021 836744308 836673498 836756110 836918294 837056875 837083519 836947381 836745024
3783.5 836745024 836664021 836737275 836807430 836823523 836776018 836656511 836539745 836375773 836216390 836221576 836210608
3805.9 836210608 836173773 836216748 836206496 836082160 835993826 836007774 835863471 835693717 835761607 835806429 835730374
3828.3 835730374 835636973 835606158 835679054 835650206 835433781 835288227 835268140 835329413 835425913 835433781 835123599
3850.8 835123599 834396362 834113061 834524572 834827960 834797084 834599316 834464788 834389389 834238589 834140122
3871.2 834140122 834145188 834186375 834257603 834215820 834111333 834074914 834043384 834028602 833934128 833737552 833672881
3893.6 833672881 833735168 833711088 833531201 833304346 833175659 833213866 833307266 833304286 833242595 833185613 833071291
3916 833071291 832928956 832900405 832943618 832926691 832866490 832819641 832777143 832752705 832753420 832723498 832673848 832624495
3940.5 832624495 832542300 832507074 832543254 832530856 832471013 832473218 832532942 832540214 832494617 832467496 832436860 832387626
3965 832387626 832355142 832347393 832328975 832288980 832242966 832189143 832167208 832199693 832233965 832186580 832073212 831982195
3989.5 831982195 831932902 831929624 831943214 831901193
3997.6 831901193
##END=$$ End of the data block
