##TITLE=Carbonato de Bario $$ Begin of the data block
##JCAMP-DX=5.00 $$ ACD/SpecManager v 10.08
##SPECTROMETER/DATA SYSTEM=Alpha
##DATE=05 Aug 2014 10:59:30
##DATA TYPE=INFRARED SPECTRUM
##DATA CLASS=XYDATA
##ORIGIN=
##OWNER=
##NPOINTS=1765
##FIRSTX=399.75695801
##LASTX=3997.56933594
##MAXX=3997.56933594
##MINX=399.75695801
##MAXY=0.88168323
##MINY=0.20815364
##XFACTOR=1.0000000000
##YFACTOR=1.000000000000000e-9
##FIRSTY=0.81866270
##DELTAX=2.03957629
##XUNITS=1/CM
##YUNITS=ARBITRARY UNITS
##XYDATA=(X++(Y..Y))
399.8H18662703J716077R90451J607179O66976m41134P08759R86338j772106k988696
418.1H20136547O24597J567722l03329M71414J378476N4538k69949R73523O73473m58718
438.5H24848294J11521R01877m6730m75168P39515O29187q07584p40647L85821K88188
458.9H25834274l90768M38929Q62002p45058j380920q1897L76761j96993L99231J148165
479.3H26263726m6015r36449M50671Q85189p56145r00924N95689K93135r70602m73737
499.7H24404538M28199k27153o94394K99931M84347o65128p50721N8949k43306q09431
520.1H22285831k4200K80738q09610q40306J87338n2214r34720k91884Q87394K84612
540.5H20972979q80241m21226L68058k21491o06775N1677L3141o23703k64943O09934
$$ y = [818662703, 820378780, 821369231, 822976410, 823643386, 823202252, 823911011, 824897349, 823125243, 820136547, 820761144, 822328866, 822025537, 822496951, 823875427, 823929965, 823660016, 824633539, 825307012, 824848294, 824959815, 825861692, 825814962, 825339794, 826079309, 826708496, 825900912, 825160265, 825546086, 825834274, 825443506, 825882435, 826744437, 825999379, 824618459, 824536562, 824913323, 824716330, 825115561, 826263726, 826217711, 825281262, 825731933, 826617122, 825860977, 824960053, 825555742, 825848877, 824878275, 824404538, 824832737, 824605584, 823911190, 824211121, 824695468, 824030340, 823279619, 823338568, 823095262, 822285831, 822261631, 822542369, 821732759, 820892453, 821079791, 821027577, 820092857, 819800973, 820688367, 820972979, 820092738, 819671512, 820039570, 819818079, 819211304, 819262981, 819296122, 818672419, 818407476, 819017410]
560.9H19017410J89543p27355l29316K56240l29435o22511K05279M87447k67268k58624
581.3H17621410N10394J83464n20051j9252M03046l01718m58420L26574L14772l18408
601.7H17741811j0252O83487K54392m42743n8949q2433j446426j161635J197517J807868
622.1H18482637Q03471P95603J232862M34757m96448j20818Q7380q07523j074315m10854
642.5H18926752p14839j691043j215697P4923j26242p80821k79307K42590r5129n48601
662.9H13792586l794193j1522412p524491N747915L494978l070474n981863o379962
679.2G84762084p920384j3216853k3647130m7476053q3461225q3032966O67632J04971111
695.5F31646216J24063194O8977773K1538854N601584K202631M31418m61340n63085
$$ y = [819017410, 819206953, 818479598, 818150282, 818406522, 818077087, 817454576, 817659855, 818147302, 817880034, 817621410, 818131804, 818315268, 817795217, 817775965, 818179011, 817877293, 817418873, 817745447, 818060219, 817741811, 817731559, 818415046, 818669438, 818226695, 818167746, 818085313, 816638887, 815477252, 816674769, 818482637, 819286108, 820081711, 821314573, 821749330, 821252882, 821132064, 821219444, 820411921, 819337606, 818926752, 818211913, 816520870, 815305173, 815380096, 815253854, 814473033, 814193726, 814436316, 814341187, 813792586, 809998393, 798475981, 790951490, 796699405, 800194383, 797123909, 791142046, 784762084, 776841700, 763624847, 739977717, 692501664, 609040439, 526007473, 526675105, 631646216, 755709410, 824687183, 846226037, 851827621, 854030252, 854461670, 854000330, 853437245]
711.8H53437245q99136j195014j356959j237273n78285k22325k12014k82585n61476
730.2H46892178n02407l10600n87821q14915n79476m40300o71446o65963l45588l80933
750.6H41592729q16166q16822m72248o11246q82148o58095l53515m07279l85821j14500
771H36074889j82212o11663o38067l04282k97666n78284n65290l84093o11782q78632
791.4H31022918o99699n87344q69751r66310q35419r21011j180291j266957j274824
809.7H22421312j561403j870871j994609k256871k924442l649294m411698n661189
826G98090935p453621r160340j1097729j5608608k3621321k5739849j3973713p740795
842.3F83694959k1692932l8692892m7951519n2616000m9712390l2067060J054942L7588507
$$ y = [853437245, 852538109, 851343095, 849986136, 848748863, 848170578, 847948253, 847736239, 847453654, 846892178, 846389771, 846079171, 845491350, 844676435, 844096959, 843656659, 842985213, 842319250, 841973662, 841592729, 840776563, 839959741, 839487493, 838876247, 837994099, 837336004, 836982489, 836575210, 836189389, 836074889, 835892677, 835281014, 834642947, 834338665, 834040999, 833462715, 832897425, 832513332, 831901550, 831022918, 830323219, 829735875, 828866124, 827899814, 827064395, 826143384, 824963093, 823696136, 822421312, 820859909, 818989038, 816994429, 814737558, 811813116, 808163822, 803752124, 798090935, 790637314, 781476974, 770379245, 754770637, 731149316, 705409467, 691435754, 683694959, 662002027, 623309135, 575357616, 522741616, 473029226, 440962166, 442017108, 479605615]
858.7D79605615O0241521O1583459M8646092L3315361K2491038J6639352J3287901
872.9G35810339J0524035Q174479O480336M946232L650546L673494M387736L877282
889.3G81524479K581478J930356J706183J326799J175523J490354J542330J083732
905.6G94361234Q74281R16600M30286k80440l82841k90751o63340q86560m94718k71917
926G93311834n33104m99248j66059l52621q40306p46071m66049q34107j289368j136243
946.4G86448658j090050j726091k220273k324104k520025j982212j87218J309633J309216
964.7G77017534L49760l80635p49529j355350j624763j272559j216769j653850j629413
983.1G67484426j263797j467407j812219j480997j076996j376450j602769j289427
$$ y = [479605615, 539847136, 601430595, 650076687, 683392048, 705883086, 722522438, 735810339, 746334374, 754508853, 760989189, 765935421, 769585967, 773259461, 777647197, 781524479, 784105957, 786036313, 787742496, 789069295, 790244818, 791735172, 793277502, 794361234, 795235515, 796152115, 796582401, 796301961, 795919120, 795628369, 794965029, 794078469, 793583751, 793311834, 792778730, 792279482, 792113423, 791760802, 790920496, 790174425, 789708376, 788874269, 787584901, 786448658, 785358608, 783632517, 781412244, 779088140, 776568115, 774585903, 774398685, 775708318, 777017534, 777367294, 776986659, 776237130, 774881780, 773257017, 771984458, 770767689, 769113839, 767484426, 766220629, 764753222, 762941003, 761460006, 760383010, 759006560, 757403791, 756114364]
999.4G56114364j181543j553655j533091j135826j123309j231492j007676q90434j301944
1017.7G45155394j541078j265585j073242j430154j564145j237332j235605j633167
1034.1G34175086j676381j164674j011432j279831j333951j309157j771986k251923
1050.4G22375751l158212r807706k8113604l1583428M006505L1216800J9684375M159152
1066.7G08779633M9174j060188j612604j492381j341462j644671j743257j466453j416922
1085F97050869j728713j649916j388729j482248j746297j570582j322508j512528j685023
1103.4F82964325j535535j502931j771808j668751j249432j129032j380324j425505
1119.7F71301007j333832j557529j784385j592815j372814j565814j677930j494587
$$ y = [756114364, 754932821, 753379166, 751846075, 750710249, 749586940, 748355448, 747347772, 746457338, 745155394, 743614316, 742348731, 741275489, 739845335, 738281190, 737043858, 735808253, 734175086, 732498705, 731334031, 730322599, 729042768, 727708817, 726399660, 724627674, 722375751, 719217539, 709409833, 681296229, 649712801, 653719306, 684936106, 704620481, 708779633, 708828807, 707768619, 706156015, 704663634, 703322172, 701677501, 699934244, 698467791, 697050869, 695322156, 693672240, 692283511, 690801263, 689054966, 687484384, 686161876, 684649348, 682964325, 681428790, 679925859, 678154051, 676485300, 675235868, 674106836, 672726512, 671301007, 669967175, 668409646, 666625261, 665032446, 663659632, 662093818, 660415888, 658921301]
1136F58921301j506686j845836j948178j839221j944184k002001j725018j581252j856088
1154.4F42672837j970709j775086j813113k188266k327024k212286k289236k386570
1170.7F25710547k101958j716375j723945j918793j968384k035618k280175k370298
1187F09595001k258897k295613k452135k445162k353906k475501k664506k672255k609789
1205.4E87367237k625168k542674k290964k152205k261162k405584k465903k585113
1221.7E68038464k730847k767563k810180l017366l222704l256917l230512l230393
1238E43771982l162980l017247k992153l082871l098726l037811l096163l259897l332198
1256.4E15691936l298104k961397k349973k297461k928138l380030l423870l356069
$$ y = [658921301, 657414615, 655568779, 653620601, 651781380, 649837196, 647835195, 646110177, 644528925, 642672837, 640702128, 638927042, 637113929, 634925663, 632598639, 630386353, 628097117, 625710547, 623608589, 621892214, 620168269, 618249476, 616281092, 614245474, 611965299, 609595001, 607336104, 605040491, 602588356, 600143194, 597789288, 595313787, 592649281, 589977026, 587367237, 584742069, 582199395, 579908431, 577756226, 575495064, 573089480, 570623577, 568038464, 565307617, 562540054, 559729874, 556712508, 553489804, 550232887, 547002375, 543771982, 540609002, 537591755, 534599602, 531516731, 528418005, 525380194, 522284031, 519024134, 515691936, 512393832, 509432435, 507082462, 504785001, 501856863, 498476833, 495052963, 491696894]
1272.7D91696894l394157l503292l469587l304034l115773k933264k793491k782196
1289D66401100k852172k877026k795577k753675k821684k846420k822548k844781k894133
1307.4D40893084k858788k864897k945453k976895l004878l011257k963721k953291
1323.7D17313904k987951l025324l084838l054112k987713l165632l534019l489942
1340C91984373l022462k880394l055841l181159l195137l185421l192664l164798l179222
1358.3C63927275l450871l661245l209173k508015k076357k088637k433985k305120
1374.7C42193872k174288l014177l812224l843337l619850l579378l456980l299236
1391C15394402l804476m438698m404485m360855m302561m298687m433960m181295m372984
$$ y = [491696894, 488302737, 484799445, 481329858, 478025824, 474910051, 471976787, 469183296, 466401100, 463548928, 460671902, 457876325, 455122650, 452300966, 449454546, 446631998, 443787217, 440893084, 438034296, 435169399, 432223946, 429247051, 426242173, 423230916, 420267195, 417313904, 414325953, 411300629, 408215791, 405161679, 402173966, 399008334, 395474315, 391984373, 388961911, 386081517, 383025676, 379844517, 376649380, 373463959, 370271295, 367106497, 363927275, 360476404, 356815159, 353605986, 351097971, 349021614, 346932977, 344498992, 342193872, 340019584, 337005407, 333193183, 329349846, 325729996, 322150618, 318693638, 315394402, 311589926, 307151228, 302746743, 298385888, 294083327, 289784640, 285350680, 281169385, 276796401]
1409.3B76796401n120844n852521o911933r158358j1217907r597778p553384o214634
1425.7B15169042m247009k322495m45903R06006K067104L549903L968746M111647M483089
1444B27240130N045936O081372O790668O748229O436378P611185R297580P235795N292654
1462.4B87779927N535603O119788N337327M623533N427002O463945O451518O176769
1478.7C33915412N880237N534470M720509M052222M238188M821986M193485L281951
1495C70638460L561586M173547L900796K809793K079308L725559N612492N734325O053954
1513.4D08289820P033497Q467227Q810967R312600R026051P612824P231892O187140
1529.7D71972018N145610N477071M906237L134519L408759N357415N409837M736721
$$ y = [276796401, 271675557, 265823036, 258911103, 249752745, 238534838, 228937060, 221383676, 215169042, 210922033, 208599538, 208153635, 209059641, 211126745, 214676648, 218645394, 222757041, 227240130, 232286066, 238367438, 245158106, 251906335, 258342713, 265953898, 275251478, 282487273, 287779927, 293315530, 299435318, 304772645, 309396178, 314823180, 321287125, 327738643, 333915412, 339795649, 345330119, 350050628, 354102850, 358341038, 363163024, 367356509, 370638460, 374200046, 378373593, 382274389, 385084182, 387163490, 390889049, 396501541, 402235866, 408289820, 415323317, 423790544, 432601511, 441914111, 450940162, 458552986, 465784878, 471972018, 477117628, 482594699, 487500936, 490635455, 494044214, 499401629, 504811466, 509548187]
1546E09548187L810585L250718K852797K306164J486480J987755N277992N070626L634334
1564.3E39225638K947986K579689L216147L232420K401054L043175L962159L482103
1580.7E64090371K849758K528667K360523K135754J900673J792132J794279J685977
1597E81138134J515925J456022J455248J258611J083076J203835J233757P37428L49880
1615.3E91431916J326322K134502J709759J813770K178252J905441J969814K165973
1631.6F06635749K223313L803551N701304N353212M553676L974259M854500O793916
1648F43893480N507946M752159Q441925Q281470N900323N105853N526364N912900M633308
1666.3F97955728L908217M952013M942238M516721N055547M468739K920747K136409
$$ y = [509548187, 513358772, 516609490, 519462287, 521768451, 523254931, 525242686, 530520678, 535591304, 539225638, 542173624, 544753313, 547969460, 551201880, 553602934, 556646109, 560608268, 564090371, 566940129, 569468796, 571829319, 573965073, 575865746, 577657878, 579452157, 581138134, 582654059, 584110081, 585565329, 586823940, 587907016, 589110851, 590344608, 591082036, 591431916, 592758238, 594892740, 596602499, 598416269, 600594521, 602499962, 604469776, 606635749, 608859062, 612662613, 618363917, 623717129, 628270805, 632245064, 637099564, 643893480, 649401426, 654153585, 662595510, 670876980, 676777303, 681883156, 687409520, 693322420, 697955728, 701863945, 706815958, 711758196, 716274917, 721330464, 725799203, 728719950, 730856359]
1682.6G30856359M184663N472780M208386L687977K884507J901269J866043K674460
1699G57736444M333020M169881L219187L639877L578544K582550J504362R37879K206981
1717.3G83908725M107296L925145L400624L241658K732158K288878J924872K731979
1733.6H08261335M685581M433453L659725J653016q148849k9632450m6619534l4640312
1749.9G03651965n396664O338357Q315146J6340256K3002207K1841705J4426709P809400
1766.3G96329081M907787L466129L473044M199803L575265K481520K042949K168596
1782.6H22644174K138734J888633J275897P23779J325726K059162J713753J226663
1798.9H34996521J318694J683950J671791J262367Q60810R90570J390397J291752R84192
$$ y = [730856359, 735041022, 740513802, 744722188, 748410165, 751294672, 753195941, 755061984, 757736444, 762069464, 766239345, 769458532, 773098409, 776676953, 779259503, 780763865, 781701744, 783908725, 788016021, 791941166, 795341790, 798583448, 801315606, 803604484, 805529356, 808261335, 812946916, 817380369, 821040094, 822693110, 814544261, 784911811, 738292277, 703651965, 698255301, 704593658, 712908804, 729249060, 752251267, 774092972, 788519681, 796329081, 801236868, 804702997, 808176041, 812375844, 815951109, 818432629, 820475578, 822644174, 824782908, 826671541, 827947438, 828671217, 829996943, 832056105, 833769858, 834996521, 836315215, 837999165, 839670956, 840933323, 841794133, 842784703, 844175100, 845466852, 846451044]
1817.2H46451044R98914Q98958M81307M13597N70357P83562J415730J501560J050174
1835.6H54565203Q61347O12259N9962Q3685J007855J368761J152277R45449O94215
1854H61351013N41985N73993O45101N46575K41935j56582j2159R07183J310348R61304
1874.4H66910696N85198M23551M44710M82381L75926J66595J35362M67003N66721M09901
1894.7H70968044N05388N04732L22103K91109L10541J69396J61171M46319M90725Q7798
1915.1H74257326j13428K49386L89397L37363N20468M85360K40505J47164K11060K15947
1935.5H76940548J02282p5758j20937J73151M20094L82781K62141J20580Q3029J81497
1955.9H78469408J98483J30594J08361L7551o7294O4016K82168K53856R3341L6240
$$ y = [846451044, 847449958, 848348916, 848830223, 849243820, 849814177, 850597739, 852013469, 853515029, 854565203, 855426550, 856038809, 856098771, 856182456, 857190311, 858559072, 859711349, 860656798, 861351013, 861892998, 862466991, 863112092, 863658667, 863900602, 863744020, 863731861, 864639044, 865949392, 866910696, 867495894, 867919445, 868364155, 868846536, 869222462, 869389057, 869524419, 869991422, 870558143, 870968044, 871473432, 871978164, 872300267, 872591376, 872901917, 873071313, 873232484, 873678803, 874169528, 874257326, 874143898, 874393284, 874782681, 875120044, 875640512, 876125872, 876366377, 876513541, 876724601, 876940548, 877042830, 876967072, 876846135, 877019286, 877439380, 877822161, 878084302, 878204882, 878287911, 878469408, 878667891, 878798485, 878906846, 878944397, 878877103, 878941119, 879223287, 879477143, 879570484, 879606724]
1976.3H79606724R7871R3221K3663L4631M5001q7440j70350P7724L02494J58250M1962
1998.8H80223751J25885R3401k5630J132P2897J7344n4895m2677J132K0862N0783J05917
2023.2H80589902N3585k6941M9114J26302R596q3982J3768O0439j0907P867R2388N0664
2047.7H80931795m7803j7107M8638k4081q2552J8835N7995p7903r9003M6670K205k01404
2072.2H80556285k50935k08378l16322m83394m87864n06460p09594p15851k91825J12892
2092.6H76698554K28762L47376N58972N34356L26097L19064L92139K48551Q1599J72198
2113H79907668K95043K10046J37568J99377J58191K2531Q5354K13146Q8870o3300O5923
2135.4H81320417J61886j0848p9512R6499J27852n0783m8101J12534N3286j11997l1888
$$ y = [879606724, 879704595, 879797816, 879821479, 879856110, 879901111, 879813671, 879643321, 879721045, 880023539, 880181789, 880223751, 880349636, 880443037, 880417407, 880418539, 880491436, 880508780, 880453885, 880411208, 880412340, 880433202, 880483985, 880589902, 880643487, 880616546, 880665660, 880791962, 880801558, 880717576, 880731344, 880791783, 880780876, 880788743, 880881131, 880931795, 880883992, 880866885, 880915523, 880891442, 880808890, 880827725, 880885720, 880807817, 880708814, 880755484, 880757689, 880556285, 880305350, 880096972, 879780650, 879297256, 878809392, 878302932, 877593338, 876877487, 876585662, 876698554, 876927316, 877274692, 877833664, 878368020, 878694117, 879013181, 879405320, 879653871, 879735470, 879907668, 880202711, 880412757, 880550325, 880749702, 880907893, 880930424, 881015778, 881228924, 881317794, 881254494, 881320417, 881482303, 881471455, 881391943, 881488442, 881616294, 881565511, 881517410, 881629944, 881683230, 881571233, 881539345]
2157.9H81539345J00970l099j10031K027M6194j16766j25945N6506M8756r8228l0935
2180.3H81308794R6381j8001j56522n9425K6941j20163j75774L2127J03593p1645r4354
2202.7H80871952M1425j1862j37627j5914R4712q9765j95801m947O9081j39415k02119
2225.2H80279720m4406o9081k32101j56999J2815p5101k22147j57058j18494k95758
2245.6H78921390l53277j97947k13802l95060m00841l00467l94583n34415m23670k55823
2265.9H75451505l14116l39210r7931O1155p391O8903K84135J26243m58181r17137
2286.3H73857975j047254j180946j345814j364827j461506j766741j975656k117335
2302.7H61597896k638460l407180l825664l664732l171981l048658l998876n380153
$$ y = [881539345, 881640315, 881637216, 881527185, 881529212, 881575406, 881458640, 881332695, 881389201, 881437957, 881339729, 881308794, 881405175, 881387174, 881230652, 881171227, 881198168, 881078005, 880902231, 880934358, 881037951, 880966306, 880871952, 880913377, 880901515, 880763888, 880747974, 880842686, 880752921, 880557120, 880552173, 880621254, 880481839, 880279720, 880235314, 880166233, 879934132, 879777133, 879789948, 879714847, 879492700, 879335642, 879217148, 878921390, 878568113, 878370166, 878156364, 877761304, 877360463, 877059996, 876665413, 876130998, 875707328, 875451505, 875137389, 874798179, 874700248, 874761403, 874754012, 874822915, 875107050, 875233293, 874775112, 873857975, 872810721, 871629775, 870283961, 868919134, 867457628, 865690887, 863715231, 861597896, 858959436, 855552256, 851726592, 848061860, 844889879, 841841221, 837842345, 832462192]
2319H32462192n606890m352093l193140l442824l923356k878487j410723j441062k035021
2337.3H04178596j896084r07481J996160P243991Q028209O03020q591115j2797475
2353.6G97857821j1041343p261276l170014O02782L671348O226480Q196771R306133
2370H04388702R656489R491443R157718Q826971Q201718O789327M720449K654016J113951
2388.3H65000784K19405j77681l06189l72291m50015n07295n26309n73039o60360p70450
2408.7H60876560r07659j089931j333475j535654j494885j390159j558005j612723
2425H49954069j426697j825869l134966m942298p009268q813381r602726r609460r932578
2443.4G93656826j1195719j1944890q444429N31972R543001J2899876J1439562Q746028
$$ y = [832462192, 826855302, 822503209, 819310069, 815867245, 811943889, 809065402, 807654679, 806213617, 804178596, 802282512, 801375031, 803371191, 810615182, 818643391, 819246411, 810655296, 797857821, 786816478, 779555202, 776385188, 776987970, 780659318, 786885798, 795082569, 804388702, 814045191, 823536634, 832694352, 841521323, 849723041, 856512368, 861232817, 863886833, 865000784, 865220189, 865042508, 864736319, 864364028, 863914013, 863406718, 862880409, 862307370, 861647010, 860876560, 859968901, 858878970, 857545495, 856009841, 854514956, 853124797, 851566792, 849954069, 848527372, 846701503, 843566537, 838624239, 831614971, 822801590, 813198864, 803589404, 793656826, 782461107, 770516217, 762071788, 762603760, 772146761, 785046637, 796486199, 805232227]
2459.7H05232227O442785M604638L178060K146125J259267O51061J278580L173530
2476H27966273M656911M692197L851234K924324K263724J899243J623213J248062P35461
2494.4H51860642J98245j18017q8334J30356K79903K71022K46406K70426J71542m1186
2514.8H53181005j31429j15335k12371l63112l43382k62558l26217l78072k71439j96159
2535.2H50580931k37465k10941j04785r2030j30772l7015J05560Q9407N5969K18272
2555.6H50237131L92676M05430M82917P54297R03785Q23021Q26061Q89420P19905M37141
2576H56871784L19183K35736j4603k07722j67549j54674k97010l21627j82628j87993
2596.4H55892897l10421k69533j83284k84135l56615k15769j45435k61724k97487k07543
$$ y = [805232227, 811675012, 816279650, 819457710, 821603835, 822863102, 823514163, 824792743, 827966273, 832623184, 837315381, 841166615, 844090939, 846354663, 848253906, 849877119, 851125181, 851860642, 852058887, 851940870, 851852536, 851982892, 852262795, 852533817, 852780223, 853050649, 853222191, 853181005, 853049576, 852934241, 852721870, 852358758, 852015376, 851752818, 851426601, 851048529, 850777090, 850580931, 850343466, 850132525, 850027740, 849935710, 849804938, 849767923, 849873483, 849962890, 850018859, 850237131, 850629807, 851035237, 851518154, 852272451, 853176236, 853999257, 854825318, 855714738, 856434643, 856871784, 857190967, 857426703, 857412100, 857204378, 857036829, 856882155, 856585145, 856263518, 856080890, 855892897, 855582476, 855312943, 855129659, 854845524, 854488909, 854273140, 854127705, 853865981, 853568494, 853360951]
2616.8H53360951k21252l21806k77340j60337k02238k81334j90318j18613k24710k69294
2637.1H51093709j67429j79410l16858k92301j58906j92225k91706k35497j66417k47180
2657.5H48845780k84016j94311j90437k92242k73824j66416k13921l18825k56896j93477
2677.9H46461415k86042k99633j71900j66774k77280k63751j76132k22027l21329l02553
2698.3H43973994k25901k35379k79188k47240k36333l08752l15845k43544k55585l21388
2718.7H41304839l00050k59996l07858l25560k35200k09510l27707m23848m21882m24802
2739.1H38068426m37558l23236j39892j17183k05815k42591k58624l12388l58582l59475
2759.5H35313082l84689m53710m86136m77969n08190n87880o37472o35028o94573q29041
$$ y = [853360951, 853139699, 852817893, 852540553, 852380216, 852177978, 851896644, 851706326, 851587713, 851363003, 851093709, 850926280, 850746870, 850430012, 850137711, 849978805, 849786580, 849494874, 849259377, 849092960, 848845780, 848561764, 848367453, 848177016, 847884774, 847610950, 847444534, 847230613, 846911788, 846654892, 846461415, 846175373, 845875740, 845703840, 845537066, 845259786, 844996035, 844819903, 844597876, 844276547, 843973994, 843748093, 843512714, 843233526, 842986286, 842749953, 842441201, 842125356, 841881812, 841626227, 841304839, 841004789, 840744793, 840436935, 840111375, 839876175, 839666665, 839338958, 838915110, 838493228, 838068426, 837630868, 837307632, 837167740, 837050557, 836844742, 836602151, 836343527, 836031139, 835672557, 835313082, 834928393, 834474683, 833988547, 833510578, 833002388, 832414508, 831777036, 831142008, 830447435, 829618394]
2779.9H29618394r31322j023054j166344j330674j442671j536130j715899j928151
2796.2H18544149k006173j843571j517535j397311j869381k747893l360689l309250
2812.5H00492346k720296j883030r83894l0100J057446K163827K928138L095746K749801
2830.9H06869984K169072J562238J040220P15077N31852L08693N7638p1943j431J62781
2851.3H13344181K30610J13785j77204m61042n88835o57260p10011p11262p11739p05421
2871.7H08965802n32269j85967O1572J20699J53899K45929L51310M07040M52280N31137
2892.1H10571432N93782O58810P56800P83861P13527O61373O66320O09756M11987K14279
2912.5H16641927J58667J57237J13547P9811N9843K0981l9041n8770N5015J70946J64211
$$ y = [829618394, 828687072, 827664018, 826497674, 825167000, 823724329, 822188199, 820472300, 818544149, 816537976, 814694405, 813176870, 811779559, 809910178, 807162285, 803801596, 800492346, 797772050, 795889020, 794905126, 794875026, 795932472, 798096299, 801024437, 804120183, 806869984, 809039056, 810601294, 811641514, 812356591, 812888443, 813197136, 813254774, 813182831, 813181400, 813344181, 813574791, 813688576, 813511372, 813050330, 812461495, 811804235, 811094224, 810382962, 809671223, 808965802, 808433533, 808247566, 808309138, 808429837, 808583736, 808829665, 809180975, 809588015, 810040295, 810571432, 811165214, 811824024, 812580824, 813364685, 814078212, 814739585, 815405905, 816015661, 816427648, 816641927, 816800594, 816957831, 817071378, 817151189, 817211032, 817232013, 817192972, 817134202, 817189217, 817360163, 817524374]
2934.9H17524374J32083R1792j7405j08898j05798r7871j48058j98841j78516j71542
2955.3H16721320k33710k31802j65463j26302p7426r358L814k2709k6643r775k7836
2977.8H15794110q0883q1480o1035j11580j75595k14875k42412k36630k33770k18212
2998.1H14137638k02477k67148l00825k55883l18706m52459m19557k55406j63912j91987
3018.5H11309278k53916l20554l80635l77357l64780l83675l56615k84731k80142l50773
3038.9H07956100l96431l75926l34323l50654l89755l50118k99215l48925m13776l91185
3059.3H04305792l61383m21107m77075m12882l44634l76165m03106l92258m10259m30644
3079.7H00276279m06742l71396m03762m55439m45604m54665n02109m90010m57942m81487
$$ y = [817524374, 817656457, 817748249, 817730844, 817621946, 817516148, 817418277, 817270219, 817071378, 816892862, 816721320, 816487610, 816255808, 816090345, 815964043, 815886617, 815877259, 815881073, 815858364, 815831721, 815821946, 815794110, 815713227, 815631747, 815570712, 815459132, 815283537, 815068662, 814826250, 814589620, 814355850, 814137638, 813935161, 813668013, 813367188, 813111305, 812792599, 812340140, 811920583, 811665177, 811501265, 811309278, 811055362, 810734808, 810354173, 809976816, 809612036, 809228361, 808871746, 808587015, 808306873, 807956100, 807559669, 807183743, 806849420, 806498766, 806109011, 805758893, 805459678, 805110753, 804696977, 804305792, 803944409, 803523302, 803046227, 802633345, 802288711, 801912546, 801509440, 801117182, 800706923, 800276279, 799869537, 799498141, 799094379, 798638940, 798193336, 797738671, 797236562, 796746552, 796288610, 795807123]
3100.1G95807123m76837m26233m31537m91441n37276n38528n28216n57423n87583n84661
3120.5G90647388o01352o54518o51479n85199n91397o34849o03557n74827o02901n95450
3140.9G84551859n23150m85957n31733n64635n48839o10471p44402p66754o77288o83010
3161.3G78415620q13067q46207p69973p77959q32618q39352q90911r78589r66430r02891
3181.7G69797623r27389r92655r76801r54569j027643j104951j112640j102626j111448
3200.1G60486901j103044j056432j066387j151443j138925j064658j110495j184105
3216.4G51611412j161159j105308j114011j178086j174867j130104j155496j186311
3232.7G42406070j196205j209677j183629j120686j062811j045644j066446j072586
$$ y = [795807123, 795330286, 794904053, 794472516, 793981075, 793443799, 792905271, 792377055, 791819632, 791232049, 790647388, 790046036, 789391518, 788740039, 788154840, 787563443, 786928594, 786325037, 785750210, 785147309, 784551859, 784028709, 783542752, 783011019, 782446384, 781897545, 781287074, 780542672, 779775918, 779098630, 778415620, 777602553, 776756346, 775986373, 775208414, 774375796, 773536444, 772645533, 771666944, 770700514, 769797623, 768870234, 767877579, 766900778, 765946209, 764918566, 763813615, 762700975, 761598349, 760486901, 759383857, 758327425, 757261038, 756109595, 754970670, 753906012, 752795517, 751611412, 750450253, 749344945, 748230934, 747052848, 745877981, 744747877, 743592381, 742406070, 741209865, 740000188, 738816559, 737695873, 736633062, 735587418, 734520972, 733448386]
3249G33448386j019239r63986r46045r26733r15468r13977q79884q21889p97212q07881
3269.4G24456072q51393r27091r89317r87649r42409r77159j080871j089692j015186
3287.8G15595305j008093j109243j237154j359820j477659j486003j377583j356184
3304.1G05183566j541615j778841j886487j927257j965165j977026k007008k074063
3320.4F90026104k111136k122581k257526k466083k525508k488554k480924k489686
3336.7F71084106k587616k754987k870381k952575k933741k806902k879739l181815
3353F48116350l336608l245473l157854l242672l294408l092527k917469l071904l357709
3371.4F19399726l383696l105282k813876k686620k675652k596140k383173k108395
$$ y = [733448386, 732429147, 731465161, 730519116, 729592383, 728676915, 727762938, 726883054, 726061165, 725263953, 724456072, 723604679, 722677588, 721688271, 720700622, 719758213, 718781054, 717700183, 716610491, 715595305, 714587212, 713477969, 712240815, 710880995, 709403336, 707917333, 706539750, 705183566, 703641951, 701863110, 699976623, 698049366, 696084201, 694107175, 692100167, 690026104, 687914968, 685792387, 683534861, 681068778, 678543270, 676054716, 673573792, 671084106, 668496490, 665741503, 662871122, 659918547, 656984806, 654177904, 651298165, 648116350, 644779742, 641534269, 638376415, 635133743, 631839335, 628746808, 625829339, 622757435, 619399726, 616016030, 612910748, 610096872, 607410252, 604734600, 602138460, 599755287, 597646892]
3387.7E97646892j883745j932442k147079k119601j805424j597584j833081k134561
3404E82193375j967132j616240j466513j453340j534462j592874j432777j217961j052260
3422.4E68859816q12471n72503m45723m29631l20732j35720k02358m01020l26335k3604
3442.8E65189719K05755L67940N37932O19173O09994O50048Q08775R51648R11415R65893
3463.2E71818292J308561J484990J184821P79748Q01801J181424J517713J425922J053512
3481.5E82556784J090646J391411J386165J329661J523197J686573J694083J622915
3497.8E94281435J498044J437783J512170J582384J573980J643955J793683J719773
3514.2F07043207J481831J418233J505017J592040J527667J438260J637578J936197
$$ y = [597646892, 595763147, 593830705, 591683626, 589564025, 587758601, 586161017, 584327936, 582193375, 580226243, 578610003, 577143490, 575690150, 574155688, 572562814, 571130037, 569912076, 568859816, 568047345, 567474842, 567029119, 566599488, 566278756, 566143036, 565940678, 565539658, 565213323, 565189719, 565395474, 565763414, 566301346, 566920519, 567530513, 568180561, 568989336, 569940984, 570852399, 571818292, 573126853, 574611843, 575796664, 576576412, 577378213, 578559637, 580077350, 581503272, 582556784, 583647430, 585038841, 586425006, 587754667, 589277864, 590964437, 592658520, 594281435, 595779479, 597217262, 598729432, 600311816, 601885796, 603529751, 605323434, 607043207, 608525038, 609943271, 611448288, 613040328, 614567995, 616006255, 617643833, 619580030]
3530.5F19580030J994491J945794J919865J872599J851380J739741J597523J670480
3546.8F34171903J875043J990736K085030K175092K182663K186894K093613J677812
3563.1F50438786J351773K154589L350973L253579K630115K480864K599538K670109
3579.4F70930326K658784K316773J778424K068937L012240K935648K458274K656698
3595.7F90816104L014803L053546L050208K793432K254665K322316K817631K774596
3612.1G12897301K429545J930356J779020K487897K665222J762331O79552R25422K825260
3630.4G30381906L276587K644479K220154J894533J644314J220345K80678o72519o0499
3648.8G42829978K006889K297580J336277J270473J581549J084924M54485l5286q16166
$$ y = [619580030, 621574521, 623520315, 625440180, 627312779, 629164159, 630903900, 632501423, 634171903, 636046946, 638037682, 640122712, 642297804, 644480467, 646667361, 648760974, 650438786, 651790559, 653945148, 657296121, 660549700, 663179815, 665660679, 668260217, 670930326, 673589110, 675905883, 677684307, 679753244, 682765484, 685701132, 688159406, 690816104, 693830907, 696884453, 699934661, 702728093, 704982758, 707305074, 710122705, 712897301, 715326846, 717257202, 719036222, 721524119, 724189341, 725951672, 726631224, 727556646, 730381906, 733658493, 736302972, 738523126, 740417659, 742061973, 743282318, 743562996, 742890477, 742829978, 744836867, 747134447, 748470724, 749741197, 751322746, 752407670, 752862155, 752826869, 752010703]
3667.1G52010703j183212l71694k46048m31419R21190J635790J188278N21243k39432
3685.5G53805399q33571n83470N79953J138270P30098N8829m07576k42055L86238L14892
3705.9G54947007m47810p36892M35948J559556Q67188n10276j309633j250625p70807
3724.2G52783656j35600K98559j01268r51290p57039J028836J927137P23839r45330
3742.6G53871500r50753K79128q9228k75790J132607J354396L54231j8060M20928L05891
3763G56384850k50817l67880j56939K99871N16534Q5175m10557m06205o9380n4538
3783.4G55570114p0036J96040K59220p3611o65248j021027q84712r46283o08266L17037
3803.8G52073228L16918M31061P79927J05083j013160j254618p70569p40230L1531
$$ y = [752010703, 750827491, 750455797, 750209749, 749778330, 750699520, 752335310, 753523588, 754044831, 753805399, 752971828, 752388358, 752968311, 754106581, 754836679, 754895508, 754487932, 754245877, 754632115, 754947007, 754499197, 753762305, 754198253, 755757809, 756624997, 756114721, 754805088, 753554463, 752783656, 752648056, 752946615, 752845347, 751894057, 751137018, 752165854, 754092991, 754816830, 753871500, 752920747, 753199875, 753110647, 752834857, 753967464, 755321860, 755676091, 755658031, 756078959, 756384850, 756134033, 755766153, 755609214, 755909085, 756425619, 756510794, 756100237, 755694032, 755624652, 755570114, 755500078, 755696118, 755955338, 755881727, 755216479, 754195452, 753310740, 752364457, 751756191, 752073228, 752390146, 752821207, 753601134, 753706217, 752693057, 751438439, 750667870, 749927640, 749959171]
3822.1G49959171Q72493M87566J549l75986o53565p32362r79006p76112K22683Q51988
3842.5G48878419R11892N15222m60267j820564k262533K16186J869202J005948k14398
3860.9G48639107p81954m00543j71184m34339l0518N56350O28710J76191n63800m12941
3881.3G47205079O7532P6651J79470j56880l87370K44796K66373o78956j263917q72433
3901.7G44680345N3406R40978J071811N64218K9742m58598p94172n29409K802N1141
3922.1G45612264j05024n126n9724l27050j18256L51548K58744j93059m83990l94702
3942.5G44535625n1498J9013p3373L0577R0123l2068j17659r8348j14679j20879n0485
3964.9G44016349m7326j47700j89662j23203n7757n8293j04427r3341k0206l9161j68085
$$ y = [749959171, 750831664, 751319230, 751320779, 750944793, 750291228, 749558866, 748579860, 747803748, 748026431, 748878419, 749790311, 750305533, 749845266, 748024702, 745762169, 745978355, 747847557, 748853505, 748639107, 747857153, 747456610, 747285426, 746851087, 746820569, 747376919, 748005629, 748181820, 747618020, 747205079, 747272611, 747349262, 747528732, 747371852, 746984482, 747229278, 747495651, 746816695, 745552778, 744680345, 744733751, 745674729, 746746540, 747310758, 747340500, 746881902, 746087730, 745558321, 745561123, 745612264, 745507240, 745502114, 745442390, 745115340, 744997084, 745348632, 745607376, 745414317, 744930327, 744535625, 744484127, 744503140, 744429767, 744460344, 744550467, 744518399, 744400740, 744302392, 744187713, 744066834, 744016349, 743969023, 743821323, 743631661, 743508458, 743450701, 743392408, 743287981, 743194640, 743174434, 743135273, 742967188]
3987.3G42967188k31206j84178j26422o8724l7015
3997.5G42319643
$$ y = [742967188, 742735982, 742551804, 742425382, 742356658, 742319643]
##END=$$ End of the data block
