##TITLE=Caprolactama $$ Begin of the data block
##JCAMP-DX=5.00 $$ ACD/SpecManager v 10.08
##SPECTROMETER/DATA SYSTEM=Alpha
##DATE=22 Sep 2014 15:27:48
##DATA TYPE=INFRARED SPECTRUM
##DATA CLASS=XYDATA
##ORIGIN=
##OWNER=
##NPOINTS=1765
##FIRSTX=399.76428223
##LASTX=3997.64306641
##MAXX=3997.64306641
##MINX=399.76428223
##MAXY=0.85009044
##MINY=0.33539942
##XFACTOR=1.0000000000
##YFACTOR=1.000000000000000e-9
##FIRSTY=0.83404869
##DELTAX=2.03961372
##XUNITS=1/CM
##YUNITS=ARBITRARY UNITS
##XYDATA=(X++(Y..Y))
399.8H34048688P261753M903019J704931L04222R16481R51350o70612j825809p24972
418.1H46869051Q44837k71201j370609k53439J2338k952158m877627j580418L012598
436.5H39433372L080487O28054O40274J696348K91168j468718o09338R61542r0778
454.8H44562411k173304j231313R06944P6652k035916k180099j376808l009200o920457
473.2H26618910r115696p015884j243174M555702P418811P639707N575120K263784
489.5H36697280M63307J077831J623929O20067l41535J81854J048088M31597p85827
507.9H41016591o29247L94643J48534j257181j241624L23415N58853r12845j537085
526.2H36864054l76046K93553q30590j777411q11994J49489r42290k404750j994490
$$ plain form
399.8 834048688 841310441 846213460 847918391 848222613 849139094 850090444 849419832 847594023 846869051
418.1 846869051 847713888 847442687 846072078 845818639 845830977 842878819 838001192 836420774 839433372
436.5 839433372 842513859 843141913 843782187 845478535 845769703 844300985 843691647 844653189 844562411
454.8 844562411 842389107 841157794 842064738 842141390 840105474 837925375 836548567 833539367 826618910
473.2 826618910 817503214 810487330 809244156 813799858 821218669 828858376 834433496 836697280
489.5 836697280 837160587 838238418 839862347 840482414 840140879 840322733 841370821 841802418 841016591
507.9 841016591 840387344 840781987 840930521 839673340 838431716 838755131 839313984 838401139 836864054
526.2 836864054 836488008 836781561 835950971 834173560 833361566 833511055 832568765 830164015 828169525
544.6H28169525j035214k079904m232406m973472m774749n905569q116304r175480
560.9G87876427q718014p763922n629182o22451O158888J0673225J1010051R295404
577.2H02280426P768691N951881L201604J179397J092672J470268P53760k44200j69098
595.6H23285401L36766p4565j030565j176953o72519o95646j257718j326799o69300
613.9H16718102k37823n78225q81254m04597L03924K57969n30481r62734n95570l59774
634.3H12729537r29415j533925j399398j376093k787709n188823p345676r833872j4218092
652.7G68116534j9135893j8472075o276965J2964189K4686992K2296250J7273247J3555169
669H15007448N618155J738727J896024K295315J057387l87430K0861J049280L82185
$$ plain form
544.6 828169525 827134311 825054407 820822001 815848529 811073780 805168211 797051907 787876427
560.9 787876427 779158413 771394491 765765309 765142858 771301746 781974971 792985022 802280426
577.2 802280426 810049117 816000998 819202602 820381999 821474671 822944939 823698699 823454499 823285401
595.6 823285401 823622167 823547602 822517037 821340084 820667565 819971919 818714201 817387402 816718102
613.9 816718102 816480279 815902054 815020800 814616203 814920127 815178096 814647615 813684881 813089311 812729537
634.3 812729537 811800122 810266197 808866799 807490706 804702997 799514174 792168498 782334626 768116534
652.7 768116534 748980641 730508566 724231601 737195790 761882782 784179032 801452279 815007448
669 815007448 820625603 822364330 824260354 826555669 827613056 827225626 827246487 828295767 828677952
687.3H28677952j095473r41456K26319n8115j533210j672804m25339l98636k076685
705.7H20702553k889097j915991j411438k550185l169894j692414k26200r68218k341807
724.1H03537309k049982j099229j625300k975225k951324j860678k064467l693998
740.4G85217106m263520l092587k413630l342331m019499l174722k611339l896475
756.7G58403003n548477n824625n990327q354783j2470603j4390528j1022687o117761
773F88683212n219996m922271P1526M790067L092468j431882l182411k757729k536118
791.4F76586866j944303L74496L295243M801392N425275P064700R324073R977282R022772
809.7G23927796Q582950Q990466Q425713O700873N896986O516277O377042M294634
$$ plain form
687.3 828677952 827582479 826641023 826867342 826809227 825276017 823603213 823177874 822779238 820702553
705.7 820702553 817813456 815897465 814486027 811935842 808765948 807073534 806847334 805879116 803537309
724.1 803537309 801487327 800388098 798762798 795787573 792836249 790975571 788911104 785217106
740.4 785217106 780953586 777860999 775447369 772105038 768085539 764910817 762299478 758403003
756.7 758403003 752854526 747029901 741039574 732684791 720214188 705823660 694800973 688683212
773 688683212 683463216 678540945 678612471 683402538 686495006 685063124 681880713 679122984 676586866
791.4 676586866 674642563 675017059 678312302 683113694 688538969 695603669 704927742 714905024 723927796
809.7 723927796 732510746 741501212 749926925 756627798 762524784 769041061 775418103 779712737
826G79712737K059459R59218r83000o671905j6773522k5918305j8361688J0462165
842.4G24485159L2481015K7878165J2472629Q35896q528054j5065491j0870576M346788
858.7G68035531J5365839J3309181O235003J626432l76165q67545o57618r39072k544105
877G99187481m890859o937444r146988j2993455j8624246k4599851l0213534l6428512
893.4F55352592m3079555m3536722k4239481J7921984N9755445P3554456N8065593
907.6G53794312L2418550J1600673j604438r968221j6613722k1918476j9449889k032042
923.9G26226747K0180583K4870634R119392q495212j4403939r733498l557980k874494
940.3G41332233o680131j1173844j5641749k1354258k8889954l7275851m4658363m8891068
$$ plain form
826 779712737 781772196 782731414 781748414 775076509 758302987 732384682 714022994 724485159
842.4 724485159 756966174 784844339 797316968 798152864 789624810 774559319 763688743 768035531
858.7 768035531 783401370 796710551 802945554 804571986 804195821 803328276 802670658 801731586 799187481
877 799187481 794296622 787359178 778212190 765218735 746594489 721994638 691781104 655352592
893.4 655352592 612273037 568736315 544496834 562418818 622174263 695728719 753794312
907.6 753794312 786212862 797813535 796209097 786240876 769627154 747708678 728258789 726226747
923.9 726226747 746407330 771277964 780397356 771902144 757498205 747764707 744206727 741332233
940.3 741332233 734652102 723478258 707836509 686482251 657592297 620316446 575658083 526767015
956.6E26767015m6181261l1421542m560024K5755763M8147470N6248724N1556945M0327847
972.9F66640937K7686358J5782356N327106m438401j6065240l2113671n1908374o7183017
989.2E43728054o1921239k6939780K3134649O0396284P0573449O0330927M4203401
1003.5G13505745L1198680K2529781J6671181J2551844R623826P121086M080236j92046
1019.8H17090333n116880o471336j15812Q596063J0873615P633448M346013K485692
1036.1H39321136J495898J135469R80198N26846n4717k92600k34484k08557k05815
1054.5H42463374P15L54052M11212o0737p31170j633048l559947n764842m585624P43807
1074.9H27637792M484892L144323k96950l105938m622341l761947o76512J852273J761497
$$ plain form
956.6 526767015 480585754 449164212 444604188 470359951 518507421 574756145 626313090 666640937
972.9 666640937 694327295 710109651 715436757 710998356 694933116 662819445 610911071 543728054
989.2 543728054 481806815 454867035 478001684 538397968 608971417 669302344 713505745
1003.5 713505745 744704425 767234206 783905387 796457231 806081057 813202143 817282379 817090333
1019.8 817090333 811973453 805502117 805386305 813982368 824855983 832489431 836835444 839321136
1036.1 839321136 840817034 841952503 842932701 843459547 843404830 843112230 842877746 842669189 842463374
1054.5 842463374 842464089 842818141 843229353 843168616 842437446 840804398 837244451 831479609 826893985 827637792
1074.9 827637792 832122684 835267007 834970057 831864119 827241778 823479831 822803319 824655592 826417089
1093.2H26417089o32704n181551j3261318k5542676l5585285k6982367N101681L4464836
1109.6G58797705L7300587K3297787J0788202M143059P96139r60827j407742o41465
1125.9H32113445K88248m76658m412413j1625886j8339336j4571190L333092J9418061
1142.2H05727363J9669234J1366129N182207K342284J111745O91295M78983k0564o49809
1160.5H45898867p79629k51114L52144N74767N40197M97461K75194j94430m77910l91603
1180.9H46043944l59416o48617r09746r46045j175761j987338k928794l094792k219856
1199.3H31773579r61304j15037n0485q76844k636849n310953q981407j4490902k3317635
1217.7G75032163l4901083m1572988l1084120k686560K6325345L9158940L5367191
$$ plain form
1093.2 826417089 825784385 820602834 807341516 781798840 746213555 719231188 724332869 758797705
1109.6 758797705 796098292 819396079 830184281 834327340 835123479 834162652 832754910 832113445
1125.9 832113445 832401693 831925035 827512622 815886736 797547400 782976210 786309302 805727363
1142.2 805727363 825396597 836762726 841944933 844287217 845398962 846090257 846569240 846548676 845898867
1160.5 845898867 845119238 844868124 845220268 845795035 846335232 846832693 847107887 846913457 846435547 846043944
1180.9 846043944 845684528 845035911 844126165 843180120 842004359 840017021 837088227 833993435 831773579
1199.3 831773579 830812275 830697238 830646753 829769909 827133060 821822107 812840700 798349798 775032163
1217.7 775032163 740131080 698558092 667473972 664787412 691112757 730271697 765638888
1231.9G65638888K4269760J3083815M299104k480507r807646k0101786k9672741k9175520
1248.2G16053367j8974305o528854J0207057K8137565L4502566K8582871J9014716
1262.5H10994983J0746121M966498J606941J6510k21431O43194J467168J082182k28286
1280.9H31073880j211047j125932l10957K84433K70903n304k53082n62489j007199
1299.2H27153206j428902j865030k617597l935039o055176j0187030j6642511k0131886
1315.6G64290035j4054418j654029O236553N447090J514435O25730K976119M205167
1331.9G69586682J656890k212107k557814J364112L558278R34064k195120k946972
1348.2G67188013j042247M228711R782791J0216594O101429J732886j072764j865328
$$ plain form
1231.9 765638888 789908648 802992463 807291567 804811060 795003414 774901628 745228887 716053367
1248.2 716053367 697079062 690550208 700757265 728894830 763397396 791980267 810994983
1262.5 810994983 821741104 826707602 828314543 828331053 828109622 828752816 830219984 831302166 831073880
1280.9 831073880 829862833 828736901 828425944 828710377 828981280 828975976 828722894 828160405 827153206
1299.2 827153206 825724304 823859274 821241677 817306638 811251462 801064432 784421921 764290035
1315.6 764290035 750235617 748581588 754818141 760265231 761779666 762405396 765381515 769586682
1331.9 769586682 771243572 769031465 766473651 767837763 771396041 772330105 770134985 767188013
1348.2 767188013 766145766 770374477 780157268 790373862 796475291 798208177 797135413 795270085
1364.5G95270085j109659j69695n5015p55191j346230j453698j816511k443910k633691
1382.9G83486485k184331j656532j416564j445592j938045k430141k499044k395391
1399.2G67520845k323449k838254l862679m370928m626512n081594n476952n970060
1415.5G32970417p400394r955585j2055576j5523910j9325972j9684613j7213761j2989998
1431.8F18820608j0031820p753968k28703N213082j747847j6026556k4371684j7700076
1448.1E46173036K822101K2460222K8155327K1275521J0214984N809426N210162R86158
1464.5F43106937n737245r391844j1681735j4615715j4019370j0672271p953287n180835
1480.8E63854635j645863K794623P818878J3614476J7982184J7441452J6347766J7126858
$$ plain form
1364.5 795270085 794160426 793990731 793935716 793180525 791834295 790380597 788564086 786120176 783486485
1382.9 783486485 781302154 779645622 778229058 776783466 774845421 772415280 769916236 767520845
1399.2 767520845 765197396 762359142 758496463 754125535 749499023 744417429 738940477 732970417
1415.5 732970417 725570023 715614438 703558862 688034952 668708980 649024367 631810606 618820608
1431.8 618820608 608788788 601034820 600806117 606019199 604271352 588244796 563873112 546173036
1448.1 546173036 548995137 571455359 599610686 620886207 631101191 636910617 642120779 643106937
1464.5 643106937 637369692 627977848 616296113 601680398 587661028 576988757 569035470 563854635
1480.8 563854635 562208772 565003395 572822273 586436749 604418933 621860385 638208151 655335009
1497.1F55335009J5828729J2484073R427011Q415223J0161817R598016P556379O484986
1513.4G35291243N515396M834533M207790M182517M231394L564357L188670K760828
1529.7G67776728K126217J908898J692414P16686K07842J192450J904607J975894J761735
1548.1G81263471J516819J292348R66787L99470L21508J996338K454460J602351J039803
1566.4G92853355O07670O80446Q61764L79861K41458O90878O48319L03865N4359k52127
1586.8G97069848m89235o17624p52389r57906j132608j284897j659513k186477k776384
1605.2G85212815l380776m025757m492104m954636o449878q687854r246290j0498285
1621.5G33477235j2243927j0059595o323099l411889j066566M81427K222419L625631
$$ plain form
1497.1 655335009 671163738 683647811 693074822 701490045 711651862 721249878 728806257 735291243
1513.4 735291243 740806639 745641172 749848962 754031479 758262873 761827230 765015900 767776728
1529.7 767776728 769902945 771811843 773504257 774220943 774428785 775621235 777525842 779501736 781263471
1548.1 781263471 782780290 784072638 785039425 785438895 785760403 787756741 790211201 791813552 792853355
1566.4 792853355 793461025 794141471 795003235 795383096 795624554 796315432 796963751 797267616 797321975 797069848
1586.8 797069848 796580613 795962989 795210600 794252694 793120086 791835189 790175676 787989199 785212815
1605.2 785212815 781832039 777806282 773314178 768359542 761909664 753221810 743975520 733477235
1621.5 733477235 721233308 711173713 704850614 701438725 700372159 700853586 703076005 706701636
1637.8G06701636L243089K101481J52528k939462n325497o164550j2094140k1831334
1654.1F63843751k0606577k0735205k3180008j9954860p289111R314656K5729179L8102150
1670.5F45223975L5424888K9992819K5593102J7655432J1851669R641587J0234595
1684.7G85618067Q707881N697131M171610K717018J695931J430392J299203J793146
1701.1H13130379K110719J652003J577973J515031J133978N82338J0192J79768J111448
1719.4H23003829J222908N95629K57731J94907J59621n0068L7015J035392J277149
1737.8H27734113Q87453P60794O97434M91798K06113Q6069M77433O48022L18050R6321
1758.2H32403600L4452K50220N72979K93136j47223j74642K50936Q05378O88910K94387
$$ plain form
1637.8 706701636 709944725 712046206 712198734 709259272 703933775 697769225 685675085 663843751
1654.1 663843751 643237174 622501969 599321961 579367101 572077990 581392646 607121825 645223975
1670.5 645223975 680648863 710641682 736234784 753890216 765741885 775383472 785618067
1684.7 785618067 794325948 800023079 804194689 806911707 808607638 810038030 811337233 813130379
1701.1 813130379 815241098 816893101 818471074 819986105 821120083 821702421 821712613 821892381 823003829
1719.4 823003829 824226737 824822366 825080097 825275004 825434625 825384557 825421572 826456964 827734113
1737.8 827734113 828621566 829382360 830079794 830571592 830777705 830863774 831341207 831989229 832307279 832403600
1758.2 832403600 832438052 832688272 833261251 833554387 833407164 833232522 833483458 834288836 834977746 835272133
1778.6H35272133K02477K14815P5877N007j80304o69420o93381j53362L0815r7394
1799H34007263j4186L18110M93408L52323R0122Q1658L29018L91423K11597P3850m9293
1821.4H36285293j91927j42991k4736J49786O30021P69794M40419K99036K76745m2677
1841.8H38448763l04401O3717L63469J72496j28269l51727m45664m73559m19438k33590
1862.2H36691797j3113L7133J38104N36681O87658M13776Q8274j30176j97828r9659
1882.6H38152647L0518N7756P2539K68460L54886K16961J79946J96040P1048j79111
1903H39421690m17948n74887o22034n90325o28292p53224p70688n70774m11749k55764
1923.4H33826005O9917K69055K94626L40879L87013L21984J39356q3685j95801o7890
$$ plain form
1778.6 835272133 835474610 835689425 835765302 835770309 835590005 834920585 834227204 834073842 834104657 834007263
1799 834007263 833993077 834311187 834804595 835156918 835247040 835328698 835657716 836049139 836260736 836334586 836285293
1821.4 836285293 836093366 835950375 835925639 836075425 836705446 837475240 837915659 838214695 838491440 838448763
1841.8 838448763 838144362 838208079 838571548 838744044 838615775 838264048 837818384 837344825 836925387 836691797
1862.2 836691797 836678684 836715817 836853921 837390602 838078260 838492036 838580310 838450134 838252306 838152647
1882.6 838152647 838183165 838240921 838313460 838581920 838936806 839153767 839333713 839529753 839600801 839421690
1903 839421690 839003742 838428855 837806821 837216496 836588204 835834980 835064292 834493518 834081769 833826005
1923.4 833826005 833895922 834164977 834459603 834800482 835187495 835509479 835648835 835565150 835369349 835301459
1943.8H35301459R7155J45495J90497J94311J24872Q2969Q9288J06454J20819J13725
1964.2H36567044J61767L07203L36706J73569J9550l6299p6353j68145k74718l41177
1984.6H36669147l75807m20571m52637l55959k27571k52068l10242k80082k52128k72155
2005H33469927k66313k18332j94490k40922l13878k79725j88470k40147l44097l28303
2025.4H30855250k72274k69055k67565k25127k03967k65539l54111l46482k50578j89960
2045.8H28210592j67191o9916J00195K18988K28524K13027K42353K23338J23620R2805
2066.2H29416335J34825J03772j3351j25051j44601j41024k48969m00186m73976m61697
2086.6H27646077l77894k23577m6551P3254P0751l8445j35303j72913k27451l25620
$$ plain form
1943.8 835301459 835398614 835544109 835734606 835928917 836053789 836136758 836226046 836332500 836453319 836567044
1964.2 836567044 836728811 837036014 837372720 837546289 837565839 837529540 837453187 837285042 837010324 836669147
1984.6 836669147 836293340 835872769 835420132 835064173 834836602 834584534 834274292 833994210 833742082 833469927
2005 833469927 833203614 832985282 832790792 832549870 832235992 831956267 831767797 831527650 831183553 830855250
2025.4 830855250 830582976 830313921 830046356 829821229 829617262 829351723 828997612 828651130 828400552 828210592
2045.8 828210592 828043401 827973485 828073680 828292668 828521192 828734219 828976572 829199910 829323530 829416335
2066.2 829416335 829551160 829654932 829641581 829516530 829371929 829230905 828981936 828581750 828107774 827646077
2086.6 827646077 827268183 827044606 826998055 827071309 827142060 827103615 826968312 826795399 826567948 826242328
2106.9H26242328l88742l71754l56376m12583m56572m01557l07202k65539k51948j83702
2127.3H22846353q4579o3002j09851p5043M0532J11997J38104J89006K53439K49624
2147.7H23496580J83582J50741J76549J79946J31428J06991J43170J61767N7638j64152
2168.1H24624240l66389m58777m41611k96056m6909J73688K25067R2208q8751j92821
2188.5H23223889k39134k61128k45392k03967j73092k09034k88486l11971k21848n8115
2208.9H21011722L9041P212n5968j18018k26259l24964l50774l41356l38792l49880
2229.3H18951964l73721m28319n31912o25729o21677n19752l61204j75476J132J40965
2249.7H15456271K37644L07977L69012L89278L22462K02000J08719M2378k4378l5643
$$ plain form
2106.9 826242328 825853586 825481832 825125456 824712873 824256301 823854744 823547542 823282003 823030055 822846353
2127.3 822846353 822761774 822698772 822588921 822513878 822554410 822666407 822804511 822993517 823246956 823496580
2147.7 823496580 823680162 823830903 824007452 824187398 824318826 824425817 824568987 824730754 824788392 824624240
2168.1 824624240 824257851 823799074 823357463 823061407 823014498 823188186 823413253 823505461 823416710 823223889
2188.5 823223889 822984755 822723627 822478235 822274268 822101176 821892142 821603656 821291685 821069837 821011722
2208.9 821011722 821050763 821057975 821002007 820883989 820657730 820332766 819981992 819640636 819301844 818951964
2229.3 818951964 818578243 818149924 817618012 816992283 816370606 815850854 815489650 815314174 815315306 815456271
2249.7 815456271 815693915 816001892 816370904 816760182 817082644 817284644 817393363 817435741 817411363 817375720
2270.1H17375720J1324L8982N2094J08004J85013J53243m9412k85447m14192m29750
2290.5H16745579l69370k48611q3029N5909K6226j77860l59118m23729m97222o43492
2310.9H14025283p23243o62506n68807n03361l96848k29954j40369k37644l87728l93033
2331.3H09781790l20733l86715m66227k86162o259J44601K88069M69506M59790J94073
2351.7H09871733j83284l58641k23637j49190k77877k75612p9691O8008M5896o497
2372.1H08431208M8816Q2136k802n4061P987P7724J3292j53124k08438j47640j73808
2394.5H07921290k94804l63708l63230m04656n16355n48125m10795k63035k90275m19020
2414.9H04047287m52638m49419n68867p16150p13110n91099n13911n18739m74930l24786
$$ plain form
2270.1 817375720 817387044 817426026 817478120 817586124 817771137 817924380 817874968 817589521 817175329 816745579
2290.5 816745579 816376209 816127598 816044569 816100478 816126704 815948844 815589726 815165997 814668775 814025283
2310.9 814025283 813302040 812639534 812070727 811567366 811170518 810940564 810800195 810562551 810174823 809781790
2331.3 809781790 809461057 809074342 808608115 808321953 808315694 808460295 808748364 809217870 809677660 809871733
2351.7 809871733 809688449 809329808 809106171 808956981 808679104 808403492 808323801 808391809 808437705 808431208
2372.1 808431208 808480024 808562160 808559358 808505297 808513284 808591008 808604300 808451176 808242738 808095098 807921290
2394.5 807921290 807626486 807262778 806899548 806494892 805978537 805430412 805019617 804756582 804466307 804047287
2414.9 804047287 803594649 803145230 802576363 801860213 801147103 800556004 800042093 799523354 799048424 798723638
2435.3G98723638j76370r8884j5319J20163J80304N1618j58012k84970l35693l99590
2455.7G97606885m57704m27007l39568l54707n16296o47902o17802m72248l06308j62125
2476.1G93305218l6955L8684L4213j6213o9022j47760k62320l55899l97265m13239
2496.5G91679442m54784n27679n41687m23015k74837k53796l40462m35412n43535o82056
2516.9G87202179p33673n91517l62336k53439l13282m37320n48779o60360p85888q35239
2537.3G81680346p68841p18713p20501p16507p62224q84473j008630j098931j166284
2555.6G73835242j186252j103937q89719n87523l18110j85907j76310k19047l15190
2574G68853247m86970o88612q41618r12309r13321q63016p48992n28693k65181j19925
$$ plain form
2435.3 798723638 798547268 798448384 798433065 798553228 798733532 798785150 798627138 798342168 798006475 797606885
2455.7 797606885 797149181 796722174 796382606 796027899 795511603 794863701 794245899 793773651 793467343 793305218
2476.1 793305218 793268263 793306947 793341160 793324947 793255925 793108165 792845845 792489946 792092681 791679442
2496.5 791679442 791224658 790696979 790155292 789732277 789457440 789203644 788863182 788427770 787884235 787202179
2516.9 787202179 786468506 785876989 785514653 785261214 784947932 784510612 783961833 783301473 782515585 781680346
2537.3 781680346 780911505 780192792 779472291 778755784 777993560 777109087 776100457 775001526 773835242
2555.6 773835242 772648990 771545053 770655334 770067811 769749701 769563794 769387484 769168437 768853247
2574 768853247 768366277 767677665 766836047 765923738 765010417 764147401 763398409 762869716 762604535 762484610
2594.4G62484610j41203k40267l64184n16534o99401r05037j100659j268625j430154
2612.8G55818546j544476j501024j311779j103282r59157q45492o63698m74453m94540
2631.1G46920645p98046j228690j585544j814782j978040k018631j887261j767338
2647.4G33842313j774370j788259j718044j606107j528263j551032j753152k099156
2663.7G20023930k316654k129078j525580p76113k56896j21414k51115n15759p99775
2682.1G11331546r60588r47297q80420r50456j221239j552582j782537j931011k066016
2700.5F99039400k127290k052784j924336j890361j970709k062797k195716k460540
2716.8F82354867k724289k799750k703070k555311k410114k134681j635551j132786
$$ plain form
2594.4 762484610 762343407 762103140 761738956 761222422 760523021 759617984 758517325 757248700 755818546
2612.8 755818546 754274070 752773046 751461267 750357985 749398828 748553336 747889638 747415185 746920645
2631.1 746920645 746122599 744893909 743308365 741493583 739515543 737496912 735609651 733842313
2647.4 733842313 732067943 730279684 728561640 726955533 725427270 723876238 722123086 720023930
2663.7 720023930 717707276 715578198 714052618 713276505 713019609 712898195 712647080 712131321 711331546
2682.1 711331546 710370958 709423661 708543241 707592785 706371546 704818964 703036427 701105416 699039400
2700.5 699039400 696912110 694859326 692934990 691044629 689073920 687011123 684815407 682354867
2716.8 682354867 679630578 676830828 674127758 671572447 669162333 667027652 665392101 664259315
2733.1F64259315q15928o27339n10574n24819p09235q75473q80540q98719r93073r93669
2753.5F56429946q95321q96931j097858j348376j442909j398146j397133j512468j644731
2771.8F44796073j803040k149224k585590k817214k842605k869308k988517l188133
2788.2F23552442l486336l832876m016161l927946l736794l662944l707469l718376
2804.5E93463540l594994l383875l275037l297925l232658l058016k979219l081620
2820.8E67560196l313422l697217m365921n332887o396294p244289p657468p641137
2837.1E21911561p357954o881834o515383p181675r393841j2299358j4212698j3761789
2853.4D44307029j0662049n740940n05269L753871O627351Q057475P771969N809784
$$ plain form
2733.1 664259315 663443387 662816048 662305474 661780655 661071420 660195947 659315407 658416688 657423615 656429946
2753.5 656429946 655534625 654637694 653539836 652191460 650748551 649350405 647953272 646440804 644796073
2771.8 644796073 642993033 640843809 638258219 635441005 632598400 629729092 626740575 623552442
2788.2 623552442 620066106 616233230 612217069 608289123 604552329 600889385 597181916 593463540
2804.5 593463540 589868546 586484671 583209634 579911709 576679051 573621035 570641816 567560196
2820.8 567560196 564246774 560549557 556183636 550850749 544454455 537210166 529552698 521911561
2837.1 521911561 514553607 507671773 501156390 493974715 484580874 472281516 458068818 444307029
2853.4 444307029 433644980 427904040 427398771 431152642 437779993 445837468 453609437 459419221
2869.7D59419221K913147j5080k344459l781706m455925m595965m279136l585726k693683
2888.1D36580688j863778j224905p47621m48466k48670O0290M39286O13958L49849
2906.5D33510631n08666k054929m301340o916791r119004j0401934j1094928j1656076
2922.8C77456963j1952579j1383414r456963o364405k900183J8776K173453M411936
2939.1C42003584P565081J1389554J4874190J7116874J7808259J7065406J5112906
2953.4D42935854J2513548J0326743R528250J0200590J1327684J1641443J0607540
2967.6E19081652Q575440O347417M447043K908051J730681Q99792K74479n1618L07382
2986E44520319J551389L372193M992365N735755N597473M922390M084825L386140K844334
$$ plain form
2869.7 459419221 462332368 462317288 459972829 456191123 451735198 447139233 442860097 439274371 436580688
2888.1 436580688 434716910 433492005 432744384 432295918 432047248 432107538 432546824 433160782 433510631
2906.5 433510631 433001965 430947036 426645696 419728905 410609901 400207967 389113039 377456963
2922.8 377456963 365504384 354120970 344664007 338299602 335399419 335418195 337591648 342003584
2939.1 342003584 349568665 360958219 375832409 392949283 410757542 427822948 442935854
2953.4 442935854 455449402 465776145 475304395 485504985 496832669 508474112 519081652
2967.6 519081652 527657092 534004509 538451552 541359603 543090284 543990076 544264555 544212937 544520319
2986 544520319 546071708 549443901 554436266 560172021 565769494 570691884 574776709 578162849 581007183
3004.4E81007183K424657K190649K020002J664698J139760O74605L23594l9339l63231
3022.7E91042578n86808p90297r37999j021504j094401j286388j599490j726449j740992
3041.1E80258250j980781k404332k767146k910912l004790l237009l488719l730297
3057.4E56734264l934562l997684m038215m153549m346788m591465m722834m639089
3073.7E22310078m387677m211783m315913m375219m124582l763586l342658k963692
3090D90824968k840728k774984k646535k671659k932161l197819l088385k558798j980394
3108.4D66133505j469880o23912N22763J386434J908004K288967K638519L190607L851324
3126.7D79826331M212439M097223L668964L154487K544522J611203L49373p65205j496196
$$ plain form
3004.4 581007183 583431840 585622489 587642491 589307189 590446949 591121554 591445148 591405809 591042578
3022.7 591042578 590455770 589665473 588727474 587705970 586611569 585325181 583725691 581999242 580258250
3041.1 580258250 578277469 575873137 573105991 570195079 567190289 563953280 560464561 556734264
3057.4 556734264 552799702 548802018 544763803 540610254 536263466 531672001 526949167 522310078
3073.7 522310078 517922401 513710618 509394705 505019486 500894904 497131318 493788660 490824968
3090 490824968 487984240 485209256 482562721 479891062 476958901 473761082 470672697 468113899 466133505
3108.4 466133505 464663625 464039713 464562476 465948910 467856914 470145881 472784400 475975007 479826331
3126.7 479826331 484038770 488135993 491804957 494959444 497503966 499115169 499464542 498699337 497203141
3145.1D97203141k102017k614468l002465l527254m095018m306972m218161m077136
3161.4D69259650l947676l808915l620804l387302l130913k878308k629995k352327
3177.7D43503410k053410j811147j629710j431883j190304r59724p72268o25461n04852
3196.1D32524651l33667j45137l8773J7435L1471n8383j27554j10030j27166j47254
3216.5D31485593j30772j37538j57118j20252k7418J22368M01050O10828M48495K72692
3236.9D32767928M67479P43776R02921J037717J079679R78589R88722J188129J327753
3255.2D41482693J325011J331866J408160J522302J672775J843333J959354J827806
3271.5D54373300J560688J473993J524985J607031J711607J787424J815021J854539
$$ plain form
3145.1 497203141 495101124 492486656 489484191 485956937 481861919 477554947 473336786 469259650
3161.4 469259650 465311974 461503059 457882255 454494953 451364040 448485732 445855737 443503410
3177.7 443503410 441450000 439638853 438009143 436577260 435386956 434427232 433654964 433029503 432524651
3196.1 432524651 432190984 432045847 432007074 432024509 432055980 431997597 431870043 431760013 431632847 431485593
3216.5 431485593 431354821 431217283 431060165 430939913 430912495 431034863 431435913 432046741 432495236 432767928
3236.9 432767928 433235407 433979183 434882104 435919821 436999500 437978089 438966811 440154940 441482693
3255.2 441482693 442807704 444139570 445547730 447070032 448742807 450586140 452545494 454373300
3271.5 454373300 455933988 457407981 458932966 460539997 462251604 464039028 465854049 467708588
3287.8D67708588J939594J903028J651913J312941R81241P51019O27518M45425L1740
3306.2D77353007m65900o50585l94910J29759O63459J048148J270682J376569J407355
3324.6D81737584J332551J213074J185924J226633J277715J368940J405835J355619
3340.9D92103875J361578J398027J491815J696229J689762J430124J360655J524389
3357.2E04056454J605510J531780J493812J645744J740515J439869R72212Q80301J168489
3375.5E16534686J381874J370251J264513J270831J423895J623332J842738J752495
3391.9E28464615J318515J225233J637578J840353J402139R43244J105964J453340
3408.2E39390981J497865J356184J164496J085520J250148J411378J381457J399219
$$ plain form
3287.8 467708588 469648182 471551210 473203123 474516064 475497305 476248324 476875842 477321267 477353007
3306.2 477353007 476887107 476236522 475841612 475971371 476634830 477682978 478953660 480330229 481737584
3324.6 481737584 483070135 484283209 485469133 486695766 487973481 489342421 490748256 492103875
3340.9 492103875 493465453 494863480 496355295 498051524 499741286 501171410 502532065 504056454
3357.2 504056454 505661964 507193744 508687556 510333300 512073815 513513684 514485896 515366197 516534686
3375.5 516534686 517916560 519286811 520551324 521822155 523246050 524869382 526712120 528464615
3391.9 528464615 529783130 531008363 532645941 534486294 535888433 536831677 537937641 539390981
3408.2 539390981 540888846 542245030 543409526 544495046 545745194 547156572 548538029 549937248
3424.5E49937248J578868J698315J622498J636624J803875J701117J388490J342952
3440.8E62709987J569569J783729J898050J928806J964272K015590J991987K003372
3457.1E77865362K103865K042294K007246K298832K460003K112448J640856J591206
3473.4E94122112J890242K170861K135098J816392J743257J928866J926958J840115
3489.8F09573901J886427J929939J922488J851797J783014J802861J736641J620174
3506.1F24107242J672566J873970K073288K046644J853943J789868J850605J920462
3522.4F39188588J851380J691758J726210J918674K046287K074301J976490J813054
3538.7F54286742J819670J908839J814366J624167J623094J704692J751900J822889
$$ plain form
3424.5 549937248 551516116 553214431 554836929 556473553 558277428 559978545 561367035 562709987
3440.8 562709987 564279556 566063285 567961335 569890141 571854413 573870003 575861990 577865362
3457.1 577865362 579969227 582011521 584018767 586317599 588777602 590890050 592530906 594122112
3473.4 594122112 596012354 598183215 600318313 602134705 603877962 605806828 607733786 609573901
3489.8 609573901 611460328 613390267 615312755 617164552 618947566 620750427 622487068 624107242
3506.1 624107242 625779808 627653778 629727066 631773710 633627653 635417521 637268126 639188588
3522.4 639188588 641039968 642731726 644457936 646376610 648422897 650497198 652473688 654286742
3538.7 654286742 656106412 658015251 659829617 661453784 663076878 664781570 666533470 668356359
3555F68356359J807690J743376J680732J459479J220822J582384K299786K326965J942277
3573.4F84419870J807511J886010K029539K131879J989722J603425J530468K059996
3589.7F99458420K218306J936078J975000K185822K135634K026201J871228J478255
3606G15284944J303136J571834J774013J814783J666188J486540J820743K027452J491368
3624.4G30241001O72996M41253J395702J878977J522541J242638J040756Q73030P36594
3642.7G40045488L57866k07960j04905J007259J443029R33587P64430R53615O78896
3661.1G45871305K72334M9889l09288n86152j90080q2671l60132M32015J104474Q67605
3681.5G47069299N09203J86503j33396j02222M78089Q52645O60777K44558j04726j29163
$$ plain form
3555 668356359 670164049 671907425 673588157 675047636 676268458 677850842 680150628 682477593 684419870
3573.4 684419870 686227381 688113391 690142930 692274809 694264531 695867956 697398424 699458420
3589.7 699458420 701676726 703612804 705587804 707773626 709909260 711935461 713806689 715284944
3606 715284944 716588080 718159914 719933927 721748710 723414898 724901438 726722181 728749633 730241001
3624.4 730241001 730913997 731355250 732750952 734629929 736152470 737395108 738435864 739308894 740045488
3642.7 740045488 740403354 740195394 740090489 741097748 742540777 743474364 744238794 745192409 745871305
3661.1 745871305 746143639 746193528 745884240 745298088 745108008 745025337 744665205 745097220 746201694 747069299
3681.5 747069299 747578502 747765005 747631609 747529387 748007476 748860121 749520898 749765456 749660730 749531567
3701.9G49531567K23041K38597k78234o45817j80185O77288P40707K40862j40607k13981
3722.3G50193238q3625J46985K60472j46389p65204o80566K08139P72298K90394p92086
3742.7G49403656r71616J53065J93059k19106N13375R11891L77536L874K09928K08318
3763.1G50783980j31011k12669j01269J35005L22938J49011j67250k80261o9619Q3030
3783.5G50511885P9751J51992J51038n007k17080l49879k89321m32611m00185J90377
3803.9G49390960K08318J99199N20289K25067n07772p83265m21285m11869j20520M76062
3824.3G48775184K97010j5855k03311l58939l80516n28157m52638J32382M70340M71771
3844.6G48207271L33071j52171j036286j592577k02298J209438Q69036Q8989l49223
$$ plain form
3701.9 749531567 749754608 749993205 749714971 749069154 748888969 749566257 750306964 750547826 750407219 750193238
3722.3 750193238 750109613 750256598 750517070 750370681 749605477 748924911 749133050 749905348 750195742 749403656
3742.7 749403656 748432040 748585105 748778164 748559058 749072433 749984324 750361860 750365734 750575662 750783980
3763.1 750783980 750652969 750440300 750339031 750474036 750796974 750945985 750778735 750498474 750428855 750511885
3783.5 750511885 750591636 750743628 750894666 750889659 750672579 750322700 750033379 749600768 749200583 749390960
3803.9 749390960 749599278 749798477 750318766 750543833 750036061 749252796 748831511 748419642 748299122 748775184
3824.3 748775184 749072194 749056339 748853028 748494089 748113573 747585416 747132778 747265160 747735500 748207271
3844.6 748207271 748540342 748388171 747351885 745759308 745557010 746766448 747635484 747724473 747375250
3863G47375250j61410K1816k54989j44482K12789K48432M7863m21584l90053k5034
3883.4G46508598n2988J08361R5308j43588J21892K03192l35813p23660n16414l3677
3903.8G45231211M99726O77704L37184l4988k61545m35949l77953j43647j28508k42769
3924.2G45120466j26839n5432k04802j27256J13607L8624j81258l20375l61502k14041
3944.6G43681192j73866k72036j56939j9908j7345N6982J49787J09911P0571J06812
3965G43535161P5638j9371n3406l8803j6927j9193n0306j5855O8426N5373n7221j31726
3989.5G43331790j27971r1970l6836L0339
3997.6G43105352
$$ plain form
3863 747375250 747213840 747235656 746980667 746836185 747048974 747297406 747345269 746923685 746533632 746508598
3883.4 746508598 746455610 746563971 746659279 746515691 746637583 746840775 746504962 745781302 745264888 745231211
3903.8 745231211 745730937 746408641 746745825 746710837 746449292 746013343 745635390 745491743 745363235 745120466
3924.2 745120466 744993627 744938195 744733393 744606137 744719744 744758368 744577110 744256735 743895233 743681192
3944.6 743681192 743507326 743235290 743078351 743058443 743041098 743098080 743247867 743357778 743428349 743535161
3965 743535161 743610799 743591428 743538022 743499219 743482292 743463099 743412793 743396938 743465364 743520737 743463516 743331790
3989.5 743331790 743203819 743111849 743075013 743105352
3997.6 743105352
##END=$$ End of the data block
