##TITLE=Capinzal - Marcela $$ Begin of the data block
##JCAMP-DX=5.00 $$ ACD/SpecManager v 10.08
##SPECTROMETER/DATA SYSTEM=Alpha
##DATE=24 Oct 2013 13:19:44
##DATA TYPE=INFRARED SPECTRUM
##DATA CLASS=XYDATA
##ORIGIN=
##OWNER=
##NPOINTS=1765
##FIRSTX=399.75695801
##LASTX=3997.56933594
##MAXX=3997.56933594
##MINX=399.75695801
##MAXY=0.83709526
##MINY=0.22280508
##XFACTOR=1.0000000000
##YFACTOR=1.000000000000000e-9
##FIRSTY=0.52374178
##DELTAX=2.03957629
##XUNITS=1/CM
##YUNITS=ARBITRARY UNITS
##XYDATA=(X++(Y..Y))
$$ plain form
399.8 523741782 519008756 515290499 512805521 512375414 513712347 515270889 516205668 517468452 519142747
418.1 519142747 518659532 515731454 512288511 509320796 506988943 504410982 501691580 500152349 500093043
436.5 500093043 500840902 502326012 505121648 509016454 512781382 515325785 517012119 518901169 520547688
454.8 520547688 520565629 518644810 516458929 514783204 512571454 509222806 505602598 502705216 499971658
473.2 499971658 496577203 493275106 491342217 490767479 490520000 490168720 490021259 490079582 489839345
491.5 489839345 488832384 487283617 485907733 484717041 483028352 480609834 477927119 475196719
507.9 475196719 472080410 468336999 464282960 460298926 456390113 452602416 449246675 446869105
524.2 446869105 445818305 446015388 447252840 449484885 452986717 457834095 463418335 468708575 472842753
$$ packed form
399.8E23741782m733026l718257k484978m30107J336933J558542R34779J262784J674295
418.1E19142747m83215k928078l442943k967715k331853k577961k719402j539231n9306
436.5E00093043P47859J485110K795636L894806L764928K544403J686334J889050J646519
454.8E20547688J7941j920819k185881j675725k211750l348648l620208k897382k733558
473.2D99971658l394455l302097j932889n74738k47479l51280j47461N8323k40237
491.5D89839345j006961j548767j375884j190692j688689k418518k682715k730400
507.9D75196719l116309l743411m054039l984034l908813l787697l355741k377570
524.2D46869105j050800J97083J237452K232045L501832M847378N584240N290240M134178
$$ plain form
542.5 472842753 475451887 476542413 476286143 474938333 472885668 470346808 466997892 462490112 457165927
560.9 457165927 451501310 445393443 438555539 431606650 425804019 422051460 420792520 421970069
577.2 421970069 425337851 430580407 437252611 444582522 451561987 457399487 461534739 463801444
593.5 463801444 464706689 464900166 464841247 464764148 464606136 464523822 464975983 466311663 468488902 471161038
613.9 471161038 474228591 478091478 482880890 488118291 493355632 498290360 502765894 506718874
630.2 506718874 510044098 512589455 514473259 516217113 517996550 519481957 520639658 521725059
646.5 521725059 522980869 524341524 525474548 526546478 527900279 529481888 530904472 531866670 532644272
664.9 532644272 533872843 535708666 537112176 538263261 539704323 541452229 543123543 544485986
$$ packed form
542.5D72842753K609134J090526k56270j347810k052665k538860l348916m507780n324185
560.9D57165927n664617o107867o837904o948889n802631l752559j258940J177549
577.2D21970069L367782N242556O672204P329911O979465N837500M135252K266705
593.5D63801444R05245J93477n8919p7099j58012q2314M52161J335680K177239K672136
613.9D71161038L067553L862887M789412N237401N237341M934728M475534L952980
630.2E06718874L325224K545357J883804J743854J779437J485407J157701J085401
646.5E21725059J255810J360655J133024J071930J353801J581609J422584R62198P77602
664.9E32644272J228571J835823J403510J151085J441062J747906J671314J362443
$$ plain form
681.2 544485986 545840442 547347724 548561156 549040914 548903644 548428237 547403872 545229435 541793644
699.6 541793644 537868500 534421563 531853557 530310869 530170977 531885684 535469413 540297866 545837998
717.9 545837998 552184582 559297323 566564381 573372006 579471529 585066080 590192795 594254196
734.2 594254196 596854746 598309755 598997116 598604977 596432626 592378378 587163210 581436157 575204968
752.6 575204968 568387151 561659992 556181073 552425623 550224364 549925089 552419066 558040023 566005290
771 566005290 575071394 584536970 594173133 603464603 611507535 617915511 623346567 628542840 633470535
789.3 633470535 637767851 641764641 646459997 652205646 658053339 663057566 667402923 671626210
805.6 671626210 675483763 678152025 679592609 680791140 682238698 683059275 682374060 680587351 678376973
$$ packed form
681.2E44485986J354456J507282J213432M79758j37270m75407j024365k174437l435791
699.6E41793644l925144l446937k568006j542688j39892J714707L583729M828453N540132
717.9E45837998O346584P112741P267058O807625O099523N594551N126715M061401
734.2E94254196K600550J455009O87361l92139k172351m054248n215168n727053o231189
752.6E75204968o817817o727159n478919l755450k201259k99275K493977N620957P965267
771E66005290R066104R465576R636163R291470Q042932O407976N431056N196273M927695
789.3F33470535M297316L996790M695356N745649N847693N004227M345357M223287
805.6F71626210L857553K668262J440584J198531J447558Q20577o85215j786709k210378
$$ plain form
824 678376973 675249398 670271754 663630545 656368732 649042130 641421735 633579612 626421094 620775461
842.3 620775461 616395891 612471819 608848214 605997622 603987515 602129936 600004613 598496974
858.7 598496974 599385679 603769779 611171424 620526850 631212890 642294705 651920974 658467531
875 658467531 661732018 662354290 660344124 655226171 647529364 638880789 630537629 622685015 615153491
893.3 615153491 608173966 602142334 596800148 591114342 584341824 576679349 568415165 559232831
909.6 559232831 548771679 537461460 526423514 516557992 508200169 501654446 497393638 495490342
926 495490342 495291263 496001005 497467786 500156999 504296243 509403765 514825046 519936442 523347318
944.3 523347318 522754371 516542792 505197227 490522832 473892570 455778778 436527431 416678727
$$ packed form
824F78376973l127575m977644o641209p261813p326602p620395p842123p158518n645633
842.3F20775461m379570l924072l623605k850592k010107j857579k125323j507639
858.7E98496974Q88705M384100P401645R355426J0686040J1081815R626269O546557
875F58467531L264487O22272k010166n117953p696807q648575q343160p852614p531524
893.3F15153491o979525o031632n342186n685806o772518p662475q264184r182334
909.6E59232831j0461152j1310219j1037946r865522q357823o545723m260808j903296
926D95490342j99079P09742J466781K689213M139244N107522N421281N111396L410876
944.3E23347318n92947o211579j1345565j4674395j6630262j8113792j9251347j9848704
$$ plain form
960.6 416678727 396609098 376360536 355821520 335116684 314782113 295388907 277311504
974.9 277311504 261052191 247297183 236608014 229176730 224747717 222805083 222826466 224337757
991.2 224337757 226800919 229684651 232643992 235530004 238185555 240342081 241773650 242528364 242905796
1009.6 242905796 243179590 243545815 244194523 245326802 247061178 249337822 251980096 254881024 258025140
1027.9 258025140 261291265 264382303 266995817 269129872 271002710 272735178 274339467 275963873
1044.3 275963873 277919859 280405760 283402413 286919624 291200191 296550483 303153902 311036795
1060.6 311036795 320162565 330106258 339029878 343565792 341119349 332613528 322061688 313294083
1076.9 313294083 307756066 305197954 305079341 306895018 310094893 314252436 319128036 324472636
$$ packed form
960.6D16678727k0069629k0248562k0539016k0704836k0334571j9393206j8077403
974.9B77311504j6259313j3755008j0689169p431284m429013j942634K1383J511291
991.2B24337757K463162K883732K959341K886012K655551K156526J431569P54714L77432
1009.6B42905796K73794L66225O48708J132279J734376K276644K642274K900928L144116
1027.9B58025140L266125L091038K613514K134055J872838J732468J604289J624406
1044.3B75963873J955986K485901K996653L517211M280567N350292O603419P882893
1060.6C11036795R125770R943693Q923620M535914k446443q505821j0551840q767605
1076.9C13294083n538017k558112j18613J815677L199875M157543M875600N344600
$$ plain form
1093.2 324472636 329803884 334405184 337770820 339981824 341541320 342991471 344742417 347060800
1109.5 347060800 350042611 353519201 357061476 360241801 362890989 365188658 367488325 370098412
1125.8 370098412 373294473 377173066 381213039 384220392 384923518 382652014 377598673 370577157
1142.2 370577157 362554133 354391009 346819192 340320975 335082591 331104159 328343749 326837778
1158.5 326837778 326642752 327821672 330493927 334843963 341134220 349539191 359900773 371878892
1174.8 371878892 385154277 399374992 414101064 428777158 442810386 455732852 467193633
1189.1 467193633 476787329 484182984 489470869 493192136 495958060 498205334 500359476 502956450
1205.4 502956450 506454945 510931194 516097665 521607816 527194321 532490015 536903858 539987206
$$ packed form
1093.2C24472636N331248M601300L365636K211004J559496J450151J750946K318383
1109.5C47060800K981811L476590L542275L180325K649188K297669K299667K610087
1125.8C70098412L196061L878593M039973L007353P03126k271504n053341p021516
1142.2C70577157q023024q163124p571817o498217n238384l978432k760410j505971
1158.5C26837778j95026J178920K672255M350036O290257Q404971J0361582J1978119
1174.8C71878892J3275385J4220715J4726072J4676094J4033228J2922466J1460781
1189.1D67193633R593696P395655N287885L721267K765924K247274K154142K596974
1205.4E02956450L498495M476249N166471N510151N586505N295694M413843L083348
$$ plain form
1221.7 539987206 541757703 542477310 542375326 541612864 540435731 539243996 538343966 537766993 537436843
1240.1 537436843 537481308 538186312 539609015 541483939 543568194 545875311 548439085 551055908 553447306
1258.4 553447306 555615127 557821035 560205400 562645912 564991653 567205071 569226503 570834458
1274.7 570834458 571779788 572094500 572041273 571758687 571184695 570273519 569123149 567849278 566382229
1293.1 566382229 564614296 562683284 560911953 559508801 558434486 557551980 556749165 555976093 555115163
1311.4 555115163 553900242 552238166 550259173 547950208 545112967 541595876 537450731 532898009
1327.8 532898009 528152704 523454607 519261479 516061604 513883829 512296140 511027455 510120451
1344.1 510120451 509510577 508927345 508074045 506898701 505582988 504266739 502978683 501695395 500240028
$$ packed form
1221.7E39987206J770497P19607j01984p62462j177133j191735r00030n76973l30150
1240.1E37436843M4465P05004J422703J874924K084255K307117K563774K616823K391398
1258.4E53447306K167821K205908K384365K440512K345741K213418K021432J607955
1274.7E70834458R45330L14712n3227k82586n73992r11176j150370j273871j467049
1293.1E66382229j767933j931012j771331j403152j074315q82506q02815p73072q60930
1311.4E55115163j214921j662076j978993k308965k837241l517091m145145m552722
1327.8E32898009m745305m698097m193128l199875k177775j587689j268685r07004
1344.1E10120451o09874n83232q53300j175344j315713j316249j288056j283288j455367
$$ plain form
1362.4 500240028 498675644 497504234 496897906 496843785 497474223 498601288 499820352 501112819 502549708
1380.8 502549708 504353821 507064581 510707200 514257550 517161608 519718051 521530151 522089601
1397.1 522089601 521607459 520563185 519422650 518011093 516176343 514303863 512620628 511257946
1413.4 511257946 510445297 510032117 509401500 508715510 508547127 508770108 509351313 510279894 511350513
1431.8 511350513 512757957 514577687 516036272 517016113 518177629 519408047 520348370 520556450 519868255
1450.1 519868255 518887401 518193126 517296553 515241861 513544500 513596535 515428722 518548667 522873461
1468.5 522873461 529198050 537786543 546498120 554213941 561726630 569417357 577177763 584762692
1484.8 584762692 592501640 600209236 606762886 612026811 617535293 623599410 628678560 632814944
$$ packed form
1362.4E00240028j564384j171410o06328n4121O30438J127065J219064J292467J436889
1380.8E02549708J804113K710760L642619L550350K904058K556443J812100N59450
1397.1E22089601m82142j044274j140535j411557j834750j872480j683235j362682
1413.4E11257946q12649m13180o30617o85990j68383K22981N81205R28581J070619
1431.8E11350513J407444J819730J458585R79841J161516J230418R40323K08080o88195
1450.1E19868255r80854o94275q96573k054692j697361N2035J832187L119945M324794
1468.5E22873461O324589Q588493Q711577P715821P512689P690727P760406P584929
1484.8E84762692P738948P707596O553650N263925N508482O064117N079150M136384
$$ plain form
1501.1 632814944 637221634 643004775 648889601 651877820 653977871 656934381 660613537 664368033
1517.4 664368033 667868316 671140492 673564792 675501525 677430511 679441273 682075143 684757113
1533.7 684757113 686893582 689812243 693718135 695854127 696352363 696884334 698022306 699767649 701719105
1552.1 701719105 703959942 706857979 710036814 710614264 709729314 709971547 711191237 712727606 713681936
1570.5 713681936 714174986 715226889 716098547 715767384 715270638 715040445 714817107 714385390 713653028
1588.8 713653028 712547243 711122692 709377766 707213998 704700887 701897919 698759735 695280075
1605.1 695280075 691446424 687085509 682441056 678146958 673713863 667922318 662441373 658155441
1621.4 658155441 653599024 648702204 644063473 639788747 636635602 634685338 632385433 629387677
$$ packed form
1501.1F32814944M406690N783141N884826K988219K100051K956510L679156L754496
1517.4F64368033L500283L272176K424300J936733J928986K010762K633870K681970
1533.7F84757113K136469K918661L905892K135992M98236N31971J137972J745343J951456
1552.1G01719105K240837K898037L178835N77450q84950K42233J219690J536369R54330
1570.5G13681936M93050J051903Q71658l31163m96746k30193k23338m31717p32362
1588.8G13653028j105785j424551j744926k163768k513111k802968l138184l479660
1605.1F95280075l833651m360915m644453m294098m433095n791545n480945m285932
1621.4F58155441m556417m896820m638731m274726l153145j950264k299905k997756
$$ plain form
1637.8 629387677 627289236 626560092 627148092 628680110 630079567 631582618 634594142 637660384 639005303
1656.1 639005303 640961587 644358218 648526251 652520061 656486094 661376715 666450024 670645833
1672.4 670645833 675040066 679594934 683738887 688305736 693884552 699425220 702946842 705877185
1688.8 705877185 709347904 713188946 717870295 722666025 726710200 729938090 732077241 734269798
1705.1 734269798 736553431 738534153 740875959 743884563 747258604 749976635 751091242 751820385
1721.4 751820385 753144503 754800200 756648779 758852184 761352181 763687968 764756203 765482605
1737.7 765482605 766863763 768314719 769644618 771232128 773102462 774666429 775379002 775919914 776962519
1756.1 776962519 778165281 779333472 780370831 781102300 782105327 783577144 785143971 786206663
$$ packed form
1637.8F29387677k098441p29144N88000J532018J399457J503051L011524L066242J344919
1656.1F39005303J956284L396631M168033L993810L966033M890621N073309M195809
1672.4F70645833M394233M554868M143953M566849N578816N540668L521622K930343
1688.8G05877185L470719L841042M681349M795730M044175L227890K139151K192557
1705.1G34269798K283633J980722K341806L008604L374041K718031J114607P29143
1721.4G51820385J324118J655697J848579K203405K499997K335787J068235P26402
1737.7G65482605J381158J450956J329899J587510J870334J563967P12573N40912J042605
1756.1G76962519J202762J168191J037359P31469J003027J471817J566827J062692
$$ plain form
1772.4 786206663 786397934 786519468 787163258 788031757 788780987 789424419 790026069 790968359 792398632
1790.7 792398632 793418527 793627739 793981969 794832110 795659244 796064496 796359837 796976507 797853053
1809.1 797853053 798569500 798942924 799335361 799928486 800545394 801197469 802022755 802847385 803578794 804136813
1829.5 804136813 804137528 804009736 804270387 804660439 805034995 805696726 806447864 806558013 806209743 805932403
1849.9 805932403 805891097 806076765 806319535 806501865 806667447 806914926 807364881 808070302 808611929 808488488
1870.3 808488488 808193266 808263600 808478057 808670461 808955550 809324384 809662819 810024679 810473025 810791016
1890.7 810791016 810940802 811032057 811053097 811139464 811342657 811495066 811585069 811770797 812027514 812145293
1911.1 812145293 812129021 812283158 812663496 812917352 812963605 812916934 812816322 812826097 812935472 813000977 813041866
$$ packed form
1772.4G86206663J91271J21534O43790Q68499P49230O43432O01650R42290J430273
1790.7G92398632J019895K09212L54230Q50141Q27134M05252K95341O16670Q76546
1809.1G97853053P16447L73424L92437N93125O16908O52075Q25286Q24630P31409N58019
1829.5H04136813P15j27792K60651L90052L74556O61731P51138J10149l48270k77340
1849.9H05932403m1306J85668K42770J82330J65582K47479M49955P05421N41627j23441
1870.3H08488488k95222P0334K14457J92404K85089L68834L38435L61860M48346L17991
1890.7H10791016J49786R1255K1040Q6367K03193J52409R0003J85728K56717J17779
1911.1H12145293j6272J54137L80338K53856M6253m6671j00612R775J09375O5505M0889
$$ plain form
1933.5 813041866 813152134 813358903 813683629 814058483 814214408 814170003 814150453 814204037 814356446 814591706
1953.9 814591706 814817250 814998865 815175116 815376699 815657020 815970242 816121697 816108108 816134810 816261768
1974.3 816261768 816406131 816509008 816561937 816620648 816724598 816862702 817029297 817200780 817242801 817122698
1994.7 817122698 817014456 816958070 816894472 816837430 816783965 816650629 816379786 816073775 815863192 815695822
2015.1 815695822 815397561 814941585 814493895 814102829 813660264 813180983 812752545 812374473 811972916 811506987
2035.5 811506987 811065435 810743690 810486913 810181558 809854507 809633732 809541643 809472680 809368968 809306204
2055.9 809306204 809361815 809473395 809551418 809616566 809716284 809850693 809948564 809950531 809959173 810108125 810327113
2078.3 810327113 810455322 810489118 810573280 810779810 810994387 811108708 811198771 811389148 811642528 811825573
$$ packed form
1933.5H13041866J10268K06769L24726L74854J55925m4405j9550N3584J52409K35260
1953.9H14591706K25544J81615J76251K01583K80321L13222J51455j3589K6702J26958
1974.3H16261768J44363J02877N2929N8711J03950J38104J66595J71483M2021j20103
1994.7H17122698j08242n6386o3598n7042n3465j33336k70843l06011k10583j67370
2015.1H15695822k98261m55976m47690l91066m42565m79281m28438l78072m01557m65929
2035.5H11506987m41552l21745k56777l05355l27051k20775r2089o8963j03712o2764
2055.9H09306204N5611J11580P8023O5148R9718J34409R7871J967Q642J48952K18988
2078.3H10327113J28209L3796Q4162K06530K14577J14321R0063J90377K53380J83045
$$ plain form
2098.7 811825573 811920702 812058091 812297285 812513590 812606215 812667370 812824190 813006163 813078463 813071728 813106775
2121.1 813106775 813207746 813273728 813246548 813224494 813295722 813388169 813413799 813391566 813399553 813468337 813521564
2143.6 813521564 813516319 813541591 813659668 813824177 813970983 814100623 814314842 814648628 814997315 815305233
2164 815305233 815613270 815988660 816451192 816937804 817422271 817930400 818447173 818961978 819457173 819931328
2184.4 819931328 820437729 820960283 821451545 821914792 822353482 822785258 823251605 823728383 824159265 824569762
2204.8 824569762 825026572 825527728 826014459 826469362 826924980 827382982 827800095 828164101 828509331 828875661
2225.2 828875661 829248130 829555511 829817235 830113173 830427289 830704272 830929637 831118047 831337869 831619799
2245.6 831619799 831867039 832035542 832207799 832432926 832689762 832936347 833142340 833338320 833570719 833831966
$$ packed form
2098.7H11825573R5129J37389K39194K16305R2625O1155J56820J81973P2300o735L5047
2121.1H13106775J00971O5982k7180k2054P1228R2447K5630k2233P987O8784N3227
2143.6H13521564n245K5272J18077J64509J46806J29640K14219L33786L48687L07918
2164H15305233L08037L75390M62532M86612M84467N08129N16773N14805M95195M74155
2184.4H19931328N06401N22554M91262M63247M38690M31776M66347M76778M30882M10497
2204.8H24569762M56810N01156M86731M54903M55618M58002M17113L64006L45230L66330
2225.2H28875661L72469L07381K61724K95938L14116K76983K25365J88410K19822K81930
2245.6H31619799K47240J68503J72257K25127K56836K46585K05993J95980K32399K61247
$$ plain form
2265.9 833831966 834082246 834309161 834559917 834859431 835145712 835368872 835574687 835816205 836064816 836263418
2286.3 836263418 836407661 836530387 836646616 836737633 836786270 836847603 836966038 837070882 837095261 837051868
2306.7 837051868 837015271 837034762 837042511 836948335 836753726 836574793 836497247 836413622 836186469 835884631 835692883
2329.2 835692883 835585415 835388303 835125685 834918201 834743917 834585249 834603906 834897637 835178614 835120678
2349.6 835120678 834708869 834134877 833596587 833178103 832926810 832846522 832942426 833186626 833425999 833610952
2370 833610952 833856046 834178269 834491789 834714592 834817946 834874988 834940255 834956050 834867001 834696233 834521651
2392.4 834521651 834373057 834189236 833935022 833652437 833395779 833165944 832899511 832564294 832232952 831931531
2412.8 831931531 831590712 831190586 830762744 830310464 829846203 829389691 828899086 828377426 827872097 827374101
$$ packed form
2265.9H33831966K50280K26915K50756K99514K86281K23160K05815K41518K48611J98602
2286.3H36263418J44243J22726J16229R1017M8637O1333J18435J04844K4379m3393
2306.7H37051868l6597J9491P749r4176j94609j78933p7546q3625k27153l01838j91748
2329.2H35692883j07468j97112k62618k07484j74284j58668J8657K93731K80977n7936
2349.6H35120678m11809n73992n38290m18484k51293q0288R5904K44200K39373J84953
2370H33610952K45094L22223L13520K22803J03354N7042O5267J5795q9049j70768j74582
2392.4H34521651j48594j83821k54214k82585k56658k29835k66433l35217l31342l01421
2412.8H31931531l40819m00126m27842m52280m64261m56512m90605n21660n05329m97996
$$ plain form
2433.2 827374101 826855659 826315165 825791597 825275421 824700415 824088752 823524475 823034406 822573066 822076201
2453.6 822076201 821547449 821046829 820596933 820141912 819650650 819175363 818754971 818371236 817965746 817534566
2474 817534566 817122757 816735685 816360772 815970957 815562785 815199792 814915299 814638674 814321280 814000249
2494.4 814000249 813738883 813552201 813353419 813078761 812801182 812601984 812432230 812200189 811912000 811639428
2514.8 811639428 811384380 811058998 810659170 810290754 809978306 809638560 809208691 808738768 808290005 807812870
2535.2 807812870 807276309 806704879 806114435 805569410 805092812 804581702 804007232 803466678 802983463 802476823
2555.6 802476823 801921070 801379681 800881088 800409257 799932241 799431860 798936427 798442781 797929108 797408760
2576 797408760 796919465 796478868 796061039 795645297 795219243 794792056 794390559 793997765 793611944 793253660
$$ packed form
2433.2H27374101n18442n40494n23568n16176n75006o11663n64277m90069m61340m96865
2453.6H22076201n28752n00620m49896m55021m91262m75287m20392l83735m05490m31180
2474H17534566m11809l87072l74913l89815m08172l62993k84493k76625l17394l21031
2494.4H14000249k61366j86682j98782k74658k77579j99198j69754k32041k88189k72572
2514.8H11639428k55048l25382l99828l68416l12448l39746m29869m69923m48763m77135
2535.2H07812870n36561n71430n90444n45025m76598n11110n74470n40554m83215n06640
2555.6H02476823n55753n41389m98593m71831m77016n00381m95433m93646n13673n20348
2576G97408760m89295m40597m17829m15742m26054m27187m01497l92794l85821l58284
$$ plain form
2596.4 793253660 792898655 792517662 792103469 791667521 791200459 790673494 790073276 789401174 788691998 787953436
2616.8 787953436 787169456 786352515 785473943 784494698 783452988 782404661 781351447 780279815 779200017
2635.1 779200017 778116226 777011395 775874972 774735749 773632705 772557795 771488965 770422876
2651.4 770422876 769342244 768267989 767255068 766272604 765255928 764223158 763237059 762309909 761380732
2669.8 761380732 760431647 759538233 758721471 757920384 757111847 756297171 755485058 754706502 753942490 753151953
2690.2 753151953 752329648 751479805 750614583 749736011 748820484 747847497 746856570 745881557 744875968
2708.5 744875968 743846834 742838323 741802335 740742385 739730656 738757372 737778664 736793876 735843539
2726.9 735843539 734936118 734036624 733139098 732256472 731401503 730589628 729797125 728990674 728203058 727453411
$$ packed form
2596.4G93253660l55005l80993m14193m35948m67062n26965o00218o72102p09176p38562
2616.8G87953436p83980q16941q78572r79245j041710j048327j053214j071632j079798
2635.1G79200017j083791j104831j136423j139223j103044j074910j068830j066089
2651.4G70422876j080632j074255j012921r82464j016676j032770r86099r27150r29177
2669.8G61380732r49085q93414q16762q01087q08537q14676q12113p78556p64012p90537
2690.2G53151953q22305q49843q65222q78572r15527r72987r90927r75013j005589
2708.5G44875968j029134j008511j035988j059950j011729r73284r78708r84788r50337
2726.9G35843539r07421q99494q97526q82626q54969q11875p92503q06451p87616p49647
$$ plain form
2747.3 727453411 726703048 725947261 725234568 724578857 723932564 723264992 722612500 722013175 721422434 720779896
2767.7 720779896 720082641 719355762 718619108 717859685 717040777 716162145 715246439 714282870 713246465
2786 713246465 712114155 710910857 709687412 708433568 707072198 705568492 704020679 702464998 700815558
2804.4 700815558 699070573 697267175 695379436 693407118 691377461 689280689 687113523 684904516
2820.7 684904516 682626843 680231631 677765071 675257802 672630727 669855773 667019844 664155364
2837 664155364 661192358 658091486 654840648 651437938 647922575 644327760 640691578 637040794 633359253
2855.4 633359253 629580617 625554442 621138930 616292894 611030221 605365634 599356055 593143940
2871.7 593143940 586906195 580816925 575047970 569761515 565111399 561190724 558000803 555494726
$$ packed form
2747.3G27453411p50363p55787p12693o55711o46293o67572o52492n99325n90741o42538
2767.7G20779896o97255p26879p36654p59423q18908q78632r15706r63569j036405
2786G13246465j132310j203298j223445j253844j361370j503706j547813j555681j649440
2804.4G00815558j744985j803398j887739j972318k029657k096772k167166k209007
2820.7F84904516k277673k395212k466560k507269k627075k774954k835929k864480
2837F64155364k963006l100872l250838l402710l515363l594815l636182l650784l681541
2855.4F33359253l778636m026175m415512m846036n262673n664587o009579o212115
2871.7E93143940o237745o089270n768955n286455m650116l920675l189921k506077
$$ plain form
2888 555494726 553605318 552277505 551396549 550712407 550009191 549224675 548302948 547118902 545549631
2906.4 545549631 543550611 541154027 538370669 535187185 531699777 528168678 524874628 522038996
2922.7 522038996 519830823 518367350 517750323 518030465 519221008 521344543 524367809 528174758 532659709
2941 532659709 537719727 543188512 548935711 554938018 561141551 567379594 573547840 579692721 585804701
2959.4 585804701 591728628 597338855 602641344 607686818 612539470 617304981 622038186 626729906
2975.7 626729906 631387413 635964513 640336871 644407153 648160756 651637197 654870450 657772422
2992 657772422 660205901 662196875 663788378 664945364 665705025 666111469 666176796 665944695 665427804
3010.4 665427804 664578438 663386106 661914587 660221279 658327818 656286657 654114962 651776612
$$ packed form
2888E55494726j889408j327813q80956o84142p03216p84516r21727j184046j569271
2906.4E45549631j999020k396584k783358l183484l487408l531099l294050k835632
2922.7E22038996k208173j463473o17027K80142J190543K123535L023266L806949M484951
2941E32659709N060018N468785N747199O002307O203533O238043O168246O144881O111980
2959.4E85804701N923927N610227N302489N045474M852652M765511M733205M691720
2975.7F26729906M657507M577100M372358M070282L753603L476441L233253K901972
2992F57772422K433479J990974J591503J156986P59661M06444O5327k32101n16891
3010.4F65427804q49366j192332j471519j693308j893461k041161k171695k338350
$$ plain form
3026.7 651776612 649335265 646875560 644386530 641753376 638894916 635971427 633108854 630192339
3043 630192339 627129018 623962045 620771289 617573559 614341319 611079037 607772589 604416907 601104081
3061.4 601104081 597880721 594652534 591315448 587873399 584420919 581030905 577744961 574535728
3077.7 574535728 571246207 567835927 564403951 560937166 557476163 554117560 550760865 547323823
3094 547323823 543920517 540660858 537448108 534112215 530719280 527471244 524354875 521195233 518049598
3112.4 518049598 515070915 512123644 509050548 505823553 502440631 499108553 496045500 493153691
3128.7 493153691 490207165 487140238 484161735 481462419 478831083 475974411 473012477 470198333
3145 470198333 467543066 465010285 462576896 460042298 457320809 454643637 452110440 449636608 447197407
$$ packed form
3026.7F51776612k441347k459705k489030k633154k858460k923489k862573k916515
3043F30192339l063321l166973l190756l197730l232240l262282l306448l355682l312826
3061.4F01104081l223360l228187l337086l442049l452480l390014l285944l209233
3077.7E74535728l289521l410280l431976l466785l461003l358603l356695l437042
3094E47323823l403306l259659l212750l335893l392935l248036l116369l159642l145635
3112.4E18049598k978683k947271l073096l226995l382922l332078l063053k891809
3128.7D93153691k946526l066927k978503k699316k631336k856672k961934k814144
3145D70198333k655267k532781k433389k534598k721489k677172k533197k473832k439201
$$ plain form
3163.4 447197407 444812775 442490458 440183192 437906176 435720444 433578849 431418329 429288626
3179.7 429288626 427246720 425257683 423277885 421330571 419444412 417585731 415730417 413871527
3196 413871527 412009269 410225779 408566833 406942308 405304462 403681189 402110189 400635928 399195492
3214.3 399195492 397713542 396263093 394877762 393493831 392107934 390765220 389527619 388430327
3230.7 388430327 387357295 386109471 384753227 383514464 382395536 381350398 380400389 379462332 378426671
3249 378426671 377361089 376415014 375576705 374700934 373767555 372896761 372116506 371379137 370745182 370242327
3269.4 370242327 369627625 368778735 367873341 367006123 366199374 365469992 364780307 364093453 363420248 362831116
3289.8 362831116 362280071 361601979 360769659 359864593 359003097 358338535 357850969 357257694 356344938 355220973
$$ packed form
3163.4D47197407k384632k322317k307266k277016k185732k141595k160520k129703
3179.7D29288626k041906j989037j979798j947314j886159j858681j855314j858890
3196D13871527j862258j783490j658946j624525j637846j623273j571000j474261j440436
3214.3C99195492j481950j450449j385331j383931j385897j342714j237601j097292
3230.7C88430327j073032j247824j356244j238763j118928j045138r50009r38057j035661
3249C78426671j065582r46075q38309q75771r33379q70794p80255p37369o33955n02855
3269.4C70242327o14702q48890r05394q67218q06749p29382o89685o86854o73205n89132
3289.8C62831116n51045o78092q32320r05066q61496o64562m87566n93275r12756j123965
$$ plain form
3310.2 355220973 354091048 353053838 352093637 351147950 350219160 349342376 348475814 347464889 346279860
3328.6 346279860 345103174 344037563 343082905 342179418 341145217 339944184 338748932 337572008 336396128
3346.9 336396128 335334420 334204316 332776725 331287801 330007166 328879476 327708840 326447546
3363.2 326447546 325301439 324310452 323167056 321681708 320122063 318813026 317697555 316607267
3379.5 316607267 315499872 314455092 313547462 312825501 312325895 311750919 310811579 309843719 309278280
3397.9 309278280 308939964 308307141 307295889 306365281 305737406 305272222 304815114 304233074 303609580
3416.3 303609580 303186268 302889109 302502245 302155674 302038074 302074254 302061439 302060008 302240193 302334785
3436.6 302334785 302108020 301862240 301904857 302186221 302508980 302763939 303033888 303372741 303782046 304343522
$$ packed form
3310.2C55220973j129925j037210r60201r45687r28790q76784q66562j010925j185029
3328.6C46279860j176686j065611r54658r03487j034201j201033j195252j176924j175880
3346.9C36396128j061708j130104j427591j488924j280635j127690j170636j261294
3363.2C26447546j146107r90987j143396j485348j559645j309037j115471j090288
3379.5C16607267j107395j044780r07630p21961m99606n74976r39340r67860n65439
3397.9C09278280l38316o32823j011252r30608o27875m65184m57108n82040o23494
3416.3C03609580m23312k97159l86864l46571j17600L6180j2815j431J80185R4592
3436.6C02334785k26765k45780M2617K81364L22759K54959K69949L38853M09305N61476
$$ plain form
3457 304343522 305057287 305692315 306208968 306960523 307937980 308631003 308874875 309107035 309652865 310484409
3477.4 310484409 311360478 311996758 312573135 313348800 314103812 314761877 315542489 316426903 317329109 318229288
3497.8 318229288 319156736 320104390 320844859 321391225 322081298 323022008 324106991 325165182 326088011
3516.2 326088011 327032089 328208208 329595447 330847830 331810683 332748920 333843976 335118324 336560130
3534.5 336560130 338007241 339345068 340824783 342611074 344383568 345764458 347008735 348514855
3550.9 348514855 350185484 351889044 353719383 355761319 357956201 360198647 362484902 364830375
3567.2 364830375 367108583 369333357 371723205 374387473 377237022 380243599 383459091 386889517
3583.5 386889517 390410513 393707037 396802396 400065869 403612345 407324493 411162585 415069282
$$ packed form
3457C04343522P13765O35028N16653P51555R77457O93023K43872K32160N45830Q31544
3477.4C10484409Q76069O36280N76377P75665P55012O58065P80612Q84414R02206R00179
3497.8C18229288R27448R47654P40469N46366O90073R40710J084983J058191R22829
3516.2C26088011R44078J176119J387239J252383R62853R38237J095056J274348J441806
3534.5C36560130J447111J337827J479715J786291J772494J380890J244277J506120
3550.9C48514855J670629J703560J830339K041936K194882K242446K286255K345473
3567.2C64830375K278208K224774K389848K664268K849549L006577L215492L430426
3583.5C86889517L520996L296524L095359L263473L546476L712148L838092L906697
$$ plain form
3599.8 415069282 418937236 422847956 426909745 431145161 435438037 439693153 443920553 448113978
3616.1 448113978 452366143 456629306 460678220 464759618 469162017 473744929 478015304 481873453
3632.4 481873453 485760659 489760280 493781626 497898608 502203405 506772280 511581123 516245782
3648.8 516245782 520137131 523481250 527008116 530889988 534717143 538310826 541858912 545629561
3665.1 545629561 549635708 553634167 557404637 560871243 563988626 566656470 569174707 571888864
3681.4 571888864 574889421 578198731 581733108 584777653 586914718 588875890 591114223 593532681
3697.7 593532681 595937371 598141432 600167394 602347314 604847193 607325196 609179854 610603034
3714 610603034 612181365 614019394 615967631 617835939 619456470 620831966 622345746 624306679 626618445
$$ packed form
3599.8D15069282L867954L910720M061789M235416M292876M255116M227400M193425
3616.1D48113978M252165M263163M048914M081398M402399M582912M270375L858149
3632.4D81873453L887206L999621M021346M116982M304797M568875M808843M664659
3648.8E16245782L891349L344119L526866L881872L827155L593683L548086L770649
3665.1E45629561M006147L998459L770470L466606L117383K667844K518237K714157
3681.4E71888864L000557L309310L534377L044545K137065J961172K238333K418458
3697.7E93532681K404690K204061K025962K179920K499879K478003J854658J423180
3714F10603034J578331J838029J948237J868308J620531J375496J513780J960933K311766
$$ plain form
3732.4 626618445 628686070 629947186 630868495 632165134 633735895 635175705 636568367 637988925
3748.7 637988925 639048398 639687240 640475869 641557038 642662466 643640995 644667745 645862639 647092700
3767.1 647092700 648146093 648908913 649617732 650665283 652055264 653285027 654129028 654901326 655723751
3785.4 655723751 656563044 657473862 658486724 659652770 660964072 662261784 663347840 664086640 664701164
3803.8 664701164 665331364 665806234 666304111 667176902 668357432 669540405 670693398 671627462 672024906
3822.1 672024906 672317207 672840655 673472822 674246550 675278544 676509857 677564800 678133309 678415895
3840.5 678415895 678585291 678704917 679076970 680036485 681497633 682565451 682536602 682456970 682887554 683655918
3860.9 683655918 684480488 685111940 685677826 686270356 686684310 686880827 687111497 687639713 688399196 689070046
$$ packed form
3732.4F26618445K067625J261116R21309J296639J570761J439810J392662J420558
3748.7F37988925J059473O38842P88629J081169J105428R78529J026750J194894J230061
3767.1F47092700J053393P62820P08819J047551J389981J229763Q44001P72298Q22425
3785.4F55723751Q39293R10818J012862J166046J311302J297712J086056P38800O14524
3803.8F64701164O30200M74870M97877Q72791J180530J182973J152993R34064L97444
3822.1F72024906K92301N23448O32167P73728J031994J231313J054943N68509K82586
3840.5F78415895J69396J19626L72053R59515J461148J067818k8849p9632M30584P68364
3860.9F83655918Q24570O31452N65886N92530M13954J96517K30670N28216P59483O70850
$$ plain form
3881.3 689070046 689579129 689934433 690209150 690621912 690944731 691059768 691511810 692464590 693391800 693853855
3901.7 693853855 693837166 693553805 693359792 693445265 693813622 694413841 695040405 695435941 695629001 695843220
3922.1 695843220 696124017 696386814 696707726 697078943 697277784 697289824 697364509 697657347 698061347 698386431
3942.5 698386431 698632002 698926270 699241757 699448228 699607551 699808538 699978650 700194776 700541258 700848699
3962.9 700848699 701043963 701226115 701443851 701702833 701964140 702133238 702243865 702419281 702701271 703027785
3983.2 703027785 703257680 703381300 703532815 703761220 703997850 704159439 704286575
3997.5 704286575
$$ packed form
3881.3F89070046N09083L55304K74717M12762L22819J15037M52042R52780R27210M62055
3901.7F93853855j6689k83361j94013Q5473L68357O00219O26564L95536J93060K14219
3922.1F95843220K80797K62797L20912L71217J98841J2040P4685K92838M04000L25084
3942.5F98386431K45571K94268L15487K06471J59323K00987J70112K16126L46482L07441
3962.9G00848699J95264J82152K17736K58982K61307J69098J10627J75416K81990L26514
3983.2G03027785K29895J23620J51515K28405K36630J61589J27136
3997.5G04286575
##END=$$ End of the data block
