##TITLE=Capinzal - Marcela $$ Begin of the data block
##JCAMP-DX=5.00 $$ ACD/SpecManager v 10.08
##SPECTROMETER/DATA SYSTEM=Alpha
##DATE=24 Oct 2013 13:19:44
##DATA TYPE=INFRARED SPECTRUM
##DATA CLASS=XYDATA
##ORIGIN=
##OWNER=
##NPOINTS=1765
##FIRSTX=399.75695801
##LASTX=3997.56933594
##MAXX=3997.56933594
##MINX=399.75695801
##MAXY=0.83803511
##MINY=0.22323257
##XFACTOR=1.0000000000
##YFACTOR=1.000000000000000e-9
##FIRSTY=0.52558285
##DELTAX=2.03957629
##XUNITS=1/CM
##YUNITS=ARBITRARY UNITS
##XYDATA=(X++(Y..Y))
399.8 525582850 521031320 517608285 515327752 514987469 516027510 517172158 518289328 520117998 521862805
418.1 521862805 520835936 517591238 514318347 511577725 509138882 506511927 503880322 502219379
434.4 502219379 501990736 502697647 504223406 506895661 510557652 514157236 516590297 518325448 520243287
452.8 520243287 521859646 522032201 520250618 517902792 515983582 513725936 510512948 506981790 503879368
471.1 503879368 500785530 497505099 494751453 492995292 492221713 491879135 491475493 491244823 491339177
489.5 491339177 491283089 490428150 488859504 487358749 486096561 484369874 481858164 479164958 476680785
507.9 476680785 473819673 469963402 465654135 461598992 457742274 453991503 450587422 448109001
524.2 448109001 447020471 447307050 448659182 450888127 454310775 459188551 464895576 470238298 474322528
542.5 474322528 476897687 478048563 477783203 476322472 474189997 471590906 468222797 463787705 458542943
560.9 458542943 452768117 446460038 439734876 433036149 427259862 423454523 422112554 423120499
577.2 423120499 426375061 431671649 438482195 445853084 452629507 458166301 462246895 464657724
593.5 464657724 465672344 465852171 465684533 465620190 465711236 465916038 466413647 467608869 469673544 472278297
613.9 472278297 475304186 479118705 483869851 489098191 494284600 499180257 503743708 507834792
630.2 507834792 511181593 513714015 515739918 517636240 519358099 520669699 521753848 523006320
646.5 523006320 524533093 525936067 526874006 527760327 529062331 530641079 532021403 533044338 534064829
664.9 534064829 535553098 537343144 538462043 539449930 540967941 542894244 544604421 545876861 547149837
683.3 547149837 548634768 549869597 550435901 550402224 549896598 548738301 546459079 542966783 539081037
701.6 539081037 535799026 533343494 531675994 531339645 533052981 536770165 541657567 547159433 553515851
720 553515851 560731649 568105936 574936986 580958784 586426556 591452897 595516741 598162055 599606037
738.3 599606037 600270689 599938333 597867966 593807042 588518620 582764626 576502681 569644868 562921345
756.7 562921345 557421863 553548813 551232338 550956666 553595603 559320390 567212880 576130271 585545778
775 585545778 595214307 604573667 612705469 619123876 624472857 629648805 634701550 639098346 643041909
793.4 643041909 647687435 653518558 659541965 664658844 668954432 673044622 676763356 679324985
809.7 679324985 680776596 682100117 683612764 684369206 683613241 681800783 679583192 676436663 671400130
828.1 671400130 664675534 657338440 649994731 642403007 634557605 627349854 621638358 617196321
844.4 617196321 613233447 609630585 606862068 604934812 603073597 600883126 599400640 600353897 604690135
862.7 604690135 612022758 621386886 632102787 643188357 652764916 659249485 662491560 663056076
879.1 663056076 660962760 655817211 648106694 639439762 631117463 623299599 615768492 608773649
895.4 608773649 602727413 597315133 591514409 584678054 576989114 568694293 559498668 549024820
911.7 549024820 537733197 526796699 517043948 508734524 502164304 497830570 495878577 495663315
928 495663315 496350855 497814775 500521481 504670322 509792805 515244544 520365477 523741305 523130834
946.4 523130834 516973734 505664706 490936518 474263638 456146032 436840653 416947871 396921396
962.7 396921396 376670599 356017351 335245460 314939111 295598209 277585268 261356890
977 261356890 247594640 236929595 229547963 225150123 223232567 223272398 224786326 227281258 230208933
995.3 230208933 233160362 235998705 238621414 240776300 242212132 242981359 243397355 243705243 244063810
1013.7 244063810 244681105 245818958 247582376 249840856 252423495 255281419 258425713 261715531
1030 261715531 264828533 267474830 269644946 271515399 273211181 274798512 276437759 278403610 280862391
1048.3 280862391 283818841 287339300 291635454 296998322 303601921 311426163 320492268 330424756
1064.7 330424756 339358777 343895435 341459900 333023131 322562426 313808888 308210999 305609494
1081 305609494 305475861 307291448 310515612 314696670 319566786 324892849 330218554 334840745 338233709
1099.3 338233709 340428442 341949731 343391597 345171809 347519964 350491732 353952467 357503265
1115.6 357503265 360686809 363322079 365589440 367854267 370455474 373653293 377540797 381601751
1132 381601751 384603322 385279983 383001983 377968103 370980620 363011956 354888231 347283155 340739459
1150.3 340739459 335512191 331553191 328777581 327230006 327010751 328197956 330866098 335197896
1166.6 335197896 341447681 349765748 360056430 372019827 385300815 399541080 414308250 429006517
1182.9 429006517 443028957 455961019 467445195 477032036 484413952 489694715 493400902 496159971
1199.3 496159971 498427391 500598371 503181040 506662667 511139095 516306102 521822810 527441621
1215.6 527441621 532767653 537186205 540254533 542013347 542748630 542666674 541913509 540736914 539534807
1233.9 539534807 538630664 538056672 537734568 537809670 538548589 539967477 541814327 543885946 546186030
1252.3 546186030 548712790 551278114 553640306 555800438 558016837 560427189 562883914 565238237
1268.6 565238237 567481041 569540560 571173966 572131872 572421193 572309256 572027028 571546018 570709467
1287 570709467 569544077 568231821 566764414 565018952 563104093 561353564 559965074 558856845 557922602
1305.3 557922602 557102621 556329727 555459976 554244041 552605271 550660908 548370361 545527458 542005718
1323.7 542005718 537862718 533291221 528517365 523839176 519699097 516540051 514393032 512793064
1340 512793064 511477411 510558069 509950399 509350717 508508265 507382572 506090283 504741192 503422976
1358.3 503422976 502167702 500743985 499155432 497948110 497319609 497264177 497926205 499067992 500272334
1376.7 500272334 501564920 503004432 504795730 507503629 511149585 514668107 517524302 520067751
1393 520067751 521893203 522438347 521908998 520830810 519688785 518268228 516405165 514529884 512865484
1411.4 512865484 511528015 510776579 510446727 509818792 509053409 508833826 509049594 509643614 510570586
1429.7 510570586 511613429 513039589 514933646 516400516 517316759 518426955 519636095 520590961 520813048
1448.1 520813048 520102739 519112229 518494368 517757118 515751481 513965845 513972998 515802383 518865228
1466.4 518865228 523132086 529505074 538185298 546885610 554510891 561934292 569572389 577328563
1482.8 577328563 584970057 592805922 600568533 607087195 612312555 617852867 623961329 629003704
1499.1 629003704 633090436 637562394 643537462 649524748 652401567 654399574 657348454 661090612
1515.4 661090612 664911568 668444395 671698153 674037695 675906658 677828848 679872096 682556868
1531.7 682556868 685246229 687351584 690339029 694380164 696501315 696901143 697358429 698478818 700221062
1550.1 700221062 702143908 704420924 707500577 710890651 711346567 710222721 710389614 711625099 713176489
1568.4 713176489 714105308 714574695 715662837 716559350 716187000 715650797 715398371 715178132 714762807
1586.8 714762807 714024067 712916672 711530149 709819257 707653284 705135643 702341557 699225843
1603.1 699225843 695796490 692031085 687698960 683043599 678782463 674450517 668717146 663234413
1619.4 663234413 659009099 654530585 649648070 645001411 640718639 637597322 635773182 633615971
1635.7 633615971 630622625 628458977 627695680 628338993 630002379 631469250 633026421 636211693 639318705
1654.1 639318705 640474200 642320096 645730972 649950922 653952360 657932401 662903428 668025017
1670.4 668025017 672180116 676512837 680992544 685085356 689699113 695416749 700986505 704352021
1686.7 704352021 707144082 710523307 714357495 719141304 724033117 728104591 731281519 733343482
1703 733343482 735484540 737665474 739517748 741812706 744889736 748402059 751164854 752139032 752727151
1721.4 752727151 754003584 755654633 757507980 759733498 762299538 764691412 765688837 766344130 767718852
1739.7 767718852 769142032 770428717 771998107 773873389 775463164 776187778 776707113 777722359 778898954
1758.1 778898954 780057728 781079710 781771302 782776415 784304619 785934150 786998391 787107885 787167728
1776.5 787167728 787815034 788707793 789469302 790096819 790661395 791612864 793096721 794119060 794271886
1794.8 794271886 794580877 795431793 796275079 796647549 796890497 797516942 798458099 799178898 799473226 799817979
1815.2 799817979 800421298 801051617 801721454 802576125 803420246 804169118 804745078 804719150 804547429 804802179
1835.6 804802179 805195689 805571258 806278944 807086766 807184219 806792617 806494355 806447327 806636035 806894124
1856 806894124 807085097 807232201 807466328 807949066 808724463 809315801 809176445 808819890 808813751 808984935
1876.4 808984935 809201181 809531510 809921503 810266435 810647726 811125398 811437726 811551571 811624527 811647296
1896.8 811647296 811739147 811949909 812114060 812214494 812416375 812692344 812795877 812756956 812933564 813335955
1917.2 813335955 813555777 813570917 813530147 813422441 813410759 813515127 813592851 813651919 813768685 813971817
1937.6 813971817 814295650 814663708 814794064 814730942 814732254 814819217 814980984 815220952 815455377 815635324
1958 815635324 815804720 815991461 816253006 816552103 816688895 816678047 816709638 816824079 816968560 817084432
1978.4 817084432 817151308 817231596 817362309 817516863 817688763 817878127 817930758 817789316 817664385 817608178
1998.8 817608178 817528784 817447722 817382634 817246020 816999733 816736162 816525578 816323459 816005170 815543950
2019.2 815543950 815101683 814733505 814319372 813844979 813396394 813011885 812635958 812208116 811789274 811477363
2039.6 811477363 811217427 810878515 810502350 810250759 810175240 810147226 810042739 809943795 810001910 810167611
2060 810167611 810278356 810325861 810404122 810544670 810660243 810662329 810654521 810793757 811014056 811138570 811174870
2082.4 811174870 811280131 811503649 811729014 811849296 811920345 812078297 812310874 812476456 812549531 812677681
2102.8 812677681 812923849 813138783 813225091 813291967 813447416 813628733 813721776 813723624 813744128 813840151 813901544
2125.2 813901544 813842118 813788116 813865185 813985109 814031482 814017773 814023793 814088821 814150333 814147830 814151049 814265013
2149.7 814265013 814456165 814615667 814740002 814934969 815246344 815596342 815917253 816233873 816621721 817104638
2170.1 817104638 817603886 818070173 818557560 819075644 819581091 820066273 820559323 821092725 821619928 822082758
2190.5 822082758 822517335 822963297 823415458 823877573 824327648 824741423 825166941 825646877 826144814 826616168
2210.9 826616168 827066183 827511609 827974379 828442395 828838527 829162657 829507887 829877734 830197096 830466330
2231.3 830466330 830747604 831051469 831339061 831586719 831802905 832045734 832337916 832588494 832750678 832910836
2251.7 832910836 833135843 833385050 833599150 833772421 833968818 834236264 834536254 834830165 835101485 835356176
2272.1 835356176 835626960 835881829 836101532 836354733 836640775 836885095 837053835 837177515 837317884 837471306
2292.5 837471306 837573588 837621331 837691247 837828040 837972999 838035107 838012815 837985575 837972045 837930620 837846637
2314.9 837846637 837700486 837537229 837445736 837317705 837038934 836760938 836611152 836519063 836374879 836122334
2335.3 836122334 835810840 835544765 835386992 835419476 835701942 835975170 835893214 835428655 834803700 834272802
2355.7 834272802 833844066 833453834 833297729 833522022 833938301 834278882 834505200 834727407 834991336 835251868
2376.1 835251868 835453033 835614741 835746229 835797310 835728943 835565448 835369289 835198402 835067511 834923208
2396.5 834923208 834707499 834420145 834130764 833900869 833663821 833323896 832943857 832632124 832360506 832017243
2416.9 832017243 831579626 831105173 830610871 830108643 829615951 829146445 828690529 828204751 827648699 827024341
2437.3 827024341 826431930 825939894 825465739 824931860 824398637 823932230 823456824 822894812 822305083 821775138
2457.7 821775138 821321726 820893168 820438564 819984615 819592953 819226921 818792582 818314254 817875803 817516804
2478.1 817516804 817199171 816818893 816378534 815982163 815667093 815383554 815079808 814773917 814539850 814366341
2498.5 814366341 814134300 813830554 813580394 813406944 813214719 812968910 812687814 812412262 812165141 811876118
2518.9 811876118 811511338 811150670 810836792 810497642 810054362 809551239 809070051 808588266 808079302 807559907
2539.2 807559907 807031095 806521237 806030750 805486023 804901004 804371595 803908110 803429961 802889824 802356839
2559.6 802356839 801911712 801474988 800947249 800401807 799889326 799366355 798846483 798355401 797884047 797419727
2580 797419727 796979189 796586335 796199679 795788229 795380473 794990420 794616163 794234216 793833852 793447077
2600.4 793447077 793077826 792685390 792211950 791680038 791121602 790476203 789746642 788968980 788143456 787304521
2620.8 787304521 786437392 785497785 784506500 783466220 782369316 781269550 780187428 779095173 778006673
2639.2 778006673 776939094 775862038 774736583 773590624 772496521 771437883 770354807 769277692
2655.5 769277692 768268406 767309964 766331971 765308559 764294863 763334990 762415051 761498332 760569036
2673.9 760569036 759706497 758949995 758192718 757383704 756589949 755832970 755054474 754236341 753414750 752583981
2694.3 752583981 751708388 750792980 749874592 748948634 747970223 746952295 745934069 744926274 743926942
2712.6 743926942 742902994 741862118 740851223 739863098 738879681 737909317 736975729 736088872 735222340
2731 735222340 734348178 733466387 732600272 731763303 730944455 730133057 729329765 728551745 727812350 727117896
2751.4 727117896 726470530 725821018 725128293 724435747 723777592 723154724 722566187 721947491 721251965 720540166
2771.8 720540166 719844460 719110370 718291223 717399240 716468990 715496838 714450419 713319421 712136924
2790.1 712136924 710945487 709706604 708335638 706845939 705318272 703769267 702147305 700413883
2806.4 700413883 698590934 696725845 694798410 692751288 690606534 688437223 686250925 683970213
2822.7 683970213 681566000 679093480 676567972 673932672 671160400 668311715 665432096 662467897
2839.1 662467897 659354210 656076908 652668536 649185598 645618200 641950369 638227522 634483397
2855.4 634483397 630664647 626599312 622143626 617277265 612018764 606360495 600330412 594069183
2871.7 594069183 587782383 581668496 575895548 570598543 565903783 561932743 558726013 556212842
2888 556212842 554324925 553019285 552147090 551464319 550764978 549968541 549029350 547807038 546196520
2906.4 546196520 544197559 541822851 539045274 535835326 532313108 528774321 525497198 522669256
2922.7 522669256 520462453 518992186 518332660 518581867 519797683 521954179 524977744 528782547 533265829
2941 533265829 538316965 543811321 549591660 555569768 561737299 568011105 574268579 580467165 586585343
2959.4 586585343 592524707 598151803 603456616 608548105 613504231 618352354 623115361 627829134
2975.7 627829134 632511675 637115359 641555727 645738423 649591327 653122544 656360865 659245491
2992 659245491 661696553 663725495 665349722 666543961 667337298 667795658 667931139 667742014 667251170
3010.4 667251170 666422606 665231824 663763046 662074447 660178244 658143342 655989647 653678060
3026.7 653678060 651266634 648836136 646356642 643702328 640846670 637936771 635041177 632094681
3043 632094681 629026711 625839591 622641742 619472146 616282940 613056302 609718382 606275022 602931082
3061.4 602931082 599764168 596573234 593193650 589705586 586238205 582841694 579560816 576358080
3077.7 576358080 573069334 569649935 566194415 562702179 559206247 555795550 552393913 548938990
3094 548938990 545558274 542350054 539159954 535774410 532295287 528998971 525876999 522683263 519458771
3112.4 519458771 516443431 513529062 510468602 507211924 503823161 500492215 497361660 494345874
3128.7 494345874 491321087 488286555 485370785 482665330 479999632 477129072 474118412 471220940
3145 471220940 468511909 465947866 463485956 460952669 458253384 455558360 452975720 450467795 448022574
3163.4 448022574 445646524 443300307 440954179 438649178 436422080 434253931 432084709 429922938
3179.7 429922938 427847356 425854415 423867583 421869367 419919014 418045938 416208446 414341182
3196 414341182 412451804 410650551 408980012 407344401 405691534 404049009 402483106 401015252 399545103
3214.3 399545103 398060203 396623403 395209372 393795550 392403096 391084284 389891952 388821572
3230.7 388821572 387770921 386552036 385187209 383915067 382793099 381734431 380724639 379730314
3247 379730314 378659606 377583236 376663536 375831008 374892831 373896778 373036355 372302979 371582747 370943189
3267.4 370943189 370444745 369842619 368966758 367986768 367074758 366271764 365527689 364772052 364008546 363263667
3287.8 363263667 362602741 362020433 361338139 360464215 359497398 358600497 357913673 357406586 356795579 355856657
3308.2 355856657 354693025 353526145 352488399 351534069 350567788 349617094 348730862 347858429 346840233
3326.5 346840233 345660388 344509840 343451113 342437446 341462195 340435624 339262336 338013589
3342.8 338013589 336761683 335560888 334504277 333393574 331975847 330454648 329117090 327920467
3359.1 327920467 326706827 325518221 324486315 323477507 322200745 320620209 319061399 317791522
3375.5 317791522 316689104 315572858 314431906 313350409 312414408 311700106 311223119 310663253 309731483
3393.8 309731483 308774531 308228791 307882488 307187855 306117803 305180699 304557383 304080635 303615451
3412.2 303615451 303039789 302420318 301955223 301615596 301239103 300909519 300818145 300916940 300968379 300994873
3432.6 300994873 301152885 301207840 300999165 300812453 300868213 301117897 301407725 301626682 301867157 302234262
3453 302234262 302709460 303284228 303927839 304487914 304994345 305773109 306792110 307523608 307786763 308032870
3473.4 308032870 308588862 309425890 310307890 310947597 311514467 312277853 313033670 313681692 314451694 315356910
3493.8 315356910 316266835 317140788 318070829 319072366 319864213 320463687 321226895 322197855 323271453
3512.1 323271453 324350983 325318992 326266855 327413678 328788817 330053121 331024021 331960648 333057076
3530.5 333057076 334350944 335865885 337390810 338744700 340240806 342064112 343866855 345296651
3546.8 345296651 346566767 348045826 349692076 351402670 353269309 355366111 357597500 359854966
3563.1 359854966 362201154 364647329 366973519 369200289 371612608 374319911 377200842 380231857
3579.4 380231857 383493572 387016803 390665412 394067496 397199094 400470048 404061735 407844424
3595.7 407844424 411709577 415621072 419560075 423585773 427725673 432001710 436344773 440635562
3612.1 440635562 444869488 449112535 453435302 457697928 461735785 465862691 470296502 474872351
3628.4 474872351 479153365 483045161 486963362 490981758 495028049 499198824 503569245 508148313
3644.7 508148313 512898445 517504930 521359026 524664700 528207958 532163739 536023915 539614499
3661 539614499 543166101 546953738 551002026 555021882 558756888 562227964 565421343 568104088 570512593
3679.4 570512593 573080063 576025248 579396665 583035529 586156964 588274300 590132475 592292905
3695.7 592292905 594705641 597097278 599245429 601239443 603429496 605944037 608432174 610321701
3712 610321701 611752689 613270402 615051329 616966963 618783414 620395899 621837854 623377800 625357926
3730.3 625357926 627789199 629952848 631171286 632031560 633330107 634919822 636328578 637670934
3746.7 637670934 639096737 640177608 640758872 641488135 642568529 643642783 644559622 645596862 646854639
3765 646854639 648137689 649226129 650020003 650773287 651834667 653194785 654409528 655244350 655982375
3783.4 655982375 656765401 657594681 658522129 659566879 660783589 662102818 663333893 664363563 665100574
3801.7 665100574 665731311 666389763 666899681 667402804 668276250 669492304 670710325 671851873 672777653
3820.1 672777653 673170209 673427641 673923194 674544811 675335467 676407814 677660525 678719580 679294348
3838.4 679294348 679559827 679710090 679864466 680265784 681227028 682748675 683889866 683790326 683584452
3856.8 683584452 683935940 684680521 685511947 686141193 686737478 687369704 687764943 687926590 688098788 688559473
3877.2 688559473 689318597 690007329 690501571 690849185 691083670 691429019 691761553 691946924 692399383 693318844
3897.6 693318844 694299996 694830716 694811523 694507718 694286108 694322824 694616914 695164442 695827603 696317434
3918 696317434 696588695 696856320 697137535 697302938 697533309 697962165 698316038 698437810 698497653 698643923
3938.4 698643923 698925972 699288666 699580073 699824750 700117052 700360835 700511456 700681388 700910330 701173723
3958.8 701173723 701440811 701662779 701848507 702077806 702403009 702712774 702909589 703068852 703249216 703454852
3979.2 703454852 703704119 703968883 704196036 704394877 704589784 704780757 704962552 705119908 705270350
3997.5 705270350
##END=$$ End of the data block
