##TITLE=Capinzal - Marcela $$ Begin of the data block
##JCAMP-DX=5.00 $$ ACD/SpecManager v 10.08
##SPECTROMETER/DATA SYSTEM=Alpha
##DATE=24 Oct 2013 13:19:44
##DATA TYPE=INFRARED SPECTRUM
##DATA CLASS=XYDATA
##ORIGIN=
##OWNER=
##NPOINTS=1765
##FIRSTX=399.75695801
##LASTX=3997.56933594
##MAXX=3997.56933594
##MINX=399.75695801
##MAXY=0.83910424
##MINY=0.22305846
##XFACTOR=1.0000000000
##YFACTOR=1.000000000000000e-9
##FIRSTY=0.52372414
##DELTAX=2.03957629
##XUNITS=1/CM
##YUNITS=ARBITRARY UNITS
##XYDATA=(X++(Y..Y))
399.8 523724139 519005001 515017807 512340665 511887014 513429999 515292466 516348898 517529368 518802941
418.1 518802941 517904639 515037298 511937916 509339392 507088304 504617214 502291799 500860512 500565350
436.5 500565350 501050234 502332151 505133390 509040236 512549698 514934897 516693890 518642306 520415306
454.8 520415306 520553946 518697202 516673386 515181899 513069212 509701252 506064534 503093839 500166059
473.2 500166059 496860176 493809938 491848737 491283059 491216570 490755588 490335524 490417123 490403146 489532411
493.6 489532411 487944275 486452132 485331357 483776838 481318921 478645980 475979567 472837925
509.9 472837925 469060808 464976519 460972816 457096785 453234732 449746996 447414219 446558893 446952552
528.3 446952552 448203683 450321078 453755707 458632052 464302391 469533473 473550558 476298511
544.6 476298511 477606624 477312535 475799620 473635495 471014291 467669725 463328481 458127826 452262163
562.9 452262163 445889562 439130574 432361156 426621765 422949016 421676934 422735125 426063478
579.2 426063478 431395322 438156843 445404947 452175885 457896113 462125957 464503258 465399712 465569854
597.6 465569854 465465784 465341538 465284109 465382367 465929747 467323095 469534755 472190619 475194752
616 475194752 478928983 483667850 488981783 494232595 499181300 503853440 508012116 511346459 513857424
634.3 513857424 515909791 517849863 519626737 521020830 522082746 523162484 524537265 525978267
650.6 525978267 527059317 528015912 529395163 531121314 532541513 533418596 534142673 535326064 537311077
669 537311077 538844526 539954126 541453779 543360949 545012116 546210825 547513485 549122870 550452888
687.3 550452888 551014781 550929785 550367951 549174249 546938241 543528438 539640486 536233366 533683538
705.7 533683538 532118320 531926394 533625007 537298799 542239428 547791898 554127574 561274827 568513989
724 568513989 575259268 581413627 587099850 592228651 596269011 598872304 600364447 601143003 600817740
742.4 600817740 598627627 594457269 589072883 583244920 576932430 570037067 563334107 557819605
758.7 557819605 553873003 551525950 551237106 553835511 559562564 567580402 576647222 586132526 595853329
777.1 595853329 605202436 613246441 619682372 625119150 630265951 635206580 639552355 643542409
793.4 643542409 648217440 654001415 659984946 665116906 669470549 673617840 677335620 679877341
809.7 679877341 681336403 682666600 684229195 685073137 684361696 682532907 680214822 676943421 671785176
828.1 671785176 664925098 657529414 650175214 642528057 634592235 627295971 621520400 617077887
844.4 617077887 613196552 609671831 606917918 604983687 603147924 600993454 599503815 600470483 604877651
862.7 604877651 612249196 621578693 632236004 643313229 652925849 659364581 662450850 662907302
879.1 662907302 660806417 655684054 647992134 639298677 630900204 622981906 615359664 608340561
895.4 608340561 602345467 597011864 591263771 584448099 576780438 568488359 559243500 548733771
911.7 548733771 537482023 526582420 516782820 508387089 501779437 497491717 495612860 495436400
928 495436400 496134311 497592866 500283599 504419148 509531379 514986217 520132244 523530841 522931993
946.4 522931993 516768217 505433917 490687162 473980397 455814302 436482459 416541517 396432698
962.7 396432698 376166075 355592370 334889531 314588755 295218468 277160317 260910869
977 260910869 247181103 236570716 229244992 224916056 223058462 223134100 224652648 227084681 229926422
995.3 229926422 232843995 235691622 238313109 240450531 241904557 242701516 243118376 243429080 243788347
1013.7 243788347 244396865 245510980 247229502 249465570 252071977 254962713 258121461 261393696
1030 261393696 264443457 267028123 269187987 271078855 272798747 274395764 276041120 278034687 280532509
1048.3 280532509 283520788 287052035 291343480 296662509 303176463 310938418 319986790 329896867
1064.7 329896867 338801950 343343168 340946823 332586914 322221220 313507885 307905495 305300742
1081 305300742 305166185 306969404 310161382 314326942 319214731 324533552 329809815 334407300 337840110
1099.3 337840110 340100586 341659933 343109787 344868064 347187608 350174934 353639215 357148319
1115.6 357148319 360313803 362969190 365261495 367524713 370099753 373276502 377136111 381150246
1132 381150246 384131730 384858340 382672578 377714008 370766789 362806559 354661942 347052664 340530068
1150.3 340530068 335296482 331325799 328551501 326990664 326762527 327948123 330587834 334856898
1166.6 334856898 341050774 349349260 359623283 371547788 384782434 398986071 413730532 428412795
1182.9 428412795 442426413 455366373 466875732 476475686 483851492 489148468 492879629 495641410
1199.3 495641410 497906506 500096977 502727807 506229401 510681331 515844822 521382689 526988328
1215.6 526988328 532263279 536654472 539737344 541501522 542231917 542174637 541446507 540277600 539102435
1233.9 539102435 538239598 537683487 537358046 537446201 538202703 539614081 541458488 543552220 545873463
1252.3 545873463 548415124 550992846 553354800 555516362 557746649 560151279 562576592 564932406
1268.6 564932406 567213893 569283843 570891201 571826637 572127581 572068930 571839511 571351707 570480406
1287 570480406 569313943 568017066 566567898 564833045 562898934 561127901 559775114 558738410 557819247
1305.3 557819247 556969583 556201100 555366397 554172933 552521169 550530553 548196852 545346618 541843176
1323.7 541843176 537735045 533211648 528468609 523787260 519634306 516458392 514302909 512736738
1340 512736738 511445642 510498762 509874761 509290338 508431494 507262707 505952597 504608929 503298342
1358.3 503298342 502027273 500581622 499014646 497831464 497189045 497103453 497729301 498845994 500059426
1376.7 500059426 501362264 502778172 504551888 507270753 510910749 514408410 517244756 519738376
1393 519738376 521518052 522076309 521568656 520476639 519317091 517917991 516101360 514265776 512628555
1411.4 512628555 511292875 510525346 510176182 509555936 508837819 508638978 508838296 509433389 510397732
1429.7 510397732 511473775 512877643 514722884 516207755 517198980 518383801 519632101 520555496 520726621
1448.1 520726621 520010948 519030511 518397927 517608345 515554488 513761938 513763905 515568852 518610775
1466.4 518610775 522858202 529174507 537778318 546450078 554098248 561552584 569194198 576920569
1482.8 576920569 584532738 592359662 600106001 606610358 611849546 617400885 623505235 628558040
1499.1 628558040 632657647 637106836 643026888 649009466 651965022 654031038 657002926 660724461
1515.4 660724461 664506137 668021679 671295285 673669279 675561011 677485824 679515183 682191670
1531.7 682191670 684895873 687019110 689969361 693950236 696099758 696553469 697047532 698182583 699914098
1550.1 699914098 701843202 704141378 707184553 710497439 711006224 710006595 710239410 711479962 713028789
1568.4 713028789 713979661 714464784 715523362 716353059 715952098 715435982 715225637 715042174 714640081
1586.8 714640081 713910103 712814808 711418271 709694564 707545638 705052376 702288628 699211538
1603.1 699211538 695799112 692040443 687765479 683208823 679006338 674662650 668928027 663512528
1619.4 663512528 659353435 654917121 650079787 645490706 641270757 638194263 636389315 634261310
1635.7 634261310 631340206 629255891 628540039 629197657 630890608 632427156 634015501 637163103 640276790
1654.1 640276790 641505182 643398345 646827996 651055634 655078590 659072876 664017558 669098139
1670.4 669098139 673234582 677571058 682075262 686169326 690705359 696277618 701737881 705102801
1686.7 705102801 707915604 711291254 715105295 719845295 724658966 728639007 731763303 733816087
1703 733816087 735934615 738099098 739978850 742289782 745318890 748750985 751471817 752467871 753083527
1721.4 753083527 754343271 755946696 757759929 759964168 762510180 764870048 765878022 766575694
1737.7 766575694 767958283 769369543 770663261 772257864 774160266 775745869 776441574 776946187 777948380
1756.1 777948380 779111981 780263960 781277835 781970739 782971025 784470379 786059737 787102997
1772.4 787102997 787232995 787322402 787985861 788875937 789621055 790247977 790822506 791780055 793277800 794329107
1792.8 794329107 794500947 794791818 795608580 796425462 796789110 797046244 797678590 798601508 799326003 799666524
1813.2 799666524 800043523 800639272 801245511 801895797 802751124 803604424 804355860 804931521 804900587 804720581
1833.6 804720581 804964542 805340648 805714369 806444466 807263613 807339251 806930006 806650817 806639016 806839347
1854 806839347 807077825 807253242 807417870 807664335 808109999 808832705 809413433 809305072 808987737 809015930
1874.4 809015930 809193015 809379816 809691250 810092390 810446799 810816467 811261654 811556280 811698973 811812162
1894.7 811812162 811850846 811946034 812156856 812305033 812389314 812592149 812867284 812965930 812933981 813127935
1915.1 813127935 813546777 813762128 813761353 813718975 813619852 813627720 813744962 813807487 813859820 813986361 814183533
1937.6 814183533 814503431 814892948 815047622 814988971 814985156 815057337 815189481 815413773 815670967 815881729
1958 815881729 816051960 816227555 816489339 816806853 817001104 817047179 817080498 817164004 817280948 817395806
1978.4 817395806 817493379 817584455 817692518 817837417 818013489 818192542 818234563 818108261 817992508 817921638
1998.8 817921638 817853570 817806065 817749500 817607582 817362845 817101777 816899717 816701651 816373706 815926552
2019.2 815926552 815521240 815160513 814723432 814239800 813810825 813441396 813048959 812604666 812195122 811892748
2039.6 811892748 811632156 811300814 810949028 810720205 810641587 810598373 810498357 810431659 810506880 810635209
2060 810635209 810710549 810763657 810852468 810999572 811124921 811137080 811145484 811287880 811492503 811615586 811667025
2082.4 811667025 811789215 812023342 812253118 812365830 812428117 812617719 812904537 813105047 813197792 813321471
2102.8 813321471 813532233 813731492 813831270 813897789 814056754 814249635 814330935 814326823 814368606 814469159 814534664
2125.2 814534664 814527094 814532995 814636767 814741194 814748287 814731836 814761758 814824581 814880967 814892769 814909101 815019429
2149.7 815019429 815187514 815315723 815416038 815615535 815953076 816326141 816665173 816994488 817383230 817848384
2170.1 817848384 818334043 818819523 819333434 819862545 820366561 820830464 821296036 821819663 822359502 822856784
2190.5 822856784 823307395 823727310 824157834 824636638 825133860 825585127 826005459 826455772 826933742 827410638
2210.9 827410638 827893078 828374445 828827798 829248488 829618394 829947650 830306649 830697477 831045151 831338286
2231.3 831338286 831634343 831937373 832202852 832420170 832618177 832860768 833142340 833379984 833560109 833752275
2251.7 833752275 834014118 834294379 834505916 834670126 834884167 835166991 835436940 835661471 835880756 836139560
2272.1 836139560 836449325 836749077 836990952 837208390 837429881 837649047 837843716 838011146 838186204 838376760
2292.5 838376760 838519394 838568807 838617265 838763654 838942230 839036703 839041948 839056015 839104235 839094341 838996410
2314.9 838996410 838903606 838906765 838946521 838855326 838609040 838369906 838210106 838053405 837875366 837680042
2335.3 837680042 837481976 837308884 837167978 837142944 837310374 837490857 837425828 837054610 836530030 836116970
2355.7 836116970 835898578 835756898 835650206 835683465 835854113 836011171 836110294 836230099 836428881 836658180
2376.1 836658180 836804152 836858571 836890578 836904466 836840928 836675107 836464107 836280823 836140633 835984588
2396.5 835984588 835755348 835481405 835220873 834979236 834714115 834396958 834071875 833769083 833436787 833035767
2416.9 833035767 832601428 832167506 831719398 831252158 830765307 830267489 829801261 829340875 828806579 828230262
2437.3 828230262 827709198 827225089 826695144 826127589 825588465 825087249 824586868 824075699 823574185 823097646
2457.7 823097646 822649002 822193444 821701586 821212947 820773661 820388615 820000768 819568872 819148242 818786025
2478.1 818786025 818442762 818053186 817629993 817251980 816962361 816723049 816465855 816191316 815958440 815759838
2498.5 815759838 815523386 815238237 814986110 814810336 814646780 814432919 814152181 813837647 813539624 813236713
2518.9 813236713 812891304 812535465 812216163 811907291 811531544 811067164 810575783 810090959 809591949 809063613
2539.2 809063613 808518052 807997644 807499409 806971788 806429565 805926502 805446863 804917634 804335833 803793073
2559.6 803793073 803336442 802901924 802408397 801881611 801375329 800863445 800359249 799897313 799446881 799000680
2580 799000680 798576713 798168898 797764122 797370553 796992838 796602905 796202719 795834005 795487940 795122921
2600.4 795122921 794737697 794319272 793827355 793272853 792684615 792061090 791384816 790640712 789863229 789069831
2620.8 789069831 788206518 787254572 786253512 785209060 784103096 782986999 781926513 780885756 779809713
2639.2 779809713 778703451 777580261 776474953 775411367 774354696 773291886 772214293 771134079
2655.5 771134079 770104945 769115150 768146515 767197907 766234159 765263855 764318287 763407290 762537181
2673.9 762537181 761708617 760902822 760100186 759304821 758533835 757769942 756967723 756162822 755383909 754578769
2694.3 754578769 753747702 752902985 751999795 751017570 750017583 749040484 748035312 746995986 745981574
2712.6 745981574 744985461 743961036 742918015 741912663 740955234 739994526 739028931 738106251 737232924
2731 737232924 736363947 735497653 734678745 733882129 733079910 732299447 731531560 730763137 730010092 729274154
2751.4 729274154 728573859 727919102 727284014 726652026 726003170 725364447 724780321 724202812 723554671 722835302
2771.8 722835302 722093225 721343935 720548570 719677687 718753219 717796504 716774166 715626895 714406252
2790.1 714406252 713212252 711984098 710621119 709150970 707644165 706098199 704452515 702705026
2806.4 702705026 700927436 699124694 697210610 695153296 693009436 690838277 688644052 686368883
2822.7 686368883 683976233 681496322 678954840 676340997 673603535 670734644 667822301 664874077
2839.1 664874077 661788225 658513725 655083239 651536405 647916377 644265890 640559316 636799216
2855.4 636799216 632976651 628892481 624367237 619441986 614172935 608483136 602379918 596055031
2871.7 596055031 589720130 583550811 577705562 572347045 567640841 563679457 560451567 557905138
2888 557905138 555983782 554620981 553704619 553020000 552345395 551571608 550627053 549407005 547816515
2906.4 547816515 545810044 543389082 540546775 537283897 533758581 530252874 526987791 524124801
2922.7 524124801 521859705 520376980 519767106 520060837 521274805 523407936 526407659 530191183 534686506
2941 534686506 539769232 545263171 551044047 557081401 563320875 569630504 575905442 582116306 588236034
2959.4 588236034 594185293 599889338 605308056 610455811 615426898 620323300 625156164 629899502
2975.7 629899502 634605527 639264643 643743217 647958517 651907444 655571938 658891022 661797225
2992 661797225 664277732 666392446 668126583 669390440 670218050 670684755 670821905 670674682 670253813
3010.4 670253813 669498920 668375909 666943789 665262759 663390696 661403120 659280062 656991661
3026.7 656991661 654615879 652182162 649675250 647056699 644250929 641366541 638530493 635630429
3043 635630429 632556021 629360735 626155972 622960210 619721889 616459608 613148272 609754264 606418669
3061.4 606418669 603220224 600025892 596691072 593217552 589725494 586311698 583015561 579787493
3077.7 579787493 576464236 573009372 569521248 566008151 562511742 559077382 555609763 552108943
3094 552108943 548705399 545447230 542215228 538829148 535375237 532110393 528970301 525716901 522457838
3112.4 522457838 519414544 516466081 513404548 510136425 506680250 503287613 500148356 497159660
3128.7 497159660 494139701 491041481 488034904 485269487 482564420 479656726 476643741 473767608
3145 473767608 471053362 468465626 465975285 463389158 460595578 457799822 455163270 452646345 450211614
3163.4 450211614 447836757 445478410 443114847 440754414 438435584 436205566 434037685 431897551
3179.7 431897551 429817796 427784026 425735950 423701733 421729058 419797301 417889327 415997863
3196 415997863 414114654 412263960 410481483 408755094 407083184 405467153 403884649 402347773 400844276
3214.3 400844276 399352938 397874057 396412283 394980162 393567860 392184287 390890568 389746457
3230.7 389746457 388664544 387419969 386032671 384728163 383552879 382472456 381472617 380454540
3247 380454540 379335582 378212601 377241910 376401871 375523746 374575287 373673379 372853845 372082442 371392071
3267.4 371392071 370820880 370191664 369366914 368473321 367605448 366778135 365991205 365237027 364508390 363812089
3287.8 363812089 363223433 362679005 361979872 361096174 360144168 359241843 358510584 357985616 357423067 356507093
3308.2 356507093 355285674 354060471 353011787 352072090 351104617 350111991 349155515 348211944 347181469
3326.5 347181469 346055835 344921052 343809426 342779040 341838270 340802819 339582682 338305265
3342.8 338305265 337033123 335823745 334753543 333589226 332139075 330634147 329307735 328110367
3359.1 328110367 326862514 325563848 324408412 323369205 322165012 320651710 319080800 317760885
3375.5 317760885 316607207 315468341 314324558 313211828 312248677 311520964 311021864 310454816 309524775
3393.8 309524775 308543921 307956070 307603776 306937665 305877775 304936558 304318458 303831816 303348988
3412.2 303348988 302782595 302166969 301685333 301329613 300946623 300601274 300452858 300495148 300548255 300616413
3432.6 300616413 300816655 300887704 300621092 300357640 300445735 300785869 301109821 301328808 301564217 301894903
3453 301894903 302330524 302904755 303567052 304146856 304693848 305481166 306452334 307190150 307520717 307803869
3473.4 307803869 308344096 309161872 310060889 310731381 311314762 312089652 312881768 313549846 314282805 315171838
3493.8 315171838 316107601 316993505 317932010 318953156 319759071 320354015 321117789 322115988 323232502
3512.1 323232502 324322820 325240016 326161265 327329934 328720868 330011040 331012249 331966251 333102375
3530.5 333102375 334443837 335969448 337492138 338857412 340375572 342246354 344101369 345528334
3546.8 345528334 346801519 348358363 350059658 351752877 353606522 355744392 358063847 360425442
3563.1 360425442 362828642 365237504 367505461 369750917 372224391 374976933 377919614 381043971
3579.4 381043971 384389997 387955904 391607881 395012319 398165315 401479781 405128837 408952355
3595.7 408952355 412867278 416859835 420861214 424935907 429143280 433451146 437797248 442177296
3612.1 442177296 446542799 450861841 455239743 459530354 463550538 467688620 472200036 476846695
3628.4 476846695 481089443 484884113 488760889 492831081 496946633 501102149 505412757 510019064
3644.7 510019064 514875710 519530952 523323238 526557863 530045152 533953428 537796438 541377306
3661 541377306 544916153 548680544 552725255 556765497 560477853 563914776 567078710 569718003 572139621
3679.4 572139621 574779093 577771544 581141353 584732175 587756991 589801788 591642082 593795478
3695.7 593795478 596181750 598568261 600793898 602877259 605056763 607510746 609983325 611867487
3712 611867487 613265216 614766061 616549492 618477583 620311379 621880651 623234749 624782324 626846194
3730.3 626846194 629296899 631413460 632608891 633479416 634789050 636376739 637764871 639054954
3746.7 639054954 640412986 641469479 642103970 642864823 643884182 644899070 645826936 646887302 648185730
3765 648185730 649513066 650570869 651275456 651965678 653030276 654440284 655676663 656468570 657175660
3783.4 657175660 657968283 658791900 659697175 660725951 661909103 663190603 664444745 665557325 666325033
3801.7 666325033 666906059 667527795 667988181 668426394 669305563 670626640 671957850 673103988 673947215
3820.1 673947215 674230635 674452305 675037146 675799787 676629126 677589178 678725779 679777622 680371881
3838.4 680371881 680603147 680726647 680893183 681381941 682461321 683982968 685025811 684895396 684724629
3856.8 684724629 685096025 685831368 686670065 687321723 687919021 688578784 689028442 689174592 689296901 689755321
3877.2 689755321 690498173 691144288 691641629 692010760 692279577 692678213 693031132 693214357 693692148 694610119
3897.6 694610119 695538819 696066439 696061432 695713758 695456862 695513070 695886374 696512103 697141767 697532356
3918 697532356 697772145 698013186 698238611 698436201 698742390 699170411 699463964 699505210 699520171 699757874
3938.4 699757874 700182736 700563371 700834334 701101542 701334417 701455593 701581120 701802075 702039778 702313840
3958.8 702313840 702640116 702887833 703053117 703240216 703499317 703808844 704068542 704245925 704428971 704645276
3979.2 704645276 704857409 705050170 705236912 705445886 705657363 705859601 706069827 706221282 706319034
3997.5 706319034
##END=$$ End of the data block
