##TITLE=Capao Alto - Marcela $$ Begin of the data block
##JCAMP-DX=5.00 $$ ACD/SpecManager v 10.08
##SPECTROMETER/DATA SYSTEM=Alpha
##DATE=24 Oct 2013 10:57:42
##DATA TYPE=INFRARED SPECTRUM
##DATA CLASS=XYDATA
##ORIGIN=
##OWNER=
##NPOINTS=1765
##FIRSTX=399.75695801
##LASTX=3997.56933594
##MAXX=3997.56933594
##MINX=399.75695801
##MAXY=0.81981331
##MINY=0.19559027
##XFACTOR=1.0000000000
##YFACTOR=1.000000000000000e-9
##FIRSTY=0.49483326
##DELTAX=2.03957629
##XUNITS=1/CM
##YUNITS=ARBITRARY UNITS
##XYDATA=(X++(Y..Y))
399.8 494833261 490858108 487862170 485910654 485411197 486237228 487789392 489528537 490837544 491171986
418.1 491171986 490173638 488408387 486333877 483862996 481235355 478831172 476456732 473877311 471981555
436.5 471981555 471925408 473981053 477837861 482578188 486885458 490092218 492422462 494067758 494862407
454.8 494862407 494808257 493917882 492103964 489407361 486179858 482763350 479389161 475984722 472400069
473.2 472400069 469137371 466531277 464679718 463705778 463334143 463319927 463516265 463473588 462975293 462156057
493.6 462156057 461005509 459523112 457734019 455538452 453011572 450391501 447575390 444301486
509.9 444301486 440522641 436316341 431935251 427597255 423465729 419987321 417552352 416273147
526.2 416273147 416233093 417445719 419812232 423255652 427825719 433412403 439303458 444326937 447590292
544.6 447590292 449099272 449276090 448145807 445729613 442578018 439106375 435122252 430361986 424611181
562.9 424611181 417745829 410061508 402582258 396685064 393113166 392070651 393568605 397322059
579.2 397322059 402934432 409970462 417694747 425173312 431381166 435538113 437629342 438357025 438362032
597.6 438362032 438048363 437824577 437796652 437867194 438199192 439141184 440824658 443251371 446422547 450279504
618 450279504 454605669 459158182 463833809 468496114 472905457 476728767 479788512 482108176 483848691
636.3 483848691 485253870 486517221 487769604 489096344 490451604 491721660 492860854 493869632
652.7 493869632 494877607 496039808 497396588 498812109 500000298 500865400 501757801 503037989 504388809
671 504388809 505897105 507601917 509146810 510457814 511659741 512883604 514209390 515390694 516065896
689.4 516065896 516071260 515269101 513591230 511051774 507807314 504180729 500545681 497465640 495610267
707.7 495610267 495394170 496965408 500216722 504811525 510400772 516721904 523452103 530331075 537218750
726.1 537218750 543811083 549645841 554454267 558346629 561440110 563623905 564743936 564579427 562877655
744.4 562877655 559547305 554819047 549141169 543032408 536858618 530803502 525133371 520352840
760.8 520352840 517207325 516495585 518667519 523618937 530901670 539814413 549604475 559675634
777.1 559675634 569372416 578087687 585591793 591907620 597150683 601692915 606048584 610564232
793.4 610564232 615415990 620767534 626445830 631923139 636830151 641045988 644608438 647526324
809.7 647526324 649735391 651302874 652422428 653078437 653083265 652241290 650358140 647226512 642668545
828.1 642668545 636743188 629777849 622297347 614778161 607489526 600625038 594425142 589119792
844.4 589119792 584765911 581119299 577816963 574559510 571122468 567597330 564743698 564216256 567767680
862.7 567767680 575777054 587107122 600087881 613041282 624408901 633028269 638307571 640194952
879.1 640194952 638874114 634548306 627766013 619505167 610763192 602358878 594769418 587997735
895.4 587997735 581749618 575647414 569292009 562334120 554573894 545807838 535878062 524887800
911.7 524887800 513150990 501275241 490209162 480972618 474248946 470078051 467974961 467385024
928 467385024 468017429 469812065 472788155 476910561 482079655 488082588 494033277 497948229 497517824
946.4 497517824 491581976 480609387 465901911 448803037 430316955 410991997 391112775 370866537
962.7 370866537 350380391 329795778 309293270 289148808 269766599 251648188 235438868
977 235438868 221740797 210914716 203123838 198271096 195944473 195590273 196676865 198696569 201231018
995.3 201231018 203973621 206688195 209163398 211216465 212719738 213637277 214104399 214374989 214747161
1013.7 214747161 215465084 216659874 218390107 220665589 223438859 226613134 229997665 233357862
1030 233357862 236500069 239225850 241412550 243057251 244320422 245501474 246850342 248512819 250597268
1048.3 250597268 253276706 256834686 261465967 267196327 274092823 282295853 291898519 302342027
1064.7 302342027 311453760 315645754 312380046 302876562 291502416 282311738 276788801 274492949
1081 274492949 274575055 276432008 279618144 283816040 288814098 294278204 299679309 304383576 307897002
1099.3 307897002 310119599 311453283 312644511 314393729 316993862 320300728 323967993 327606320
1115.6 327606320 330880404 333597302 335798025 337803185 340115845 343191773 347144067 351399988
1132 351399988 354723930 355771273 353740782 348702580 341447979 333089143 324664682 316931307 310297191
1150.3 310297191 304937333 300929189 298260748 296872586 296755314 297994673 300702929 305062145
1166.6 305062145 311307997 319550544 329649180 341312975 354222864 368002236 382245511 396530837
1182.9 396530837 410396338 423328042 434791952 444361240 451860726 457408279 461357504 464184046
1199.3 464184046 466438264 468667448 471289724 474623531 478883594 484084457 489977539 496094406
1215.6 496094406 501881719 506824851 510560036 512952268 514045954 514035285 513270080 512099326 510783076
1233.9 510783076 509541154 508530557 507865489 507694662 508147299 509280682 511080205 513408601 516036391
1252.3 516036391 518731117 521308899 523667514 525828421 527903616 530070484 532507837 535179734
1268.6 535179734 537790537 540007174 541617155 542527974 542781353 542527676 541916132 541047692 540018976
1287 540018976 538860023 537493885 535870433 533999979 531949401 529914320 528130174 526691616 525509775
1305.3 525509775 524410307 523299277 522172511 520965934 519539416 517777741 515627801 512961686
1321.6 512961686 509522974 505179942 500085533 494613886 489246100 484446049 480534732 477647752
1338 477647752 475787401 474790573 474308074 474020392 473692775 473131120 472288340 471236408 470072031
1356.3 470072031 468819946 467449039 466073990 465011865 464328349 463944912 463992864 464557588 465647876
1374.7 465647876 467085600 468613237 470166236 472004265 474647671 478419363 482681513 486299366
1391 486299366 488936156 490624666 491390079 491384983 490875363 489928842 488504827 486838371 485069185
1409.3 485069185 483224958 481525749 480117291 478834122 477741927 477246761 477262974 477609187 478221834
1427.7 478221834 479035884 480073333 481225014 482513398 484135836 485826761 487360924 488578081
1444 488578081 489238620 489150822 488391310 487184525 485566109 483162194 480702788 479816347 480165035
1462.4 480165035 481750250 484988153 489528686 495485783 503793538 513322055 522400022 531047881
1478.7 531047881 539445877 547571182 555057883 562082827 569132805 576133072 582219839 587691247
1495 587691247 593369484 598829865 603582442 607591987 611461222 616088808 620485842 624143898 627500713
1513.4 627500713 630659044 633799553 636846364 639957190 643036366 645830154 648576915 651098728
1529.7 651098728 653420389 655883908 658256829 660257578 662361085 664629221 666778922 668888569
1546 668888569 670846760 672730088 674565792 676257014 677638769 679050148 681026161 682797253 684174478
1564.3 684174478 685410500 686497509 687586069 688598990 689317405 689936340 690570891 691019595 691155910
1582.7 691155910 691026807 690631390 689967096 688966274 687604427 685902357 683870018 681493282 678726912
1601.1 678726912 675598204 672113717 668244302 663941622 659407258 654803514 649491191 643294990
1617.4 643294990 638074040 633401692 628009021 622706950 617851555 613315105 609494269 605846465
1633.7 605846465 601706207 598555565 596808553 595605552 594731688 594174206 594372272 595219374 596408606
1652 596408606 598593891 601312995 603974462 606849253 610230386 614053011 617737234 621632099 626205027
1670.4 626205027 630702734 635317147 640361547 645069301 649320364 653738499 659240782 664536595
1686.7 664536595 668954730 673339725 677354693 681289017 685335875 689124227 693255544 696988821
1703 696988821 700203538 703480065 706458271 709056079 711393297 713626742 716187596 718908608 721219420
1721.4 721219420 723241925 725179076 726970911 728682160 730287015 732061386 734097242 735816538
1737.7 735816538 737385631 739054382 740715086 742302358 743785918 745245755 746820331 748298168
1754 748298168 749628603 750959396 752206385 753441989 754668117 755699575 756602287 757511377 758560896
1772.4 758560896 759753108 760806441 761672676 762508929 763374925 764248192 765141606 765936494 766574979
1790.7 766574979 767320991 768228829 769083619 769852519 770645261 771500647 772331476 773084342 773780584 774508238
1811.1 774508238 775269508 775982141 776628494 777243555 777814448 778339684 778895557 779441357 779941738 780487835
1831.5 780487835 780997276 781381607 781742275 782089651 782288849 782421410 782724380 783085108 783361375 783612847
1851.9 783612847 783875763 784117043 784304261 784474254 784656525 784840822 784968495 785102189 785417140 785817087
1872.3 785817087 786134422 786398768 786716282 787106395 787508905 787867904 788135171 788343310 788620830 788948059
1892.7 788948059 789255023 789569855 789833426 789991856 790082395 790172756 790283024 790410340 790602505 790799975
1913.1 790799975 790863514 790845394 790919483 791078269 791282654 791534781 791736126 791825891 791860938 791921973 792044461
1935.5 792044461 792229056 792413533 792551816 792695940 792866945 793033481 793235838 793514192 793820739 794086456
1955.9 794086456 794280291 794435918 794603586 794793904 795012832 795265973 795489967 795632899 795710385 795765579
1976.3 795765579 795886815 796089649 796276808 796375215 796409547 796409726 796392858 796446085 796593130 796717942 796731710
1998.8 796731710 796640575 796496689 796341896 796184719 796029091 795833170 795541525 795159757 794738770 794330895
2019.2 794330895 793959081 793624103 793247700 792777300 792267442 791741967 791244566 790830433 790425956 789990783
2039.6 789990783 789600074 789268196 788966298 788712442 788542926 788441479 788346529 788263321 788247705 788291454
2060 788291454 788345695 788398325 788474441 788579583 788670897 788735390 788816273 788914561 788988173 789047718 789119065 789213657
2084.4 789213657 789340615 789497316 789678216 789847314 789969027 790062010 790182829 790357649 790582418 790826321
2104.8 790826321 791004181 791102469 791183889 791276574 791396558 791530550 791626155 791655958 791635096 791618407 791645586
2127.3 791645586 791702747 791769922 791831195 791851103 791821301 791811764 791856349 791920722 792003155 792098522 792161822 792204440
2151.7 792204440 792292535 792465448 792741597 793086767 793427587 793752968 794112921 794544518 795051336 795624077
2172.1 795624077 796217084 796758890 797231019 797701240 798232496 798818886 799406528 799947202 800455928 800942600
2192.5 800942600 801376104 801801026 802297413 802844524 803371072 803862333 804347336 804845691 805359602 805886209
2212.9 805886209 806421578 806939185 807400465 807807744 808187544 808553517 808918059 809285998 809640706 809974492
2233.3 809974492 810297310 810604870 810872138 811094403 811319292 811596215 811903179 812179446 812412739 812636793
2253.7 812636793 812884212 813155413 813423634 813681543 813964069 814280868 814594626 814905465 815212786 815503180
2274.1 815503180 815798998 816098452 816378236 816622257 816832185 817045450 817268729 817474067 817673743 817863405
2294.5 817863405 818010092 818137407 818289876 818451881 818585217 818704844 818831563 818932950 818982124 819035411
2314.9 819035411 819169343 819343150 819468796 819572508 819683790 819754720 819788754 819813311 819793642 819736004
2335.3 819736004 819725752 819727182 819601476 819315612 818980813 818746626 818664014 818729103 818903565 819140196
2355.7 819140196 819303095 819137692 818772256 818598926 818573534 818345189 817895889 817450225 817123413 816915631
2376.1 816915631 816778600 816657841 816526949 816382587 816219151 816053927 815912485 815782487 815648317 815492988
2396.5 815492988 815285087 815023363 814739823 814469159 814206004 813896239 813519776 813108265 812692285 812281430
2416.9 812281430 811875641 811466634 811024666 810527444 809984207 809420764 808856726 808302343 807752967 807209194
2437.3 807209194 806665361 806079924 805460632 804869413 804312885 803747475 803156018 802584052 802060246 801543236
2457.7 801543236 801025152 800522208 800012887 799501538 799021721 798593104 798180163 797726214 797241926 796775937
2478.1 796775937 796336174 795913100 795521498 795148075 794759274 794376314 794061303 793833792 793634176 793410897
2498.5 793410897 793166876 792905092 792622745 792343915 792098999 791888475 791679204 791412950 791062474 790673614
2518.9 790673614 790310204 789963901 789586425 789170682 788710654 788202345 787656426 787083805 786508799 785934627
2539.2 785934627 785341144 784718156 784084797 783457816 782844365 782270372 781718910 781134725 780505896 779863238
2559.6 779863238 779263377 778729975 778203666 777634203 777032733 776458859 775937259 775405049 774842143 774294674
2580 774294674 773793519 773330688 772876978 772430182 772013605 771630466 771245599 770847559 770468533 770110071
2600.4 770110071 769719779 769259214 768744946 768186510 767561793 766877234 766156197 765395164 764554739 763592005
2620.8 763592005 762537479 761468410 760423601 759360254 758216202 757008910 755774796 754530549
2637.1 754530549 753299773 752078652 750862956 749673247 748501122 747311890 746091366 744868577
2653.5 744868577 743693471 742565811 741443157 740309179 739187896 738096356 737015069 735926509
2669.8 735926509 734878778 733936250 733042598 732121110 731212497 730347991 729494333 728624761 727740705
2688.1 727740705 726845324 725918710 724971473 724015534 723001122 721904695 720767915 719633460 718505979
2706.5 718505979 717380106 716242552 715076149 713906586 712784886 711710453 710644007 709559560
2722.8 709559560 708439410 707358360 706417084 705544114 704636395 703717709 702827275 701954365 701078713
2741.2 701078713 700193107 699327111 698517084 697765291 697024703 696252525 695513606 694871426 694270968 693653405
2761.6 693653405 693017423 692358136 691649795 690898299 690113962 689274549 688429594 687620938 686749041 685774207
2782 685774207 684747517 683634639 682411730 681143045 679820955 678357482 676761746 675132573 673496366
2800.3 673496366 671804607 670010746 668098688 666112125 664094865 662031293 659880340 657628536
2816.6 657628536 655297577 652889431 650402367 647845805 645216167 642524600 639745414 636835992
2832.9 636835992 633833885 630775392 627689958 624605596 621419787 618018031 614454210 610875428
2849.3 610875428 607352972 603811383 600128829 596236885 592115104 587719619 582959712 577761173
2865.6 577761173 572115898 566051066 559646904 553138375 546791971 540775061 535258234 530417144
2881.9 530417144 526361644 523146927 520746410 519060791 517932951 517154753 516582787 516102016 515521228
2900.2 515521228 514677465 513533652 512057126 510148704 507753193 504887938 501628995 498128891
2916.6 498128891 494600415 491223156 488111943 485435158 483410388 482226938 482049644 482965052 484963506
2934.9 484963506 487980872 491907239 496596485 501875103 507626057 513753176 520098567 526569664
2951.2 526569664 533146322 539754868 546302080 552685082 558748960 564398050 569642127 574529052
2967.6 574529052 579141617 583579123 587923765 592274845 596674979 601014793 605180502 609120250
2983.9 609120250 612753034 616015375 618890584 621382117 623529792 625312328 626681626 627687335
3000.2 627687335 628320038 628514707 628295541 627697647 626722872 625449598 623988330 622329652 620461106
3018.5 620461106 618421614 616182208 613749981 611189067 608505011 605713725 602844536 599893987
3034.9 599893987 596874475 593805671 590697706 587527096 584281206 580987871 577648163 574281096
3051.2 574281096 570934713 567612708 564280272 560895801 557458460 554000258 550511599 547017455
3067.5 547017455 543581486 540177166 536750257 533286750 529801190 526337504 522914946 519532561
3083.8 519532561 516188622 512847424 509491742 506150186 502826095 499514550 496236742 492979795
3100.1 492979795 489740074 486548036 483378053 480198115 477027357 473897427 470823705 467793047
3116.4 467793047 464758903 461702883 458681583 455736548 452858835 450032145 447243780 444482327
3132.8 444482327 441731483 438990235 436289847 433644712 431043744 428488672 425965637 423461378
3149.1 423461378 421017885 418667674 416340619 413969725 411605477 409337372 407162696 405018419
3165.4 405018419 402895302 400804758 398755521 396754384 394785672 392826825 390886903 389005512
3181.7 389005512 387201160 385450929 383728296 382038236 380389005 378774822 377160579 375526220
3198 375526220 373948514 372485548 371074319 369697064 368355215 366996258 365663141 364400625 363151580
3216.4 363151580 361890048 360678494 359557956 358479083 357370585 356257319 355224371 354258478
3232.7 354258478 353284329 352307886 351380408 350468367 349535704 348635375 347797215 346981823 346188992 345455110
3253.1 345455110 344742149 344015867 343303978 342629105 341987044 341342747 340694368 340088934 339507610 338887483
3273.5 338887483 338239133 337599099 336968303 336362600 335809588 335290343 334753007 334191024 333610088 333004564
3293.9 333004564 332415253 331864864 331310421 330739915 330190271 329620570 328960955 328242958 327529311 326861709
3314.3 326861709 326260239 325683683 325064510 324384838 323667586 322925180 322196424 321506560 320808411 320081770
3334.7 320081770 319344133 318611622 317890078 317152470 316391140 315625578 314869553 314099014 313265026 312416792
3355.1 312416792 311647326 310916960 310155898 309376955 308603257 307834506 307055563 306255728 305486441 304788828
3375.5 304788828 304103792 303391993 302693307 302059621 301507175 301030606 300589800 300112277 299590170 299078137
3395.9 299078137 298628181 298255175 297887355 297459096 297034740 296677351 296378791 296080351 295754284 295467734
3416.3 295467734 295234621 295000046 294784993 294658571 294605345 294582218 294556320 294553876 294609874 294650704 294644833
3438.7 294644833 294654161 294759125 294973910 295185119 295361578 295594722 295869589 296152294 296482444 296885192
3459.1 296885192 297279775 297643155 298091531 298617065 299098551 299489170 299848914 300242037 300726354 301269144
3479.5 301269144 301775366 302295119 302899987 303502619 304044366 304606766 305190742 305779397 306437314 307143271
3499.9 307143271 307777822 308367848 308991462 309596062 310227901 310997784 311834753 312594801 313299239 314044774
3520.3 314044774 314853221 315684497 316507012 317324907 318202496 319173306 320190430 321211845 322216570
3538.6 322216570 323236078 324289411 325332403 326401949 327642083 328963786 330240101 331576645
3554.9 331576645 333033562 334559977 336144447 337793380 339405626 341055304 342972994 345088601
3571.3 345088601 347254604 349469692 351727158 354064584 356556118 359122455 361619532 364164293
3587.6 364164293 367046207 370069236 373003125 375993073 379133403 382363528 385692030 389054745
3603.9 389054745 392355531 395747691 399306208 402906507 406559467 410203516 413849175 417741805
3620.2 417741805 421743274 425559014 429104865 432752252 436859012 440954208 444938600 448891699
3636.5 448891699 452776551 456694603 460634440 464441478 468153715 472139359 476503372 480691642
3652.8 480691642 484621078 488674581 492763430 496707410 500558555 504308045 507877052 511462569
3669.2 511462569 515209913 518631935 521925688 525476635 528885126 532108068 535238087 538172603
3685.5 538172603 540960729 543796360 546750724 549631059 552304029 554767191 557056546 559355497
3701.8 559355497 561723292 563951850 565960705 567895114 570006132 572247684 574327588 576214969
3718.1 576214969 577979028 579660058 581309795 583037913 584844947 586492658 587879419 589202464
3734.4 589202464 590789080 592549145 594091117 595367908 596757710 598301172 599612296 600869298
3750.7 600869298 602348685 603837490 605171263 606497109 607902527 609250724 610498786 611680448
3767.1 611680448 612833858 614054799 615333021 616539180 617628992 618695736 619820297 620942116
3783.4 620942116 622048378 623127341 624153972 625155568 626092196 627000093 627901077 628704369 629542589
3801.7 629542589 630500317 631472468 632531464 633609891 634505510 635203779 635934591 636715412 637442350
3820.1 637442350 638342559 639341474 640233517 641039610 641814709 642555952 643185556 643748939 644418120 645215571
3840.5 645215571 646044016 646845341 647615314 648285687 648683846 648989379 649660945 650526762 651297390 651945829
3860.9 651945829 652573645 653251708 653791010 654255271 654842854 655481577 656183362 656823456 657340169 657898426
3881.3 657898426 658427715 658905864 659412146 659888625 660389364 660960138 661504745 661959350 662273526 662528515
3901.7 662528515 662937224 663498104 664063036 664609253 665049374 665315509 665555060 665882766 666252911 666563630
3922.1 666563630 666861713 667219400 667530715 667806029 668180585 668579340 668928862 669267893 669562340 669831932
3942.5 669831932 670137286 670464218 670764923 671063185 671385825 671666741 671918750 672225535 672565699 672886074
3962.9 672886074 673173189 673427820 673697770 674000025 674290419 674552858 674813151 675084233 675336838 675547600
3983.2 675547600 675758600 675999880 676248252 676475763 676677287 676904917 677162468
3997.5 677162468
##END=$$ End of the data block
