##TITLE=Capao Alto - Marcela $$ Begin of the data block
##JCAMP-DX=5.00 $$ ACD/SpecManager v 10.08
##SPECTROMETER/DATA SYSTEM=Alpha
##DATE=24 Oct 2013 10:57:42
##DATA TYPE=INFRARED SPECTRUM
##DATA CLASS=XYDATA
##ORIGIN=
##OWNER=
##NPOINTS=1765
##FIRSTX=399.75695801
##LASTX=3997.56933594
##MAXX=3997.56933594
##MINX=399.75695801
##MAXY=0.82220328
##MINY=0.19593206
##XFACTOR=1.0000000000
##YFACTOR=1.000000000000000e-9
##FIRSTY=0.49797860
##DELTAX=2.03957629
##XUNITS=1/CM
##YUNITS=ARBITRARY UNITS
##XYDATA=(X++(Y..Y))
399.8 497978598 493352652 490092158 488217413 487743169 488547742 490295649 492459238 494108230 494363546
418.1 494363546 493094057 490880221 488042712 485266268 482882231 480470866 477810204 475102812
434.4 475102812 473330528 473427773 475501209 479454815 484466195 489091039 492580026 494939178 496269643
452.8 496269643 496602714 496223688 495251268 493473262 490874797 487814128 484542042 481194019 477791458
471.1 477791458 474272221 471049577 468417734 466477811 465355933 464896917 464822143 464826107 464572817
489.5 464572817 464040816 463370830 462351173 460775822 458728403 456375599 453895837 451348573 448616982
507.9 448616982 445604086 442103744 437850565 433119476 428546190 424490988 421103448 418672085
524.2 418672085 417520761 417727917 419038951 421218038 424456030 429034114 434702486 440589368 445522219
542.5 445522219 448731750 450248361 450424612 449452400 447393507 444376111 440691441 436480761 431520849
560.9 431520849 425622702 418841124 411288679 403743654 397632450 393944293 393010288 394587725 398217469
579.2 398217469 403732687 410812527 418576896 425991714 432047069 436193198 438488513 439344019 439360321
597.6 439360321 439141631 439030111 439008057 439132363 439506620 440267920 441749781 444178134 447500139
616 447500139 451467335 455713451 460116833 464752525 469420314 473792315 477640629 480837315 483317018
634.3 483317018 485167086 486571252 487748772 489014775 490497917 491963625 493197262 494222015
650.6 494222015 495180726 496282756 497564286 498864025 500072360 501187861 502279162 503553271 504990578
669 504990578 506222188 507564902 509091914 510524631 511833429 513153613 514515996 515796661 516809940
687.3 516809940 517383516 517305613 516418159 514745593 512356699 509306729 505722225 501996577 498838753
705.7 498838753 496978611 496791065 498372912 501636744 506236196 511780322 518066585 524831474 531769156
724 531769156 538691223 545272887 551097393 555947185 559863389 562910736 565034330 566129923 565985382
742.4 565985382 564312875 560991347 556255162 550532043 544340253 538061559 531903446 526192784
758.7 526192784 521485269 518468022 517796993 519895494 524767458 532046378 541050255 550976813 561100423
777.1 561100423 570770860 579484522 586940706 593159854 598392487 602967620 607260942 611720204
793.4 611720204 616681576 622149765 627839983 633326709 638243020 642423749 645913184 648767173
809.7 648767173 650982857 652614653 653747976 654345334 654311299 653480589 651587129 648339093 643620133
828.1 643620133 637593269 630574942 623030663 615420043 608117163 601337433 595192611 589905381
844.4 589905381 585542321 581853628 578546286 575313985 571901917 568407774 565591812 565086782 568648338
862.7 568648338 576680005 587980747 600872099 613769293 625120342 633689225 638858557 640634120
879.1 640634120 639217675 634780049 627896667 619586647 610854506 602454066 594818175 588021576
895.4 588021576 581781983 575666606 569263697 562250674 554449201 545665264 535723150 524725437
911.7 524725437 513068378 501325250 490315199 481070846 474357665 470206082 468108475 467544407
928 467544407 468191743 469950795 472857565 476937801 482139766 488160253 494040936 497848213 497335613
946.4 497335613 491356015 480351597 465617925 448504001 430020839 410701126 390807092 370561898
962.7 370561898 350103021 329534560 309052140 288962483 269662380 251645684 235512942
977 235512942 221849680 211105436 203426942 198610678 196281552 195932060 196997151 198984548 201518133
995.3 201518133 204284102 206995845 209457919 211530700 213052675 213981479 214488864 214805290 215160176
1013.7 215160176 215826601 217024609 218776092 221027657 223763987 226926208 230320632 233669221
1030 233669221 236771092 239479899 241649225 243283376 244603977 245837018 247177213 248813197 250886381
1048.3 250886381 253581971 257143468 261773914 267535269 274431109 282601953 292207927 302646250
1064.7 302646250 311721772 315913498 312703252 303306520 292030960 282834321 277237594 274899095
1081 274899095 274989754 276864201 280047655 284220904 289185584 294634819 300034374 304728776 308221400
1099.3 308221400 310437113 311800510 313027829 314775318 317337811 320628375 324323505 327979445
1115.6 327979445 331228375 333913147 336111754 338123739 340432286 343515366 347498387 351769388
1132 351769388 355040878 356014609 353963226 348943591 341721982 333424866 325061530 317327291 310679525
1150.3 310679525 305355340 301378340 298713326 297336787 297221810 298440456 301154912 305557698
1166.6 305557698 311817914 320012569 330052555 341690183 354595184 368384898 382649302 396951467
1182.9 396951467 410835415 423784554 435238004 444775611 452259898 457802415 461730808 464553624
1199.3 464553624 466854274 469145983 471793562 475115031 479378432 484605700 490501910 496607661
1215.6 496607661 502405643 507348359 511034667 513354063 514391780 514356554 513584912 512424886 511128962
1233.9 511128962 509902716 508931100 508315980 508158267 508602679 509738266 511553526 513906419 516538680
1252.3 516538680 519197822 521734238 524065375 526218832 528332591 530552685 533000588 535635293
1268.6 535635293 538191378 540367305 541971445 542907059 543175459 542915165 542324781 541507781 540504336
1287 540504336 539340734 537979782 536360145 534471035 532426596 530446053 528712094 527272165 526048481
1305.3 526048481 524931431 523850918 522745728 521522164 520065486 518285573 516139507 513485312
1321.6 513485312 510053456 505708635 500605583 495129287 489771485 485003889 481123418 478229761
1338 478229761 476351440 475358218 474870741 474550575 474175334 473583221 472766966 471766055 470609307
1356.3 470609307 469338477 467974126 466605842 465525210 464835256 464461267 464495152 465021163 466099262
1374.7 466099262 467559904 469106466 470680684 472551405 475188643 478908360 483144522 486763299
1391 486763299 489377707 491026998 491772473 491773188 491273940 490328699 488914073 487267494 485520422 483703285
1411.4 483703285 482015312 480571240 479217470 478127629 477725536 477810711 478177786 478779435 479576528
1429.7 479576528 480620533 481760442 482982904 484574825 486315191 487918854 489177316 489818156
1446 489818156 489700198 488956481 487763822 486096650 483600676 481107771 480247557 480623662 482238650
1464.4 482238650 485511839 490054816 495936424 504135251 513639748 522764742 531453609 539870203
1480.7 539870203 548001170 555466235 562446356 569479644 576516330 582633555 588082194 593740165
1497 593740165 599241912 604038358 608008564 611728728 616296291 620844841 624608636 627950132 631053805
1515.4 631053805 634164631 637187719 640316606 643496633 646356046 649109423 651627243 653924644
1531.7 653924644 656376302 658734262 660620511 662585139 664897263 667192817 669432700 671466291
1548 671466291 673354089 675145090 676773429 678024888 679252863 681326926 683341026 684821367 686039984
1566.4 686039984 687072933 688174307 689222217 689908206 690531611 691259861 691745877 691844344 691695929
1584.7 691695929 691321194 690664053 689655006 688289225 686572909 684538603 682198942 679481924 676399410
1603.1 676399410 672954679 669092774 664759934 660195529 655577004 650247157 644087434 638943553
1619.4 638943553 634270012 628848553 623587132 618791819 614298522 610473812 606747031 602568507
1635.7 602568507 599531949 597925544 596799135 595899999 595267415 595502317 596410275 597561538 599818885
1654.1 599818885 602728665 605485141 608371377 611764550 615636289 619342446 623217523 627770960
1670.4 627770960 632226050 636793494 641875386 646649122 650870204 655158758 660614014 666010916
1686.7 666010916 670486152 674870253 678842723 682661474 686557949 690226078 694369018 698180318
1703 698180318 701411247 704729855 707785368 710385740 712629199 714753449 717315793 720158577 722553253
1721.4 722553253 724578917 726485908 728236616 729892612 731398761 733083069 735136807 736881137
1737.7 736881137 738460779 740166068 741843343 743393540 744789064 746209800 747861743 749394357
1754 749394357 750709593 752029300 753279686 754539430 755792797 756806910 757644773 758463383 759495020
1772.4 759495020 760773659 761905611 762799799 763618350 764448464 765326977 766261876 767049551 767626464
1790.7 767626464 768357694 769299984 770144105 770876706 771676958 772570014 773419499 774156630 774817944 775545180
1811.1 775545180 776361406 777116120 777750015 778334260 778880000 779376030 779911757 780444086 780923784 781476736
1831.5 781476736 782024503 782452643 782849133 783195913 783326030 783361495 783649921 784074605 784423769 784715414
1851.9 784715414 784959316 785155594 785340011 785557032 785780668 785943329 785993040 786087453 786444068 786886454
1872.3 786886454 787219822 787505448 787840426 788215935 788587272 788940132 789222777 789435804 789714992 790051341
1892.7 790051341 790370047 790705323 790983737 791128039 791191399 791261494 791372359 791515827 791700244 791880608
1913.1 791880608 791938424 791901588 791942894 792082191 792303741 792578995 792782605 792897582 792988539 793081224
1933.5 793081224 793199718 793365598 793492556 793555796 793696105 793928206 794161618 794405043 794679224 794955909
1953.9 794955909 795199692 795394063 795563877 795740724 795925736 796125889 796362221 796578944 796718657 796808779
1974.3 796808779 796896338 797042608 797250211 797440052 797542870 797566950 797547579 797525227 797590613 797749758
1994.7 797749758 797881365 797897756 797794282 797644794 797529876 797428846 797293782 797087967 796769381 796348274
2015.1 796348274 795913458 795526266 795157850 794798791 794420660 793962538 793445408 792939425 792481482 792079389
2035.5 792079389 791683793 791250885 790825248 790450990 790146053 789913893 789758265 789672792 789603770 789526403
2055.9 789526403 789486468 789509535 789560616 789619923 789710820 789826632 789901674 789946675 790039122 790161908 790267110
2078.3 790267110 790358484 790436506 790521801 790636480 790763676 790921926 791108608 791265726 791385591 791527748
2098.7 791527748 791731060 791961730 792177737 792356491 792475641 792552531 792642951 792756736 792862415 792935789
2119.1 792935789 792973757 792989910 793007195 793041348 793084562 793139756 793197572 793221593 793203950 793190539 793223560
2141.5 793223560 793304384 793414950 793514788 793565035 793609977 793715894 793889880 794153750 794495761 794844449
2161.9 794844449 795182943 795529485 795922220 796417534 797006428 797604382 798148215 798646510 799138188 799656212
2182.3 799656212 800227702 800821483 801375329 801891506 802379608 802822888 803262234 803756714 804294169 804822862
2202.7 804822862 805318415 805797219 806277990 806756854 807244182 807767808 808297753 808765054 809166074 809553146
2223.1 809553146 809952736 810343027 810721576 811088502 811405063 811688662 811992168 812299073 812570393 812825084
2243.5 812825084 813111186 813418686 813668489 813847840 814040124 814304829 814610600 814897418 815178514 815476656
2263.9 815476656 815784872 816111088 816449404 816764235 817035198 817283809 817542851 817823946 818083167 818302333
2284.3 818302333 818530440 818761170 818971515 819194078 819426000 819600642 819714665 819853425 820034862 820220709
2304.7 820220709 820395768 820562005 820743561 820919335 821060359 821206689 821374476 821526468 821666181 821816504
2325.1 821816504 821936190 822025239 822116017 822166622 822180927 822203279 822202086 822091281 821778774 821301758 820892394
2347.5 820892394 820743203 820902765 821273029 821707368 822076738 822131753 821850061 821485341 821142733 820718765
2367.9 820718765 820201993 819688320 819262266 818951070 818706930 818470120 818221331 817993462 817809224 817650616
2388.3 817650616 817510843 817379951 817217350 817006409 816764474 816516697 816273928 816035151 815797687 815516472
2408.7 815516472 815152884 814731359 814304650 813902676 813511372 813100278 812657773 812179923 811655641 811110079
2429.1 811110079 810557723 809993148 809445024 808896422 808289230 807654262 807068229 806516707 805948138 805381060
2449.5 805381060 804834902 804294705 803759098 803218901 802684724 802182257 801687896 801179349 800687850 800252378
2469.9 800252378 799837053 799378097 798891068 798424900 797978342 797559857 797171474 796791852 796442568 796121478
2490.3 796121478 795828164 795576811 795341074 795108974 794866920 794592977 794306993 794034660 793786407 793579936
2510.7 793579936 793381393 793121994 792792201 792428970 792063057 791690111 791290402 790866077 790410995 789907098
2531.1 789907098 789353669 788783610 788227081 787648141 787024915 786399007 785798967 785199225 784574151 783969522
2551.5 783969522 783410311 782856226 782283247 781693995 781111658 780550539 779994905 779438555 778864980 778287411
2571.9 778287411 777746916 777207136 776654780 776137769 775646150 775155544 774694562 774272203 773851633 773422420
2592.3 773422420 773010731 772635162 772278368 771927595 771561384 771116376 770577848 769986510 769365191 768713176
2612.7 768713176 768017709 767257988 766410589 765464425 764452279 763420999 762377262 761285901 760112345
2631 760112345 758879602 757628798 756380975 755170941 754005313 752836883 751640022 750427961 749214649
2649.4 749214649 747994840 746764064 745581031 744489729 743415773 742280006 741127014 740048230
2665.7 740048230 739022613 737962484 736902118 735933006 735033333 734149635 733275056 732398212 731517673
2684.1 731517673 730651557 729781032 728875756 727944911 727002025 726037562 725020707 723932624 722804606
2702.4 722804606 721679986 720568299 719453752 718308985 717109144 715902567 714773238 713710785
2718.7 713710785 712663591 711606264 710513175 709425747 708430171 707511544 706615984 705749989 704909205
2737.1 704909205 704072654 703231752 702363968 701477766 700637460 699865043 699111044 698350728 697611928 696938455
2757.5 696938455 696323276 695722699 695117474 694477379 693769157 693010390 692218006 691385627 690562010 689772487
2777.9 689772487 688918650 687933803 686865330 685723543 684489608 683208227 681867301 680412948 678881288
2796.2 678881288 677325785 675725520 674029112 672224700 670311809 668283165 666201174 664130926
2812.5 664130926 662020147 659810364 657488942 655052066 652552843 650021255 647411585 644706130
2828.9 644706130 641928613 639061034 636063397 632954180 629815578 626690924 623487175 620092928
2845.2 620092928 616534829 612936854 609368086 605779231 602086008 598211169 594099879 589683831
2861.5 589683831 584859729 579587638 573895216 567788541 561325312 554753840 548357964 542302728
2877.8 542302728 536755681 531887352 527797997 524566770 522188067 520519733 519386113 518614829
2894.1 518614829 518037438 517516911 516916335 516088128 514947712 513453662 511548877 509162068 506282151
2912.5 506282151 503026664 499544263 495987356 492550254 489423782 486763895 484723538 483518481
2928.8 483518481 483348757 484280735 486306965 489370197 493329108 498009652 503249764 508971214 515125811
2947.2 515125811 521546543 528065443 534650862 541274667 547837973 554226875 560305595 565985203
2963.5 565985203 571285188 576256156 580932677 585393608 589793384 594255865 598724127 603060901
2979.8 603060901 607254863 611272573 614976704 618300855 621218383 623733401 625916302 627742171
2996.1 627742171 629162729 630222857 630906641 631171525 631006479 630407333 629432201 628188372 626766860
3014.5 626766860 625153899 623293996 621220529 618977308 616577208 614038467 611358643 608544946
3030.8 608544946 605643809 602710366 599737465 596659362 593480825 590264976 587062716 583867311
3047.1 583867311 580587864 577194214 573768675 570353448 566956103 563583791 560178995 556701481
3063.4 556701481 553183377 549690485 546265841 542854667 539374650 535840273 532323718 528861761
3079.7 528861761 525453508 522067606 518694162 515341282 511971414 508567870 505192518 501895845
3096 501895845 498631835 495341420 492056191 488822699 485611469 482407510 479245543 476125121 473021984
3114.4 473021984 469935656 466852546 463766515 460742027 457815081 454923779 452020735 449146807
3130.7 449146807 446340799 443588406 440865606 438146651 435444534 432794213 430186540 427625149
3147 427625149 425122380 422668129 420269310 417891234 415516764 413194418 410936356 408704996 406480789
3165.4 406480789 404295713 402161986 400073349 398042768 396064818 394100606 392154157 390279323
3181.7 390279323 388484865 386727124 384985358 383259237 381533027 379840106 378210634 376613915
3198 376613915 375047743 373543650 372089118 370660186 369268209 367914081 366599500 365320444 364049792
3216.4 364049792 362788737 361589879 360445142 359291643 358156413 357071131 356012642 354989558
3232.7 354989558 353999466 353021771 352056891 351095259 350160331 349281430 348418355 347556800 346744716 345982283
3253.1 345982283 345222443 344478309 343794465 343156695 342516989 341866583 341247290 340663880 340062052 339430213
3273.5 339430213 338795811 338165045 337571114 337022215 336446375 335832447 335228622 334647804 334093660 333543301
3293.9 333543301 332961738 332356930 331741810 331124872 330544114 329994828 329395831 328707725 327987403 327296317
3314.3 327296317 326634973 325980902 325329274 324668348 323972344 323237926 322512060 321811616 321093887 320365161
3334.7 320365161 319639593 318894207 318118781 317322910 316527575 315764725 315029413 314235240 313376009 312544912
3355.1 312544912 311790615 311088055 310348511 309525400 308693975 307911456 307123989 306292981 305471450 304715157
3375.5 304715157 304004520 303315759 302646875 302010417 301444978 300961077 300518274 300029874 299456298 298888624
3395.9 298888624 298440546 298106372 297755122 297294348 296814859 296409726 296059728 295752287 295501083 295303434
3416.3 295303434 295111775 294869065 294620067 294461876 294372767 294310182 294277936 294300437 294374943 294408828 294378966
3438.7 294378966 294368863 294477403 294701964 294902682 295071632 295313239 295604676 295933276 296326816 296739966
3459.1 296739966 297097027 297440201 297913671 298504561 299005568 299310327 299598813 300054550 300651491 301226854
3479.5 301226854 301689744 302176625 302781343 303364813 303881079 304445922 305054814 305659115 306287199 306958199
3499.9 306958199 307591170 308188349 308853596 309550852 310246199 311020195 311841637 312581092 313286871 314056993
3520.3 314056993 314861834 315682173 316542208 317433715 318376660 319373727 320390582 321410418 322436720
3538.6 322436720 323517948 324623019 325657994 326664537 327830106 329142272 330498606 331936419
3554.9 331936419 333440721 334976852 336592615 338276029 339874774 341498613 343461990 345652044
3571.3 345652044 347824872 350005358 352294177 354732543 357316256 359935403 362449050 365030766
3587.6 365030766 367985189 371064484 374052137 377094150 380279899 383555681 386927098 390363693
3603.9 390363693 393738508 397141367 400705069 404364944 408114165 411844045 415536374 419450998
3620.2 419450998 423454374 427269489 430807203 434457660 438658148 442853898 446874559 450873911
3636.5 450873911 454823077 458770007 462725520 466540396 470226526 474181682 478579491 482842296
3652.8 482842296 486824483 490927249 495068848 499041080 502903402 506618500 510060132 513499558
3669.2 513499558 517181575 520586133 523932099 527615547 531129360 534413815 537572026 540480196
3685.5 540480196 543187797 545985222 548989117 551916718 554620028 557113528 559428096 561741471
3701.8 561741471 564112246 566338360 568326533 570219934 572301865 574538767 576624572 578538775
3718.1 578538775 580338776 582031190 583688617 585448444 587245107 588793159 590112925 591502786
3734.4 591502786 593178809 594935238 596393406 597587824 598942518 600429416 601685047 602995455
3750.7 602995455 604597569 606176734 607532918 608842254 610267043 611632466 612833440 613954484
3767.1 613954484 615122855 616428852 617800176 619054258 620071173 621016383 622112215 623248219
3783.4 623248219 624372900 625506639 626585066 627599537 628519177 629384518 630245566 631050050 631935418
3801.7 631935418 632910967 633828700 634844840 635953844 636880100 637535036 638210237 638978839 639709890
3820.1 639709890 640675247 641758442 642677486 643456578 644163251 644831896 645436168 646029294 646733940
3838.4 646733940 647533000 648408175 649343073 650209725 650836289 651093364 651336193 652129173 653105319 653896630
3858.8 653896630 654518604 655068815 655687988 656238854 656685889 657263756 657947898 658659220 659249842 659718215
3879.2 659718215 660277307 660826504 661377788 661996245 662504792 662992895 663534820 663981855 664305329 664542735
3899.6 664542735 664813697 665262938 665853858 666462421 667038321 667501748 667786300 668001950 668298185 668692946
3920 668692946 669055223 669393063 669801950 670140922 670375168 670699716 671092331 671435952 671755791 672058165
3940.4 672058165 672341645 672642291 672964394 673272729 673590302 673961937 674342871 674650848 674885035 675121963
3960.8 675121963 675411105 675742924 676054239 676320016 676598489 676897228 677146494 677353442 677568853 677814126
3981.2 677814126 678098261 678393900 678660095 678872466 679067314 679281712 679520249 679787815
3997.5 679787815
##END=$$ End of the data block
