##TITLE=Capao Alto - Marcela $$ Begin of the data block
##JCAMP-DX=5.00 $$ ACD/SpecManager v 10.08
##SPECTROMETER/DATA SYSTEM=Alpha
##DATE=24 Oct 2013 10:57:42
##DATA TYPE=INFRARED SPECTRUM
##DATA CLASS=XYDATA
##ORIGIN=
##OWNER=
##NPOINTS=1765
##FIRSTX=399.75695801
##LASTX=3997.56933594
##MAXX=3997.56933594
##MINX=399.75695801
##MAXY=0.82327217
##MINY=0.19587113
##XFACTOR=1.0000000000
##YFACTOR=1.000000000000000e-9
##FIRSTY=0.49542794
##DELTAX=2.03957629
##XUNITS=1/CM
##YUNITS=ARBITRARY UNITS
##XYDATA=(X++(Y..Y))
399.8D95427936l488421l401280k340644m35800J099557K062678K291084J444429M4793
418.1D92704332j074761j712740k472222k796381k704263k563179k386212k484828
434.4D74509746j908511k8759K137929L883362M790097M503608L483921K289713J210510
452.8D94871616N08547q8841r58532j863032k572805k890438l170550l458947l412187
471.1D76964831l426402l238380k613753j937837j189828m11480K9116J8895k08259
489.5D63986903m40001p44581j303792j684636j794279k065778k260476k490133k962202
507.9D48241025l342181l702551m105688m364252m437476m212797l391385k207458
524.2D18477237j121461K5719J166135K108068L220260M612207N713940N881995M896134
$$ plain form
399.8 495427936 491939515 488538235 486197591 485761791 486861348 488924026 491215110 492659539 492704332
418.1 492704332 491629571 489916831 487444609 484648228 481943965 479380786 476994574 474509746
434.4 474509746 472601235 472572476 474710405 478593767 483383864 487887472 491371393 493661106 494871616
452.8 494871616 495380163 495291322 494332790 492469758 489896953 487006515 483835965 480377018 476964831
471.1 476964831 473538429 470300049 467686296 465748459 464558631 464147151 464176267 464195162 463986903
489.5 463986903 463546902 462802321 461498529 459813893 458019614 455953836 453693360 451203227 448241025
507.9 448241025 444898844 441196293 437090605 432726353 428288877 424076080 420684695 418477237
524.2 418477237 417355776 417381495 418547630 420655698 423875958 428488165 434202105 440084100 444980234
542.5D44980234L170639J561701L45320r21816k230018l162146l657698m104406m927963
560.9D31053847o087363o992131p381797p253945o026238l539771p88420J487136L517121
579.2C97988439N432397O964862P736445P413357O040216M148453K221972P96795J21027
597.6D38863963p0870o4611l2396Q7172L52413Q09461J532584K441972L256083L884047
618D51059818M383207M686415M758805M616380M315763L842801L281385K558738J713037
636.3D85216349J237840J284331J434564J395256J300961J295775J161188R38266J001746
654.7D96266276J221448J340449J365602J233697R58144R39846J330376J414180J476109
673.1E07546127J616061J509010J320064J246393J300931J368642J204371O88017p0930
$$ plain form
542.5 444980234 448150873 449712574 450057894 449136078 446906060 443743914 440086216 435981810 431053847
560.9 431053847 424966484 417974353 410592556 403338611 397312373 393772602 392984182 394471318 397988439
579.2 397988439 403420836 410385698 418122143 425535500 431575716 435724169 437946141 438742936 438863963
597.6 438863963 438793093 438728482 438696086 438783258 439135671 439945132 441477716 443919688 447175771 451059818
618 451059818 455443025 460129440 464888245 469504625 473820388 477663189 480944574 483503312 485216349
636.3 485216349 486454189 487738520 489173084 490568340 491869301 493165076 494326264 495264530 496266276
654.7 496266276 497487724 498828173 500193775 501427472 502385616 503325462 504655838 506070018 507546127
673.1 507546127 509162188 510671198 511991262 513237655 514538586 515907228 517111599 517799616 517728686
691.4E17728686q97109j653671k477229l289938l672361l537417l019512j978784l43115
709.8D96859550J566887L316760M681647N649805O358207O785929O940126O936968
726.1E39095879O612539N845725M849911L928006L103077K216459J133859k65718j805186
744.4E64714551l338754m780352n828739o246566o231964o077349n718172m808902
760.8E21683753l061057o10649K140164M872620P254005Q933246R877443J0179281
777.1E61268806R773255Q769214P482708O224155N219519M586101M350423M500568
793.4F12174749M920841N434155N739033N555690M919707M129410L426552K822518
809.7F49122655K252102J619518J028836N14388q7380r05812j963735l215372m611075
$$ plain form
691.4 517728686 516831577 515177906 512700677 509410739 505738378 502200961 499181449 497202665 496859550
709.8 496859550 498426437 501743197 506424844 512074649 518432856 525218785 532158911 539095879
726.1 539095879 545708418 551554143 556404054 560332060 563435137 565651596 566785455 566519737 564714551
744.4 564714551 561375797 556595445 550766706 544520140 538288176 532210827 526492655 521683753
760.8 521683753 518622696 518012047 520152211 525024831 532278836 541212082 551089525 561268806
777.1 561268806 571042061 579811275 587293983 593518138 598737657 603323758 607674181 612174749
793.4 612174749 617095590 622529745 628268778 633824468 638744175 642873585 646300137 649122655
809.7 649122655 651374757 652994275 654023111 654537499 654450119 653544307 651580572 648365200 643754125
828.1F43754125o001294p089973p617115p600606p239044o775021o167710n348742
844.4E89914620m485726l726006l246605l159702l371895l510892k803802m09246L624618
862.7E68825364P980704J1217535J2840867J2875855J1352181Q557976N157053J768530
879.1F40576065j506687m576265o947101q315682q736789q372963p567346o771385
895.4E87781847o290555o216407o478131o994724p763863q776248r897470j0920405
911.7E24444044j1663735j1826456j1030435r166241o627828m119515k104074o04391
928D67301369O23256J801878K954453M063904N135060N972564N888939L846794n01901
946.4D97086316o044596j1110127j4797539j7110437j8463909j9320846j9905925k0260155
$$ plain form
828.1 643754125 637752831 630662858 623045743 615445137 608206093 601431072 595263362 589914620
844.4 589914620 585428894 581702888 578456283 575296581 571924686 568413794 565609992 565200746 568825364
862.7 568825364 576806068 588023603 600864470 613740325 625092506 633650482 638807535 640576065
879.1 640576065 639069378 634493113 627546012 619230330 610493541 602120578 594553232 587781847
895.4 587781847 581491292 575274885 568796754 561802030 554038167 545261919 535364449 524444044
911.7 524444044 512780309 500953853 489923418 480757177 474129349 470009834 467905760 467301369
928 467301369 467924625 469726503 472680956 476744860 481879920 487852484 493741423 497588217 497086316
946.4 497086316 491041720 479931593 465134054 448023617 429559708 410238862 390332937 370072782
962.7C70072782k0457178k0553053k0480156k0064115j9227505j7967433j6114875
977B35208467j3592482j0651723p638320m800647k317474l36691J090377K003983K520323
995.3B01485813K753913K735108K472460K045811J516223R33915M58866K78622M05342
1013.7B15086073P22751J201257J747906K260089K712846L090068L339723L354520
1030B33515233L141731K748713K203107J646310J291424J204356J343236J649826K097533
1048.3B50841469K723902L580481M642904N745232O863504Q141697R550094J0382265
1064.7C02471548R061098M190445l217488r390742j1237025r127021n539089k321720
1081B74890006P7217J835436L135115M143208M950792N437851N413264M729777L518999
$$ plain form
962.7 370072782 349615604 329062551 308582395 288518280 269290775 251323342 235208467
977 235208467 221615985 210964262 203325942 198525295 196207821 195871130 196961507 198965490 201485813
995.3 201485813 204239726 206974834 209447294 211493105 213009328 213943243 214402109 214680731 215086073
1013.7 215086073 215808824 217010081 218757987 221018076 223730922 226820990 230160713 233515233
1030 233515233 236656964 239405677 241608784 243255094 244546518 245750874 247094110 248743936 250841469
1048.3 250841469 253565371 257145852 261788756 267533988 274397492 282539189 292089283 302471548
1064.7 302471548 311532646 315723091 312505603 303114861 291877836 282750815 277211726 274890006
1081 274890006 274967223 276802659 279937774 284080982 289031774 294469625 299882889 304612666 308131665
1099.3C08131665K245724J383692J209706J743615K612919L320574L664226L629744
1115.6C27941865L261119K719372K230555J999170K238899L021121L971964M272908
1132C51656973L273845R96471k011866m981011p204652q290917q341908p700831o618887
1150.3C10777217n309284l972560k680748j408369j34557J201868K688259M382401
1166.6C05544227O259561Q194238J0015160J1622935J2917102J3797462J4263838J4303565
1182.9C96918088J3885975J2949675J1465311R567440P497132N528569L946662K877057
1199.3D64635909K305865K240270K633781L370791M294187N213976N889296O092072
1215.6D96676147N754471M920125L697395K323628J043796j2398p60972j169443j291514
$$ plain form
1099.3 308131665 310377389 311761081 312970787 314714402 317327321 320647895 324312121 327941865
1115.6 327941865 331202984 333922356 336152911 338152081 340390980 343412101 347384065 351656973
1132 351656973 354930818 355927289 353915423 348934412 341729760 333438843 325096935 317396104 310777217
1150.3 310777217 305467933 301495373 298814625 297406256 297271699 298473567 301161826 305544227
1166.6 305544227 311803788 319998026 330013186 341636121 354553223 368350685 382614523 396918088
1182.9 396918088 410804063 423753738 435219049 444786489 452283621 457812190 461758852 464635909
1199.3 464635909 466941774 469182044 471815825 475186616 479480803 484694779 490584075 496676147
1215.6 496676147 502430618 507350743 511048138 513371766 514415562 514403164 513642192 512472749 511181235
1233.9E11181235j196026r42708o03795j57415M42922J133442J798570K337515K659381
1252.3E16653121K696514K528727K309739K152562K111912K218843K450406K617836
1268.6E35739660K543927K192199J618504R47595K97964k39134o06418q44181j029849
1287E40620267j191556j341164j549006j838982k036452j992345j751780j423598j165986
1305.3E26329398j091838j122892j160919j246393j448274j765012k161146k684295
1321.6E13648629l436684m330278n079388n454153n356163m771650l869355k879679
1338D78471279j871109r75609m54902l03567l75837n84006q27044j035959j167715
1356.3D70875531j282364j415252j405836j085221p01309l75926N1022N26726J057714
$$ plain form
1233.9 511181235 509985209 509042501 508438706 508281291 508724213 509857655 511656225 513993740 516653121
1252.3 516653121 519349635 521878362 524188101 526340663 528452575 530671418 533121824 535739660
1268.6 535739660 538283587 540475786 542094290 543041885 543339849 543100715 542494297 541650116 540620267
1287 540620267 539428711 538087547 536538541 534699559 532663107 530670762 528918982 527495384 526329398
1305.3 526329398 525237560 524114668 522953749 521707356 520259082 518494070 516332924 513648629
1321.6 513648629 510211945 505881667 500802279 495348126 489991963 485220313 481350958 478471279
1338 478471279 476600170 475624561 475169659 474866092 474490255 473906249 473079205 472043246 470875531
1356.3 470875531 469593167 468177915 466772079 465686858 464985549 464609623 464660645 465187371 466245085
1374.7D66245085J440018J539320J595587J886368K600848L667921M225791L635406
1391D86836344K619863J630395P24822N752m82887r47565j423746j641899j730174
1409.3D85590905j785129j676649j480133j394391j091539l61652J46687M12643N96583
1427.7D78957325P61777J029730J148284J228749J604647J762539J604497J224131
1444D89321679O19888o8307o83367j221567j769066k562106k413392p36952M00454
1462.4D80887264J543641L208637M518509N847425Q163154R517789R169399Q713246
1478.7E31569064Q420169Q147538P476270O946444P003963P079602O173491N453170
1495E88269711N642175N524159M809081L898800L596604M538595M638314L846229L372013
$$ plain form
1374.7 466245085 467685103 469224423 470820010 472706378 475307226 478975147 483200938 486836344
1391 486836344 489456207 491086602 491811424 491817176 491334289 490386724 488962978 487321079 485590905
1409.3 485590905 483805776 482129127 480648994 479254603 478163064 477801412 477948099 478360742 478957325
1427.7 478957325 479719102 480748832 481897116 483125865 484730512 486493051 488097548 489321679
1444 489321679 489941567 489873260 489189893 487968326 486199260 483637154 481223762 480486810 480887264
1462.4 480887264 482430905 485639542 490158051 496005476 504168630 513686419 522855818 531569064
1478.7 531569064 539989233 548136771 555613041 562559485 569563448 576643050 582816541 588269711
1495 588269711 593911886 599436045 604245126 608143926 611740530 616279125 620917439 624763668 628135681
1513.4F28135681L068686L052711K993345L116370L184914K900422K823472K559483
1529.7F51835084K260864K385437K318382J814843J896381K406120K434314K292156
1546F69643581K032101J889765J793743J592338J172959J170814K136291K093732J513779
1564.3F85039103J223147J011074J101136J067221O67930O12914P73668N52476J62899
1582.7F92211568j31309m16159o99461j022458j370251j713932k027452k344668k734303
1601.1F79751575l101885l443480l838301m297614m526555m617751n371630o167293
1617.4F44387066n112946m659891n387306n195320m736125m441381l814160l776432
1633.7F07263505m184961k938866j523555j121104r56296o78599K81632R62734J144171
$$ plain form
1513.4 628135681 631204367 634257078 637250423 640366793 643551707 646452129 649275601 651835084
1529.7 651835084 654095948 656481385 658799767 660614610 662510991 664917111 667351425 669643581
1546 669643581 671675682 673565447 675359190 676951528 678124487 679295301 681431592 683525324 685039103
1564.3 685039103 686262250 687273324 688374460 689441681 690109611 690722525 691496193 692048669 692211568
1582.7 692211568 692080259 691664100 690964639 689942181 688571930 686857998 684830546 682485878 679751575
1601.1 679751575 676649690 673206210 669367909 665070295 660543740 655925989 650554359 644387066
1617.4 644387066 639274120 634614229 629226923 624031603 619295478 614854097 611039937 607263505
1633.7 607263505 603078544 600139678 598616123 597495019 596538723 595860124 596141756 597104490 598248661
1652E98248661K347707L083885K826035K856970L352106L887832L722369L837049M548610
1670.4F28711224M505455M595280N087435M760563M179299M237771N464435N450189
1686.7F66991651M498422M386187L929138L735721L844679L652572M158795L836572
1703F99033737L229678L312647L050328K586901K215683K046168K458274K842904K464175
1721.4G23240495K083420J962007J771152J611113J428723J639665K100169J784087
1737.7G37620831J554667J679004J673341J530706J371146J434087J689375J547992
1754G50101149J313210J317143J234651J265764J285314J004935Q06808P87914R94504
1772.4G60111392J292109J178026Q91626P87020Q47876R16004R23514P30277N26845
$$ plain form
1652 598248661 600596368 603680253 606506288 609363258 612715364 616603196 620325565 624162614 628711224
1670.4 628711224 633216679 637811959 642899394 647659957 651839256 656077027 661541462 666991651
1686.7 666991651 671490073 675876260 679805398 683541119 687385798 691038370 695197165 699033737
1703 699033737 702263415 705576062 708626390 711213291 713428974 715475142 717933416 720776320 723240495
1721.4 723240495 725323915 727285922 729057074 730668187 732096910 733736575 735836744 737620831
1737.7 737620831 739175498 740854502 742527843 744058549 745429695 746863782 748553157 750101149
1754 750101149 751414359 752731502 753966153 755231917 756517231 757522166 758328974 759116888 760111392
1772.4 760111392 761403501 762581527 763473153 764260173 765108049 766024053 766947567 767677844 768204689
1790.7G68204689P36535R82701Q86143P54237P97033R04322Q57293P13706O55652P47323
1811.1G76239634Q20457P45059O39259O08266N52833M59432M80772M90784M65751N90503
1831.5G82092750N94556M34816L75927L18110J10984M9352L20375M34101L55601L09348
1851.9G85395920K50399J89901J70529K02596K12312J56521L6955P7665L77596N02765
1872.3G87573159L76343K67625K89500L69072L97742L53873K45034J83761K92063L72827
1892.7G90720999L34144L01957K38717J54256J02342R2208R4116J22666J97888J82032
1913.1G92541325M2260o557J05739J52886J78993K49505K22265J33932P2360Q2374
1933.5G93775082J47283J95205J37150N1737J07169J97828K23696K57194K90454K76148
$$ plain form
1790.7 768204689 768941224 769923925 770810068 771564305 772361338 773265660 774122953 774836659 775492311 776239634
1811.1 776239634 777060091 777805150 778444409 779052675 779605508 780064940 780545712 781036496 781502247 782092750
1831.5 782092750 782687306 783122122 783498049 783816159 783927143 783976495 784296870 784730971 785086572 785395920
1851.9 785395920 785646319 785836220 786006749 786209345 786421657 786578178 786615133 786692798 787070394 787573159
1872.3 787573159 787949502 788217127 788506627 788875699 789273441 789627314 789872348 790056109 790348172 790720999
1892.7 790720999 791055143 791357100 791595817 791750073 791852415 791944623 792038739 792161405 792359293 792541325
1913.1 792541325 792583585 792577028 792682767 792835653 793014646 793264151 793486416 793620348 793692708 793775082
1933.5 793775082 793922365 794117570 794254720 794306457 794413626 794611454 794835150 795092344 795382798 795658946
1953.9G95658946K32637J99795J77204J47522J50382K22326K92360K45452J25349N2392
1974.3G97504365O5923J56880K29835K04742J11997J9670l3260j847J05738J51932
1994.7G98515975J06454K3485q7679j32739j11521j41084j77622k01404k77698l80874
2015.1G97135293m23967l92914l68059l60727l87669m64499n13315n05030m72725m18663
2035.5G92827725l93152m17292m11451l54945k82765k24292j64628r5368o8545o8009
2055.9G90347278l0041K7597N3287O6042R8824J19686R1613P0333R5070J01328Q1122
2078.3G91122139J01625J14084Q3506R6321J43528J63853J48714J18434J26541J64091
2098.7G92382836J84894K12967K34425J78755J02579J04130J42395J52767J30951O2466
$$ plain form
1953.9 795658946 795891583 796091378 796268582 796416104 796566486 796788812 797081172 797326624 797451973 797504365
1974.3 797504365 797570288 797727168 797957003 798161745 798273742 798293412 798260152 798258305 798364043 798515975
1994.7 798515975 798622429 798645914 798558235 798425496 798313975 798172891 797995269 797793865 797516167 797135293
2015.1 797135293 796711326 796318412 795950353 795589626 795201957 794737458 794224143 793719113 793246388 792827725
2035.5 792827725 792434573 792017281 791605830 791250885 790968120 790743828 790579200 790483832 790415287 790347278
2055.9 790347278 790317237 790344834 790398121 790464163 790562987 790682673 790774286 790844619 790939689 791041017 791122139
2078.3 791122139 791223764 791337848 791421354 791517675 791661203 791825056 791973770 792092204 792218745 792382836
2098.7 792382836 792567730 792780697 793015122 793193877 793296456 793400586 793542981 793695748 793826699 793889165
2119.1G93889165P391J6689K9087K9028L6597N3763N7221J8895j6690Q464N3823P3731
2143.6G94257164P8678O8188M4405N2929J09732J84000K71559L24666L28183L41118
2164G96060622L66032M28796N20050N77271O01649N80907N12421M74632N08130N54502
2184.4H01185012N57363N51164N54681N07593M39882M53115N08189N21064N09679N03183
2204.8H06290925M88758M72724N02229N33402N11884M96507M78923M24922L86596L80933
2225.2H10967803L82900L88325L71813L32773L03209K80857K62916K53201K75492L15488
2245.6H14134777L10719K61366K06590J99914K60234K99096K71022K47061K68698L00586
2265.9H16760063L16620L36587L34383K99453K88666L00169K86638K40267K23040K45750
$$ plain form
2119.1 793889165 793896556 793913245 793942332 793971360 794007957 794061720 794118941 794137836 794121146 794129610 794183433 794257164
2143.6 794257164 794335842 794404030 794448435 794501364 794611096 794795096 795066655 795391321 795719504 796060622
2164 796060622 796426654 796855450 797375500 797952771 798554420 799135327 799647748 800122380 800630510 801185012
2184.4 801185012 801742375 802293539 802848220 803355813 803795695 804248810 804756999 805278063 805787742 806290925
2204.8 806290925 806779683 807252407 807754636 808288038 808799922 809296429 809775352 810200274 810586870 810967803
2225.2 810967803 811350703 811739028 812110841 812443614 812746823 813027680 813290596 813543797 813819289 814134777
2245.6 814134777 814445496 814706862 814913452 815113366 815373600 815672696 815943718 816190779 816459477 816760063
2265.9 816760063 817076683 817413270 817747653 818047106 818335772 818635941 818922579 819162846 819385886 819631636
2286.3H19631636K36988K05875K10404K15828J70470J31607J70708K10404J76430J53124
2306.7H21513474J75774J81794J22547Q5891J77800K69294K33114J38819J00374J05858
2327.1H23104739R6142O4433O855k3127P510p748j43648k93254l94464l99053k28524
2349.6H21789861P8857L38554L43621J98304J9312j47581k30729k61724l66211m69268
2370H21292996m56154l94165l28839k53976k06768k13325k36690k45214k14934j52171
2390.4H18590760j12116j19925j66118k24709k57194k56360k48969k50279k79427l49760
2410.8H16325903m13239m10378l87013l99947m28021m56751m94241n31852n38469n41568
2431.2H11724424n68807n77330n76616n98967n93185n51105n37097n66483n89668n60284
$$ plain form
2286.3 819631636 819868624 820074499 820284903 820500731 820671201 820802808 820973516 821183920 821360350 821513474
2306.7 821513474 821689248 821871042 821993589 822079480 822257280 822526574 822759688 822898507 822998881 823104739
2327.1 823104739 823200881 823265314 823272169 823249042 823256552 823248804 823105156 822811902 822417438 822018385 821789861
2349.6 821789861 821868718 822207272 822550893 822749197 822768509 822620928 822390199 822128475 821762264 821292996
2370 821292996 820836842 820442677 820113838 819859862 819653094 819439769 819203079 818957865 818742931 818590760
2390.4 818590760 818478644 818358719 818192601 817967892 817710698 817454338 817205369 816955090 816675663 816325903
2410.8 816325903 815912664 815502286 815115273 814715326 814287305 813830554 813336313 812804461 812265992 811724424
2431.2 811724424 811155617 810578287 810001671 809402704 808809519 808258414 807721317 807154834 806565166 806004882
2451.5H06004882n24342n35250n48541n16415m91440n16057n35787m95553m19497l95417
2471.9H01026583m45664m90844m60387l96847l69966l95179m14074l75449l37661k97188
2492.3G97043324k28405j94788k14100k60234k98262k68161k16186k20120k29657k27749
2512.7G94685662k58863l21627l67343l67284l66092l89218m15981m53353n02705n49853
2533.1G90693343n80490n61953n39541n77569o30796o32226o15180o05166n75959n73755
2553.5G84800708n93126n83469n80371n87642n67138n40555n40077n72682n81145n44429
2573.9G79110074n34177n40733n21779m80652m70221m78506m47214m12583l90411l89397
2594.3G74444401l98278l77059l56197l79742m34339m89175n53489o32405o91652p28309
$$ plain form
2451.5 806004882 805480540 804945290 804396749 803880334 803388894 802872837 802337050 801841497 801422000 801026583
2471.9 801026583 800580919 800090075 799629688 799232841 798862875 798467696 798053622 797678173 797340512 797043324
2492.3 797043324 796814919 796620131 796406031 796145797 795847535 795579374 795363188 795143068 794913411 794685662
2512.7 794685662 794426799 794105172 793737829 793370545 793004453 792615235 792199254 791745901 791243196 790693343
2533.1 790693343 790112853 789550900 789011359 788433790 787802994 787170768 786555588 785950422 785374463 784800708
2553.5 784800708 784207582 783624113 783043742 782456100 781888962 781348407 780808330 780235648 779654503 779110074
2573.9 779110074 778575897 778035164 777513385 777032733 776562512 776084006 775636792 775224209 774833798 774444401
2594.3 774444401 774046123 773669064 773312867 772933125 772498786 772009611 771456122 770823717 770132065 769403756
2614.7G69403756p69496q23200r13858j010478j053929j053393j075089j145482j206935
2633.1G60351896j252055j264453j205206j151740j153052j174271j204074j224637
2649.4G50722408j224220j208126j154542j106381j115501j136542j119315j079977
2665.7G41577804j057982j058996j037717r52363q73148q76606r01818q71599q33690
2684.1G33113885q61287r14216r37462r28521r24766r72033j034081j059592j082301
2702.4G24399626j117170j126587j129270j163244j189589j167775j117944j081765
2718.7G15306282j078188j093328j098931j045704r47833q97825r04798r12190q93235
2737.1G06434250q65758q45432q32558q40008q35061p84993p37011p29621p22408o70016
$$ plain form
2614.7 769403756 768634260 767811060 766897202 765886724 764832795 763779402 762704313 761558831 760351896
2633.1 760351896 759099841 757835388 756630182 755478442 754325390 753151119 751947045 750722408
2649.4 750722408 749498188 748290062 747135520 746029139 744913638 743777096 742657781 741577804
2665.7 741577804 740519822 739460826 738423109 737470746 736597598 735720992 734819174 733947575 733113885
2684.1 733113885 732252598 731338382 730400920 729472399 728547633 727575600 726541519 725481927 724399626
2702.4 724399626 723282456 722155869 721026599 719863355 718673766 717505991 716388047 715306282
2718.7 715306282 714228094 713134766 712035835 710990131 710042298 709144473 708239675 707327485 706434250
2737.1 706434250 705568492 704723060 703890502 703050494 702215433 701430440 700693429 699963808 699241400 698571384
2757.5F98571384o22332o07669o11485o53207p11858p49886p78794q07405q05199p98047
2777.9F91425502q69572r89497j061678j130461j231849j275123j301050j410246j548707
2796.2F80607319j623035j651108j693427j775265j892626j987160k037465k074302
2812.5F65872931k123355k216041k344788k445995k499104k554655k622724k693355
2828.9F46372914k795696k915144l004670l075838l123164l143728l219843l400326
2845.2F21694505l579974l623962l597975l607035l694117l907859m161000m433752
2861.5E91088831m818976n282342n742252o164610o493509o595910o438553o092608
2877.8E43460071n559266m876673m112661l272891k428233j695454j131893p71284
$$ plain form
2757.5 698571384 697949052 697341383 696729898 696076691 695364833 694614947 693836153 693028748 692223549 691425502
2777.9 691425502 690555930 689566433 688504755 687374294 686142445 684867322 683566272 682156026 680607319
2796.2 680607319 678984284 677333176 675639749 673864484 671971858 669984698 667947233 665872931
2812.5 665872931 663749576 661533535 659188747 656742752 654243648 651688993 649066269 646372914
2828.9 646372914 643577218 640662074 637657404 634581566 631458402 628314674 625094831 621694505
2845.2 621694505 618114531 614490569 610892594 607285559 603591442 599683583 595522583 591088831
2861.5 591088831 586269855 580987513 575245261 569080651 562587142 555991232 549552679 543460071
2877.8 543460071 537900805 533024132 528911471 525638580 523210347 521514893 520383000 519611716
2894.1E19611716n88476n53787o51240q25406j094997j476883j909316k391160k880990
2912.5E07239461l273606l514529l555476l411234l127247k669424k017438j180053
2928.8D84490454j69098R25928K015144L035754L921807M665553N266816N757570O179035
2947.2E16088963O447613O541073O604374O641686O577909O423413O126762N716085
2963.5E67167878N333245N017281M736840M522801M418909M429698M475713M425228
2979.8F04527593M281580M060567L729939L355026K952039K554060K237856J882732
2996.1F29581392J465797J100004P14719K81275j53482n74887r31621j197934j404762
3014.5F28880501j619935j860380k064526k242923k415657k540469k639711k765656
$$ plain form
2894.1 519611716 519023240 518469453 517818213 516992807 515897810 514420927 512511611 510120451 507239461
2912.5 507239461 503965855 500451326 496895850 493484616 490357369 487687945 485670507 484490454
2928.8 484490454 484321356 485247284 487262428 490298182 494219989 498885542 504152358 509909928 516088963
2947.2 516088963 522536576 529077649 535682023 542323709 548901618 555325031 561451793 567167878
2963.5 567167878 572501123 577518404 582255244 586778045 591196954 595626652 600102365 604527593
2979.8 604527593 608809173 612869740 616599679 619954705 622906744 625460804 627698660 629581392
2996.1 629581392 631047189 632147193 632861912 633143187 632989705 632414818 631483197 630285263 628880501
3014.5 628880501 627260566 625400186 623335660 621092737 618677080 616136611 613496900 610731244
3030.8F10731244k891600k947688k987385l083706l163040l209173l247559l274501
3047.1E85926592l328561l388286l399611l381788l382922l401100l415704l468573
3063.4E58760047l566980l578306l454208l377378l446102l535867l536105l469169
3079.7E30795932l438771l445148l404856l367603l385127l401219l370643l325641
3096E03656924l300369l292561l292590l286749l276974l241301l184497l140599l110796
3114.4D74530488l090918l075599l071130l057271k997398k913356k870024k882212
3130.7D50572580k874583k818763k765119k734334k721250k689004k616822k550692
3147D28802013k504289k472937k469033k467275k437710k381563k291471k211482k192616
$$ plain form
3030.8 610731244 607839644 604891956 601904571 598820865 595657825 592448652 589201093 585926592
3047.1 585926592 582598031 579209745 575810134 572428346 569045424 565644324 562228620 558760047
3063.4 558760047 555193067 551614761 548160553 544783175 541337073 537801206 534265101 530795932
3079.7 530795932 527357161 523912013 520507157 517139554 513754427 510353208 506982565 503656924
3096 503656924 500356555 497063994 493771404 490484655 487207681 483966380 480781883 477641284 474530488
3114.4 474530488 471439570 468363971 465292841 462235570 459238172 456324816 453454792 450572580
3130.7 450572580 447697997 444879234 442114115 439379781 436658531 433969527 431352705 428802013
3147 428802013 426297724 423824787 421355754 418888479 416450769 414069206 411777735 409566253 407373637
3165.4D07373637k183527k133250k076656k062440k041488j990945j951426j907796
3181.7C91026109j854330j794010j744211j743048j740009j681000j624435j619131
3198C77225935j595079j524479j473724j432509j392305j359433j338124j337498j319051
3216.4C64453733j274914j200765j144707j161099j153081j075924j045465j047790
3232.7C55349988j026720j033634j046389j009018r15080q45075q43435q66890q55267
3251.1C46908480p81477p23958p12484o84827o39349o28949o61432o88196o63310o16968
3271.4C40107530n96165n96524o03079n99772n98669n91785n74082n71162n76555o00517
3291.8C34199220o24210o09785n82069n75870n74917n74052o39439p04944o73175o59645
$$ plain form
3165.4 407373637 405190110 403056860 400980204 398917764 396876276 394885331 392933905 391026109
3181.7 391026109 389171779 387377769 385633558 383890510 382150501 380469501 378845066 377225935
3198 377225935 375630856 374106377 372632653 371200144 369807839 368448406 367110282 365772784 364453733
3216.4 364453733 363178819 361978054 360833347 359672248 358519167 357443243 356397778 355349988
3232.7 355349988 354323268 353289634 352243245 351234227 350319147 349474072 348630637 347763747 346908480
3251.1 346908480 346127003 345403045 344690561 344005734 343366385 342737436 342076004 341387808 340724498 340107530
3271.4 340107530 339511365 338914841 338311762 337711990 337113321 336521536 335947454 335376292 334799737 334199220
3291.8 334199220 333575010 332965225 332383156 331807286 331232369 330658317 330018878 329313934 328640759 327981114
3312.2C27981114o92069o86646o65158o64204p06852p56055p49498p08819p01546p45654
3332.6C20904613p65831p44521p67887q21352q10742p66367p55549p70002p95394q16703
3353C13090265q33184q40693q24452q12292q11547p80791p57575p86573q37832q43108
3373.4C04962218p64668o94752p02023p17849o59674n59420m66496m33623n06074n67674
3393.8B98889965n24342m28379l52114l77000m55200m25041l67403l49969l31551l32385
3414.2B94946581k86072k20597k49595k61187j44750n2989l4898j5587M7982Q8662
3434.6B93817550K0623k9743J8239J15246J87725J70410J62035K50429L12656L12120
3455B95337290L32087L74883L74824L89218M84348N49644N03808L95149L63112M41283
$$ plain form
3312.2 327981114 327289045 326602399 325937241 325273037 324566185 323810130 323060632 322351813 321650267 320904613
3332.6 320904613 320138782 319394261 318626374 317805022 316994280 316227913 315472364 314702362 313906968 313090265
3353 313090265 312257081 311416388 310591936 309779644 308968097 308187306 307429731 306643158 305805326 304962218
3373.4 304962218 304197550 303502798 302800775 302082926 301423252 300863832 300397336 299963713 299457639 298889965
3393.8 298889965 298365623 297937244 297585130 297208130 296752930 296327889 295960486 295610517 295278966 294946581
3414.2 294946581 294660509 294439912 294190317 293929130 293784380 293731391 293696493 293680906 293728888 293817550
3434.6 293817550 293838173 293808430 293826669 293941915 294129640 294300050 294462085 294712514 295025170 295337290
3455 295337290 295669377 296044260 296419084 296808302 297292650 297842294 298346102 298741251 299104363 299545646
3475.4B99545646N50896N40435M34697M86582O28323O12497N42909N82158O08921N96881
3495.8C05129945O24478O64085O43790O31452O77943O76095O81818Q01265Q60512P42078
3516.2C12133461O97255Q20458R06647Q61764Q05974Q37773R42170J022488J044691
3534.5C20072681J063049J052796J059682J107275J118094J119464J207054J290292
3550.9C29090387J348704J442283J531899J587480J609207J622438J580626J682997
3567.2C41496021K054989K267957K207279K184570K327025K521216K651334K644122
3583.5C60354513K504915K543092K918780L075480L037989L149808L280818L330559
3599.8C84195954L427863L482848L387481L416330L602713L729343L837258L789842
$$ plain form
3475.4 299545646 300096542 300636977 301071674 301558256 302186579 302799076 303341985 303924143 304533064 305129945
3495.8 305129945 305754423 306418508 307062298 307693750 308371693 309047788 309729606 310530871 311391383 312133461
3516.2 312133461 312830716 313651174 314557821 315419585 316225559 317063332 318005502 319027990 320072681
3534.5 320072681 321135730 322188526 323248208 324355483 325473577 326593041 327800095 329090387
3550.9 329090387 330439091 331881374 333413273 335000753 336609960 338232398 339813024 341496021
3567.2 341496021 343551010 345818967 348026246 350210816 352537841 355059057 357710391 360354513
3583.5 360354513 362859428 365402520 368321300 371396780 374434769 377584577 380865395 384195954
3599.8 384195954 387623817 391106665 394494146 397910476 401513189 405242532 409079790 412869632
3616.1D12869632L702939L936618M067570L850192L527343L634960M222840M232883
3632.4D44044977M025341M026949M037678M032821L976971L757447L598839L928512
3648.8D75429535M461467M344911M011750M082232M121662L973841L890038L759026
3665.1E08074462L502071L516853L720403L385842L293037L614724L497779L327072
3681.4E35932243L199458K938688K754152K809345K946914K883017K690196K489924
3697.7E58643937K313852K322793K411783K248943J956999J846791K068162K262890
3714E76076150K092242J872420J752317J676858J657307J754940J805961J564622J303255
3732.4E91556072J366556J696587J805782J479924J138269J287163J526654J325666
$$ plain form
3616.1 412869632 416572571 420509189 424576759 428426951 431954294 435589254 439812094 444044977
3632.4 444044977 448070318 452097267 456134945 460167766 464144737 467902184 471501023 475429535
3648.8 475429535 479891002 484235913 488247663 492329895 496451557 500425398 504315436 508074462
3665.1 508074462 511576533 515093386 518813789 522199631 525492668 529107392 532605171 535932243
3681.4 535932243 539131701 542070389 544824541 547633886 550580800 553463817 556154013 558643937
3697.7 558643937 560957789 563280582 565692365 567941308 569898307 571745098 573813260 576076150
3714 576076150 578168392 580040812 581793129 583469987 585127294 586882234 588688195 590252817 591556072
3732.4 591556072 592922628 594619215 596424997 597904921 599043190 600330353 601857007 603182673
3748.7F03182673J349092J639783J583100J328289J296640J402557J314938J166463
3765F14263535J111209J167893J356304J443565J275062J020432R52721J083552J124383
3783.4F24798656J122772J125455J089156J054823R21250Q21709Q19385P18355Q27074
3801.7F33298635J075984J064419J089216J071631Q60930O32644O41644P11083P21455
3820.1F41167641R94742J075446R17375Q11577P08103O44863N72562N38469O71982
3838.4F48102760Q19981Q89600R17315Q61287O61850K73466J93894Q02756J033008
3856.8F54555917P73191N46932N16773O49214N61535M48108N96463O97673P60793O84679
3877.2F60791278M92692M79221M97401N36025N88655M88818M79758N95331N54382L88921
$$ plain form
3748.7 603182673 604531765 606171548 607754648 609082937 610379577 611782134 613097072 614263535
3765 614263535 615374744 616542637 617898941 619342506 620617568 621638000 622590721 623674273 624798656
3783.4 624798656 625921428 627046883 628136039 629190862 630112112 630933821 631753206 632471561 633298635
3801.7 633298635 634374619 635439038 636528254 637599885 638460815 639093459 639735103 640446186 641167641
3820.1 641167641 642162383 643237829 644155204 644966781 645674884 646319747 646892309 647430778 648102760
3838.4 648102760 648922741 649812341 650729656 651590943 652252793 652526259 652720153 653522909 654555917
3856.8 654555917 655329108 655876040 656392813 657042027 657603562 658051670 658648133 659345806 660106599 660791278
3877.2 660791278 661283970 661763191 662260592 662796617 663385272 663874090 664353848 664949179 665503561 665892482
3897.6F65892482K45988K61307M51565O14464O10352N58376M69923K76208J85311L21567
3918F69887543M30166L26336K74479L99769M00304K89262L17752L63588L42370L35872
3938.4F73367441K96950K89202L35634L31521L02434L10957L14474K98917L34680L59357
3958.8F76541567L26931L00169K47002K11179K47896K93076L17514K90573K47478K41637
3979.2F79265022K63393K71619K20239J74820J99616K23160K07603K34127K69473
3997.5F81329072
$$ plain form
3897.6 665892482 666138470 666399777 666851342 667465806 668076158 668634534 669104457 669380665 669565976 669887543
3918 669887543 670317709 670644045 670918524 671318293 671718597 672007859 672325611 672689199 673031569 673367441
3938.4 673367441 673664391 673953593 674289227 674620748 674923182 675234139 675548613 675847530 676182210 676541567
3958.8 676541567 676868498 677168667 677415669 677626848 677874744 678167820 678485334 678775907 679023385 679265022
3979.2 679265022 679528415 679800034 680020273 680195093 680394709 680617869 680825472 681059599 681329072
3997.5 681329072
##END=$$ End of the data block
