##TITLE=CTZ $$ Begin of the data block
##JCAMP-DX=5.00 $$ ACD/SpecManager v 10.08
##SPECTROMETER/DATA SYSTEM=Alpha
##DATE=17 Mar 2016 10:50:26
##DATA TYPE=INFRARED SPECTRUM
##DATA CLASS=XYDATA
##ORIGIN=
##OWNER=
##NPOINTS=1765
##FIRSTX=399.76428223
##LASTX=3997.64306641
##MAXX=3997.64306641
##MINX=399.76428223
##MAXY=0.87140006
##MINY=0.39116025
##XFACTOR=1.0000000000
##YFACTOR=1.000000000000000e-9
##FIRSTY=0.85636538
##DELTAX=2.03961372
##XUNITS=1/CM
##YUNITS=ARBITRARY UNITS
##XYDATA=(X++(Y..Y))
399.8 856365383 857066572 858393550 857197106 857221603 858256102 857255638 858688235 861333907 862019300
418.1 862019300 863314629 862544119 860848129 861483037 860349536 858745813 859754801 859905124 860474408
436.5 860474408 861806273 861094356 861284614 861288309 859327853 859650731 860311270 859715879 860955656 860790610
456.9 860790610 858463287 857415676 856049895 856653869 859830737 860630691 861043930 861920059 860372066
475.2 860372066 860080123 860749543 859797597 860358298 860782325 859259129 858897090 857641637 855929494
493.6 855929494 857236564 857788920 856602252 855870247 853970945 853004575 853491127 851326883 848048031
511.9 848048031 843602240 833243608 818843901 808883905 810651183 820977271 825933576 822719872
528.3 822719872 824675798 834690094 844965041 852425635 855455637 855680287 856895804 856868565 855999231
546.6 855999231 856772244 856395841 855776787 856649697 856244087 856311023 857952476 858165026 858876288 860335648
567 860335648 859907627 860149503 860910833 860136747 860518634 861195028 860574782 861173987 861434221 860545754
587.4 860545754 861045063 861001194 860168993 860875368 860928178 860472739 861110568 860508442 859667778 860051274
607.8 860051274 859437704 859006345 859469354 858479083 857784510 858130217 857577682 857623637 857743979 856451094
628.2 856451094 856184363 856644988 856861711 858730614 860093415 859116852 857700288 854939282 851001441
646.6 851001441 848207057 844423711 835540056 818815649 802380204 807286561 833334684 855510473
662.9 855510473 864268064 866195560 864852786 863637388 862759292 862257779 864951193 868828475 869918525
681.2 869918525 869726181 869007349 866757751 864507318 861943305 857934177 852185011 842058122 833614171
699.6 833614171 838393390 850923538 859131217 861615360 858562231 847763300 827728808 806227446
715.9 806227446 802111626 819128096 839382350 851694226 857784152 860740364 863787055 866697133
732.2 866697133 866807938 865075886 861682892 855050802 849034309 846948087 840821743 814271688
748.5 814271688 769451559 753825903 795074224 845079303 864144444 864548802 860865891 857225537
764.9 857225537 855069518 853433788 854524791 860162854 865653217 868286252 869463384 868892193 867144823
783.2 867144823 865296960 862406433 858745635 855235696 850720465 845353842 840350330 836717248
799.5 836717248 835409522 834700346 833126724 832484305 832882524 832542121 832271159 832205176 831251323 829625905
819.9 829625905 826130390 816882849 792599618 738964915 671456277 648746490 691853702 751940191
836.2 751940191 790691674 809614003 817597568 822097719 829417825 840100884 850066781 856239140
852.6 856239140 859662771 862411618 864487112 866453648 868835449 870235860 870853305 871400058 871118128
870.9 871118128 870705783 870680034 870124280 869723380 869477868 868199527 866597414 864890456 863046706
889.3 863046706 862448215 862766564 863246799 864381731 864980161 864369631 863910496 863196433 861806870
907.6 861806870 860798895 859487176 857686579 856651247 855672181 854460776 853711784 852412522 850718737
926 850718737 849709570 848503828 847155392 846221030 844777286 843549073 843237340 842444003 841361523
944.3 841361523 840351582 838361323 836207271 834418476 831915915 829234064 826470137 822873175
960.7 822873175 819626927 816719353 812794924 808214128 802362084 794426858 786194921 778119028
977 778119028 768099546 754546583 737002373 717998326 704674542 706133068 726923883 758856237
993.3 758856237 786211431 801603317 805902004 798923850 784531415 775627911 779384255 788262725
1009.6 788262725 793037951 791496098 785781920 777872264 767401457 755024612 743966520 737808824
1025.9 737808824 736088037 733107030 725420892 715295076 707239151 707252860 716177583 721640766
1042.2 721640766 714417160 704674304 702746868 702833831 698012531 691241980 689281881 696091235 709214568
1060.6 709214568 723735929 738405347 753280759 768003345 782235444 793406367 799619973
1074.9 799619973 802123845 801486194 798878908 797332108 797679424 799954891 804316103 808277011 810403943
1093.2 810403943 811647773 811531603 810362756 809588730 808763742 808487177 810188472 812537193 814262390
1111.6 814262390 814583778 812094152 809258461 809449971 810259163 808344305 804585636 803703725 810705900
1129.9 810705900 822502434 831312954 835786343 837606072 836744070 834415197 831233621 826889813
1146.3 826889813 823407769 821780801 820355952 817503750 811107337 800458074 787031889 769458950
1162.6 769458950 746361017 723685324 711328030 713774025 724191010 728981614 721954823 710410953
1178.9 710410953 706758320 721773863 757174671 797851562 827243149 843470871 850805461 853111804
1195.2 853111804 853845239 853235722 851236641 849153221 846837580 844625771 843005836 840423763 836922169
1213.6 836922169 833517492 829319596 824737191 820431471 814881802 808145702 801333427 793800116
1229.9 793800116 785218656 775696158 765210271 753977120 739998758 720790207 697214901 669928551
1246.2 669928551 636873782 597343504 557894051 532577753 527268767 533400238 545277536 564113617
1262.5 564113617 592338860 634329855 687186837 736383319 770580947 790986300 802392781
1276.8 802392781 807694674 809840322 808509290 801725149 792619884 784272552 774150074 759396911
1293.1 759396911 741913795 733192265 744616628 767257750 781859159 778635085 758675218 739700019
1309.4 739700019 743961275 768193543 793709397 812449217 824325025 831428826 836482763 839574277
1325.8 839574277 841443241 843533158 844997466 846321106 848719656 850862861 852684557 855008841
1342.1 855008841 856806099 858313143 859716952 859630644 858792305 857820034 855585694 853603661 852938473
1360.4 852938473 851629794 849498212 847042143 843448937 839806080 836032867 830329955 824436963
1376.7 824436963 819210649 812643528 805072486 797545612 788037121 775328398 763992369 761299729
1393.1 761299729 770217955 782578886 790851116 794547915 792230904 782018781 767162025 753135860
1409.4 753135860 744551361 744577110 752597272 768206596 788557708 803500652 811496794 815524280
1425.7 815524280 815763354 813759863 811091125 806986690 799893022 788715482 774121821 758347332
1442 758347332 747921586 749282241 760986626 772327423 776085734 775733709 775781989 775120974 771989048
1460.4 771989048 765647113 750260890 721749187 689267695 669545054 674654961 686734915 695389926
1476.7 695389926 718181252 752656937 780001402 792644918 793878913 784155786 764626265 741020322
1493 741020322 712783456 675919414 640125453 624353230 630404115 637351453 630783677 643238664
1509.3 643238664 684202492 732233346 772698998 802688539 822557628 836576521 845034122
1523.6 845034122 848901093 851180077 852155209 852732897 854084313 855743527 857942164 860709012 860690594
1542 860690594 858814955 857377410 856311381 855648279 855465710 854911745 854283452 852801919 847421527
1560.3 847421527 842096567 837193012 830507576 821530640 812355995 807517409 806573629 804341257
1576.6 804341257 797484815 788898110 784105301 787777960 796965539 804104388 804979980 800336361
1593 800336361 791340232 778461635 761876285 740574479 715130687 688826203 661182225 627826750
1609.3 627826750 589102685 555089653 543974519 573854089 625243306 674344778 716650665
1623.5 716650665 744145870 758840561 767063320 771809518 775733232 779782593 782078683 783726156
1639.9 783726156 786562085 790574908 795816541 801196873 805268347 810104609 814933538 816379309
1656.2 816379309 817426682 819326878 820714474 820697308 820275843 819318354 817167103 814922392 812814653
1674.5 812814653 810807705 809903145 810297132 811938703 813931823 815074325 816744864 819296479 822153687
1692.9 822153687 825810552 829622388 832193673 833509207 833703399 833387375 832716465 831625938 830652356
1711.3 830652356 830513775 831011593 831030786 830478370 830370724 831108153 832549453 834068537 835343122
1729.6 835343122 836361527 836427331 835554004 835582554 836569905 837954640 839829028 841924369 843847454
1748 843847454 845007300 844760537 844072819 843608558 842861712 842055738 841529548 841298044 841818035 843070507
1768.4 843070507 844388962 845317423 845669389 845928073 846794903 848069429 849192142 850286663 851321459
1786.7 851321459 852274656 853408694 854065955 853875518 853732288 853641808 853085697 852275848 851497769 850843012
1807.1 850843012 850416422 849782765 848802865 847992361 847249210 846458554 845963538 845609605 845115900 844696283
1827.5 844696283 844044507 842849553 841649175 840486705 839270353 838307083 837557435 836610675 835144043
1845.9 835144043 833275557 831428409 829785347 828104317 826457441 824925184 823230803 821584463
1862.2 821584463 820306003 819187999 817896962 816156030 814264655 812776625 811536312 810114324
1878.5 810114324 808595598 806908727 804855645 802865922 801051795 799406707 798545301 798318446 798145354
1896.9 798145354 798188567 798396945 798546195 798840880 799132466 799326956 799800634 800523639 801367581 802388012
1917.3 802388012 803175867 803734303 804463387 805105865 805674374 806436837 807076752 807564735 808209419 808829010
1937.7 808829010 809514701 810479641 811265945 811932087 812890291 813900828 815012217 816402853 817731380
1956 817731380 819099367 820652783 821986318 823226690 824488938 825323462 825955808 826651573 827034235
1974.4 827034235 827216983 827289760 826991796 826693118 826573968 826397419 826473594 826737881 826683640 826629102
1994.8 826629102 826727271 826663196 826647758 826603293 826296151 826149583 826174021 826178789 826492965 826882958 827002764
2017.2 827002764 827140331 827203155 827057719 827221036 827870190 828693092 829566300 830237627 830761790 831547558
2037.6 831547558 832323194 833015323 833913147 834580898 834919631 835275710 835326850 835135341 835093498 834850132
2058 834850132 834456682 834256411 833936572 833670855 833795428 833905995 834070027 834439456 834580004 834690928
2078.4 834690928 834960282 834955275 834919751 835075259 835066438 835186005 835558414 835726142 835922956 836230516
2098.8 836230516 836248875 836304247 836491823 836458683 836516201 836593449 836301029 836037397 835815191 835340858
2119.2 835340858 834973752 834625185 834122658 833986342 834053218 833919346 833879054 833770216 833490074 833596766
2139.6 833596766 833903670 834111392 834522307 834871173 835051417 835499227 835937142 836226642 836685121 836912751
2160 836912751 836836457 836878300 836688161 836260915 836109161 835953474 835709214 835654497 835447907 835170627
2180.4 835170627 835097849 834815025 834461570 834344864 834079027 833787024 833658695 833311200 832985044 832876861
2200.8 832876861 832546651 832183480 831933916 831420064 830947459 830672741 830202341 829811633 829582274 829144716
2221.2 829144716 828799784 828603268 828246713 828033507 827900231 827511251 827212751 826980412 826551378 826236069
2241.6 826236069 825906157 825345635 824978948 824683130 824165106 823747575 823279083 822593749 822110236 821655214
2262 821655214 821005642 820457757 819829643 819089293 818593323 818048894 817330480 816724062 815966904 815045893
2282.3 815045893 814270020 813355267 812280416 811327696 810273826 809216142 808374763 807377994 806249619
2300.7 806249619 805225670 804067135 802930295 802042007 801028311 799917996 798872709 797580123
2317 797580123 796274900 795317233 794422805 793543100 792590618 791257799 789973140 789016902 787953258
2335.4 787953258 786845922 785939276 785296261 785356879 786144972 786955237 787340522 787132561 786411405 785751939
2355.8 785751939 785229921 784458876 783581197 782560885 781405866 780455709 779586196 778770506 778183043
2374.1 778183043 777593255 777001083 776615560 776151538 775439501 774640977 773632884 772420585 771250010
2392.5 771250010 769981503 768570542 767223835 765880764 764698148 763931334 763308704 762659669 762017548
2410.8 762017548 761219919 760412693 759809792 759193420 758501649 757754147 756759048 755660057 754651189
2429.2 754651189 753615379 752635598 751748383 750777543 749827683 748948336 747969687 746968687 745991766
2447.6 745991766 744989753 744168997 743541121 742909133 742321074 741743267 741108000 740612447 740241408
2465.9 740241408 739846587 739559889 739389718 739260554 739294589 739443183 739694893 740380943 741687715 743618131
2486.3 743618131 746109724 748775840 751242876 753363013 754792809 755212903 754655123 753311932 751612306
2504.7 751612306 749945760 748280823 746648371 745226502 743922770 742646933 741450727 740312696
2521 740312696 739326000 738566995 737881660 737193227 736449003 735508263 734444082 733380675 732296646
2539.3 732296646 731285751 730448961 729822040 729579926 729790509 730291784 730909526 731413126 731666446
2557.7 731666446 731824219 732004583 732218683 732569039 733070672 733653903 734371006 735234737 736166239 737109840
2578.1 737109840 737941921 738592744 739127755 739486277 739556849 739338040 738799393 737977862 737054884 736156821
2598.5 736156821 735364139 734746277 734298706 734030128 733897030 733781397 733715057 733772397 733923554 734251857
2618.9 734251857 734898746 735878348 737174332 738652647 740119338 741574466 742932498 743916512 744495571
2637.2 744495571 744893253 745424390 746460378 748089969 750112832 752340794 754540205 756549120 758454025
2655.6 758454025 760300457 761997759 763432264 764351726 764470041 763645589 761825681 759113848 755820513
2673.9 755820513 752346039 749161363 746665835 744913399 743827820 743384004 743434548 743872344 744656444
2692.3 744656444 745559990 746370912 747028232 747498453 747896075 748355567 748812675 749256670 749726951 750178099
2712.7 750178099 750687063 751294434 751896977 752527654 753204465 753865421 754561424 755331099 756159008 757035434
2733.1 757035434 757894337 758714139 759622157 760724545 762019336 763465464 764880419 766062558 767015338
2751.4 767015338 767697215 767918944 767621219 766926408 766063929 765246093 764539599 764120758 764284551 765028656
2771.8 765028656 766174436 767556548 768912733 770071208 770979881 771502793 771699786 771853745 772016346
2790.2 772016346 772229195 772646129 773164511 773580015 773769677 773625731 773143888 772348166 771173120
2808.6 771173120 769605994 767614722 765060902 761971712 758417428 754329264 749828577 745072484
2824.9 745072484 739900291 734031856 727108598 718787551 708932042 696881831 680862010 658455133
2841.2 658455133 626922369 585428596 541053414 509722412 505583525 529815257 570289254
2855.5 570289254 610979676 641694248 659817159 667149127 667596638 665400803 663965404 665565789
2871.8 665565789 670507491 676960170 682437778 685145557 684743047 682079017 677880704 672402084
2888.1 672402084 665960252 658981621 651718318 643740118 633734941 620454371 603454590 582201123
2904.4 582201123 554100931 514744282 464616746 416739225 391160250 397396594 426318467
2918.7 426318467 461374193 492117286 515733242 531939447 539278805 536788702 531115413 536205888
2935 536205888 558633685 590460420 620806098 645308435 663845181 676785707 684776247 688932061
2951.3 688932061 689962506 687680602 681395352 672519982 667080641 670486450 680698872 692642570
2967.6 692642570 704949856 718020856 730726123 741165102 748472214 753160536 756091535 758034766
2984 758034766 759897888 762158394 764673650 767265558 769719005 771912038 774052978 776187360 778105378
3002.3 778105378 779720485 781007111 782067835 783158958 784229159 785124242 786086679 787318110 788744748
3020.7 788744748 790312886 791833282 793155074 794388473 795405090 795951545 795955241 795520842 795268297
3039 795268297 795672238 796299696 796756268 797227800 797767818 798184872 798349559 797976673 796760857 794670641
3059.4 794670641 791711271 788244843 785412848 784393132 785472214 787873209 790641129 793600678
3075.7 793600678 796541095 798596323 799375892 799115717 798094332 797102988 796925426 797486484 798603535
3094.1 798603535 800162077 801821530 803381085 804705679 805779159 806881189 807925761 808571637
3110.4 808571637 809178472 810051084 810774207 811182022 811284423 811067164 810952127 811110139 811247706 811233819
3130.8 811233819 810985804 810548902 810193002 809741020 808913827 808101356 807653010 807514191 807636976 807745159
3151.2 807745159 807489812 807051539 806824446 806950629 807329357 807662070 807862878 808056593 808142662 808132291
3171.6 808132291 808169007 808107853 807868719 807553828 807130158 806700110 806440890 806217313 805916727 805582583
3192 805582583 805183470 804824889 804603398 804371953 804128587 803931236 803667367 803357720 803036749 802587569
3212.4 802587569 802050471 801486313 800865889 800332904 799943805 799601853 799386024 799252689 799021482 798774421
3232.8 798774421 798504472 798073769 797571599 797027826 796425462 795917571 795431077 794805169 794215858 793749809
3253.2 793749809 793307722 792897582 792474270 791990757 791522324 791109264 790870309 790845931 790683866 790233552
3273.6 790233552 789701521 789122462 788580358 788189530 787788630 787311733 786907971 786612451 786292374 785794973
3294 785794973 785064220 784199297 783383787 782742977 782311022 781834066 780916810 779643714 778366923 777176917
3314.4 777176917 776072085 775063097 774062097 773063898 772007763 770659864 769135475 767714024
3330.7 767714024 766355097 765063167 763854027 762444437 760782719 759083688 757334232 755633652
3347 755633652 754112303 752447069 750474036 748473644 746611238 744826019 742943287 740992129 739245117
3365.4 739245117 737591565 735624909 733299196 730978251 728971362 727244377 725593328 723900676
3381.7 723900676 722211480 720619738 719277561 718284547 717254937 715824306 714357495 713316023
3398 713316023 712532163 711450636 710023582 708799958 707934856 707138538 706322551 705499053 704686999
3416.3 704686999 704006612 703380466 702735424 702295542 702141762 702075124 701947808 701874912 701981425 702063024
3436.7 702063024 701945126 701846957 701982856 702318251 702709198 703056753 703424454 703865051 704382837 705040514
3457.1 705040514 705840528 706631482 707411885 708381414 709436536 710167348 710541487 711024106 711826622
3475.5 711826622 712816954 713803649 714560688 715230227 716085970 716942251 717667460 718466461 719401002 720384300
3495.9 720384300 721365750 722410142 723492324 724320889 724956274 725833178 727026582 728320599 729506671
3514.2 729506671 730522394 731545210 732803345 734311700 735705018 736777902 737776339 738842428
3530.6 738842428 740035117 741484702 742948115 744148135 745435119 747054040 748617113 749725580
3546.9 749725580 750609219 751656830 752755225 753781378 754954457 756347358 757763326 759121776
3563.2 759121776 760605693 762151062 763331473 764272928 765395522 766768575 768303633 769992471
3579.5 769992471 771813512 773743629 775706112 777360201 778558254 779751956 781229317 782826185
3595.8 782826185 784403145 785961330 787448406 788924336 790617824 792544782 794359148 796016455
3612.1 796016455 797613680 799083292 800626159 802020371 802873433 803667784 804958701 806697845 807891250
3630.5 807891250 808352828 808821321 809402823 810011387 810714543 811567366 812685251 814203858 815663934
3648.8 815663934 815906882 815295100 815134287 815569639 815849006 815808177 815724850 815886617 816439152 817178845
3669.2 817178845 817559004 817635298 817718029 817376316 816794395 816508830 816619396 817197382 818271577 819094658
3689.6 819094658 818946064 818555236 818536639 818790555 819187105 819616795 819791079 819905102 820410192 821138859
3710 821138859 821404994 821053922 820685029 820616245 820721090 820764005 820707917 820618212 820529342 820748985 821511507
3732.5 821511507 822307289 822436392 822011292 821537852 821528435 822041214 822212934 822122514 822119951 821690321
3752.9 821690321 821080387 820835829 820793808 820593178 820413947 820504248 820656061 820615768 820214927 819686890
3773.3 819686890 819532096 819830894 820156693 820019960 819688499 819534957 819390893 819203198 819112837 819187641
3793.7 819187641 819462001 819753885 819996715 820179164 819962382 819607556 819300294 818890274 818611145 818738341
3814.1 818738341 819203258 819468796 819500566 819273889 818655014 818157971 817959666 817980111 818284512 818737388
3834.4 818737388 819102287 819140971 818748772 818174362 817675531 817394316 817395389 817743719 818342328 818291724
3854.8 818291724 817530870 817005932 817008734 817252100 817244291 816969097 816918552 816914916 816521645 816021204 815709233
3877.3 815709233 815764964 815972090 815998793 815945268 815671444 815347314 815245509 815058768 814853787 814996064
3897.7 814996064 815328896 815413654 815113604 814548671 813947380 813542068 813381791 813394964 813549995 813735962
3918.1 813735962 813816488 813843548 813864589 813752890 813605309 813681841 813823581 813731611 813476264 813254356
3938.5 813254356 813182831 813234031 813205302 813129067 813119173 812974751 812710702 812568605 812518418 812446535 812364519
3960.9 812364519 812261343 812156916 812100172 812018275 811839104 811586201 811380088 811365962 811468422 811513841
3981.3 811513841 811488211 811404288 811300874 811276078 811281741 811210275 811085463 810930967
3997.6 810930967
##END=$$ End of the data block
