##TITLE=Amostra 014 por Administrator data segunda-feira, junho 25 2012 $$ Begin of the data block
##JCAMP-DX=5.00 $$ ACD/SpecManager v 10.08
##SPECTROMETER/DATA SYSTEM=PERKIN-ELMER Spectrum 100 IR
##DATE=25 Jun 2012 09:31:58
##DATA TYPE=INFRARED SPECTRUM
##DATA CLASS=XYDATA
##ORIGIN=Exported PE Spectrum Data File
##OWNER=Administrator
##NPOINTS=3601
##FIRSTX=400.00000000
##LASTX=4000.00000000
##MAXX=4000.00000000
##MINX=400.00000000
##MAXY=77.37963104
##MINY=42.02464676
##XFACTOR=1.0000000000
##YFACTOR=0.000000100000000
##FIRSTY=45.11052322
##DELTAX=1.00000000
##XUNITS=1/CM
##YUNITS=TRANSMITTANCE
##XYDATA=(X++(Y..Y))
400D51105232J23529549Q7701721M6353989J5068817P03277j65786L815002N707321
$$ 451105232 574634781 662336502 708690491 723759308 724462585 724296799 728111801 733819122
408G33819122L925934R68094l65372M21830J802902K242050J616898Q98208Q41217
$$ 733819122 737745056 738713150 738347778 738769608 740572510 742814560 744431458 745329666 746170883
417G46170883J221619J265640O03485l35388q18405n65949M0818M30221M18930K92359
$$ 746170883 747392502 748658142 749261627 748926239 748107834 747541885 747582703 748012924 748431854 748724213
427G48724213L90701P02286Q96377P07398K23541k12708l50112k35825j00327q3160
$$ 748724213 749114914 749817200 750713577 751420975 751644516 751431808 751081696 750845871 750745544 750662384
437G50662384j16348n7755J09406K41546J96915n951k08588k76718k26898j84402k32163
$$ 750662384 750546036 750488281 750597687 750839233 751036148 751030197 750821609 750544891 750317993 750133591 749901428
448G49901428l28216l64380k88925j54877n2414j6785j8768k8687o8359j78070l43323
$$ 749901428 749573212 749208832 748919907 748765030 748712616 748695831 748677063 748648376 748580017 748401947 748058624
459G48058624m74472m79355l52401j84937q2397p1030r1095p3013j2741L5553L0365
$$ 748058624 747584152 747104797 746752396 746567459 746485062 746414032 746322937 746249924 746237183 746272736 746303101
470G46303101p554j7242L3112J12762J66626J72730J61666J70289J91116J77002R1553
$$ 746303101 746295547 746278305 746311417 746424179 746590805 746763535 746925201 747095490 747286606 747463608 747555161
481G47555161m3335j62125k13165j98975j61667j33362j06430n3863L1814J25656J93482
$$ 747555161 747511826 747349701 747136536 746937561 746775894 746642532 746536102 746482239 746514053 746639709 746833191
492G46833191K24380K32163K33459K26975K00577J54571J08338P9879O2332K8687l9291
$$ 746833191 747057571 747289734 747523193 747750168 747950745 748105316 748213654 748293533 748355865 748384552 748345261
503G48345261j26038j92947k13852j99127j83640j88599k03170j96763j52969q7128
$$ 748345261 748219223 748026276 747812424 747613297 747429657 747241058 747037888 746841125 746688156 746601028
513G46601028l0670m272m578j4648k0676j4572J1825O9733J58234K54593L18908L24173
$$ 746601028 746570358 746566086 746561508 746546860 746526184 746511612 746523437 746593170 746751404 747005997 747324905 747649078
525G47649078K76413K10724J63040J42136J35422J30996J37406J76086K58179L67813
$$ 747649078 747925491 748136215 748299255 748441391 748576813 748707809 748845215 749021301 749279480 749647293
535G49647293M72946N44892N70373N47638M73709L52555K07138Q4991M2267J06201
$$ 749647293 750120239 750665131 751235504 751783142 752256851 752609406 752816544 752901535 752943802 753050003
545G53050003K59094M46472O06614O97174P01599O19049M61731K57950N6686q4152
$$ 753050003 753309097 753755569 754362183 755059357 755760956 756380005 756841736 757099686 757156372 757072220
555G57072220j22452n2414R4376K65579M10233M89883M82254L85971K21710L3570j24588
$$ 757072220 756949768 756897354 756991730 757257309 757667542 758157425 758639679 759025650 759247360 759280930 759156342
566G59156342k10724k06147j15890M1733K39715M39987N92118O44531N70602L85819
$$ 759156342 758945618 758739471 758623581 758665314 758905029 759345016 759937134 760581665 761152267 761538086
576G61538086J46332p9041k35824k99454k69699j61209K29J74560L07770L50876K78396
$$ 761538086 761684418 761605377 761369553 761070099 760800400 760639191 760639420 760813980 761121750 761472626 761751022
587G61751022J01319j37406l77426n57251o27441n60379l62778q1558K05307M15954
$$ 761751022 761852341 761714935 761337509 760780258 760152817 759592438 759229660 759148102 759353409 759769363
597G59769363M96445M36630K68402M5395j73339l36380m04664l58581k06299J6098
$$ 759769363 760265808 760702438 760970840 761016235 760842896 760506516 760101852 759743271 759536972 759553070
607G59553070K52686M41818N31769M89883L13034L4485k72598n15137o09894n20859
$$ 759553070 759805756 760247574 760779343 761269226 761582260 761616745 761344147 760829010 760219116 759698257
617G59698257k74276N7068L86200O42089P80411P81403O47583M06494J15356j51291
$$ 759698257 759423981 759481049 759867249 760509338 761289749 762071152 762718735 763125229 763240585 763089294
627G63089294l24173l66592k81601j04980J12304L16239M57077M94690M11071K21711
$$ 763089294 762765121 762398529 762116928 762011948 762124252 762440491 762897568 763392258 763803329 764025040
637G64025040k6169k67944m42963n11093m57077k90680n0354K00958L89175M58222
$$ 764025040 763998871 763730927 763287964 762776871 762319794 762029114 761978760 762179718 762568893 763027115
647G63027115L94897K32239K9144j60293k97623l53393k98233j18332J57318M41589
$$ 763027115 763422012 763654251 763683395 763523102 763225479 762872086 762573853 762455521 762612839 763054428
657G63054428O30798O79474O51856O89773R01947J244126J506424J429977Q98132N5237
$$ 763054428 763685226 764364700 765016556 765706329 766608276 767852402 769358826 770788803 771686935 771742172
667G71742172p48214j150742j003723m52118J67541N38559N38407K68173n8212k60315
$$ 771742172 770993958 769843216 768839493 768387375 768554916 769093475 769631882 769900055 769841843 769581528
677G69581528k77634j52359L8452K38419M15649N39169N67551M70657K59324n799k40707
$$ 769581528 769303894 769151535 769189987 769428406 769844055 770383224 770950775 771421432 771680756 771674957 771434250
688G71434250l80249m01764l21884j73569R461J94396L46146M30374M26483L39051
$$ 771434250 771054001 770652237 770330353 770156784 770166245 770360641 770706787 771137161 771563644 771902695
698G71902695J97754M2266r0713j74561j93100j39083k0676J35193K88086L95736M31900
$$ 771902695 772100449 772142715 772052002 771877441 771684341 771545258 771524582 771659775 771947861 772343597 772775497
709G72775497L90778K85339J38169k5025j75094k81678l18985k74963j57928M577J72348
$$ 772775497 773166275 773451614 773589783 773564758 773389664 773107986 772789001 772514038 772356110 772360687 772533035
720G72533035L02506L60718L28826K12555M0894j40457k87171l68576l77350l23333
$$ 772533035 772835541 773196259 773525085 773737640 773778534 773638077 773350906 772982330 772604980 772281647
730G72281647k25373j07956K594P6828Q7128K0218j19858l08990n14832p06558q58841
$$ 772281647 772056274 771948318 771950912 772027740 772114868 772135086 772015228 771706238 771191406 770484848 769626007
741G69626007r53064r79156r36814q39843p14036n91049m97513m47921m43116m69970
$$ 769626007 768672943 767693787 766756973 765917130 765203094 764612045 764114532 763666611 763223495 762753525
751G62753525n04608n17273m79203l72238j96914K7694K70767M96216O72684P76291
$$ 762753525 762248917 761731644 761252441 760880203 760683289 760710983 760981750 761477966 762150650 762926941
761G62926941P92923P26700N99441M49600L22571K53907K61764L41034M69360O12793
$$ 762926941 763719864 764446564 765046005 765495605 765818176 766072083 766333847 766674881 767144241 767757034
771G67757034P31507P88650P60803O45066M64630K60086P7209m6386q9798m9973N8365
$$ 767757034 768488541 769277191 770037994 770683060 771147690 771407776 771484985 771438599 771348801 771298828 771357193
782G71357193K05231L51257M54025M82712M25873K95257J20926n7830k02103k81143
$$ 771357193 771562424 771913681 772367706 772850418 773276291 773571548 773692474 773634644 773432541 773151398
792G73151398k77558j94168n2643J07117K41470L12729K97013J92947J8005j95236
$$ 773151398 772873840 772679672 772627029 772734146 772975616 773288345 773585358 773778305 773796310 773601074
802G73601074m03518n66178o56662o70624o26373n54809m84848m33960m04587l89786
$$ 773601074 773197556 772631378 771974716 771304092 770677719 770122910 769638062 769204102 768799515 768409729
812G68409729l76129l50113k97241k06070p3014R5444K79083M48151N71289O23703
$$ 768409729 768033600 767683487 767386246 767180176 767107162 767202606 767481689 767929840 768501129 769124832
822G69124832N94406M90494L33862J57471m883j26877j93939k04391j69983j10092
$$ 769124832 769719238 770209732 770543594 770701065 770696182 770569305 770375366 770170975 770000992 769890900
832G69890900m9057j0605r918n1423j27105k20490l12576l84598m24652m26330l94211
$$ 769890900 769841843 769831238 769821320 769769897 769642792 769422302 769109726 768725128 768300476 767874146 767479935
843G67479935l43018k92435k62069k61765k90146l37066l88947m33502m60053m60662
$$ 767479935 767136917 766844482 766582413 766320648 766030502 765693436 765304489 764870987 764410934 763950272
853G63950272m31290l75748l08304k47345k10266k02179k18277k44598k66342k73285
$$ 763950272 763518982 763143234 762834930 762587585 762377319 762175140 761956863 761712265 761445923 761172638
863G61172638k59934k28271j85852j45111j22070j26954j62735k22091k90375l52478
$$ 761172638 760912704 760684433 760498581 760353470 760231400 760104446 759941711 759719620 759429245 759076767
873G59076767l93524m03061l74756l06854k06452q8348K8534J24893J87302K11639
$$ 759076767 758683243 758280182 757905426 757598572 757392120 757303772 757332306 757457199 757644501 757856140
883G57856140K01950J73340J44272J33362J52511K01569K69470L36380L82691L93066
$$ 757856140 758058090 758231430 758375702 758509064 758661575 758863144 759132614 759468994 759851685 760244751
893G60244751L59726K83890J78604O5002k8686p5836o0502J6556J39008K77939M01535
$$ 760244751 760604477 760888367 761066971 761131973 761103287 761027451 760966949 760983505 761122513 761400452 761801987
904G61801987M81033M96216M42123L29514J85242M5318n6839r9029p8278r689P8964
$$ 761801987 762283020 762779236 763221359 763550873 763736115 763781433 763724594 763625565 763547287 763537598 763616562
915G63616562J52740J80512J42288L4180j27640l13873m88587o17523o79779o69479
$$ 763616562 763769302 763949814 764092102 764126282 763998642 763684769 763196182 762578659 761898880 761229401
925G61229401o01502n06515m23203l86810m17862n15137o58798q17261r56421j047516
$$ 761229401 760627899 760121384 759698181 759311371 758893509 758378372 757719574 756902313 755945892 754898376
935G54898376j071395j020279r02329p40204n69076m25415l36991l16009l55988m36020
$$ 754898376 753826981 752806702 751904373 751164169 750595093 750169678 749832687 749516678 749160690 748724670
945G48724670n27343n98221o23169n85709m85611l40728j80970m0970N0354P8507M6387
$$ 748724670 748197327 747599106 746975937 746390228 745904617 745563889 745382919 745341949 745392303 745470810 745517197
956G45517197k6017j07269j64032j68075j06354J8234J87759L73307N43823O70013
$$ 745517197 745491180 745383911 745219879 745051804 744945450 744963684 745151443 745524750 746068573 746738586
966G46738586P31583P22809O54755N53360M51660L81012L62014M00544M87976O06231
$$ 746738586 747470169 748192978 748847733 749401093 749852753 750233765 750595779 750996323 751484299 752090530
976G52090530P29218Q30307Q86917Q86307Q30078P33643O21109N19027M49600M25187
$$ 752090530 752819748 753650055 754536972 755423279 756253357 756987000 757608109 758127136 758576736 759001923
986G59001923M46777N02014N70679O26983O47583O19050N38406M13208K60467J01395
$$ 759001923 759448700 759950714 760521393 761148376 761795959 762415009 762953415 763366623 763627090 763728485
996G63728485m1275j47781k06070k14081j81198j23902o3781k0829r765l9292j07727
$$ 763728485 763687210 763539429 763333359 763119278 762938080 762814178 762750397 762729568 762719803 762680511 762572784
1007G62572784k02179l04107l94669m60815n02091n26199n48019n80826o35071p15103
$$ 762572784 762370605 762066498 761671829 761211014 760708923 760182724 759634705 759053879 758418808 757703705
1017G57703705q20999r47342j086197j225510j354141j461105j538163j579971j585617
$$ 757703705 756882706 755935364 754849167 753623657 752269516 750808411 749270248 747690277 746104660
1026G46104660j560211j514664j462860j418686j392975j391144j412429j451187j496277
$$ 746104660 744544449 743029785 741566925 740148239 738755264 737364120 735951691 734500504 733004227
1035G33004227j534043j549377j531830j477585j388931j274109j144180j011963q92334
$$ 733004227 731470184 729920807 728388977 726911392 725522461 724248352 723104172 722092209 721199875
1044G21199875p98874p38144p08160o92444o67649o11114n08423l62015j87225r613
$$ 721199875 720401001 719662857 718954697 718262253 717594604 716983490 716475067 716113052 715925827 715916214
1054G15916214J40915K39563K70462K31094J32981j297j43204k65503l45917l73077
$$ 715916214 716057129 716296692 716567154 716798248 716931229 716929932 716786728 716521225 716175308 715802231
1064G15802231l46756k78931j90429j07346n4398n0811j05515k14767l63465n26886
$$ 715802231 715455475 715176544 714986115 714878769 714824371 714773560 714668045 714453278 714089813 713562927
1074G13562927o76346p87429q47092q56934q34045q04138p93839q24585r06830j040115
$$ 713562927 712886581 712099152 711252060 710395126 709561081 708756943 707963104 707138519 706231689 705191574
1084G05191574j211014j398010j575165j717911j809005j843338j826248j776734j721420
$$ 705191574 703980560 702582550 701007385 699289474 697480469 695637131 693810883 692034149 690312729
1093F90312729j688538j702194j773148j896514k052689k213593k351226k444764k484741
$$ 690312729 688624191 686921997 685148849 683252335 681199646 678986053 676634827 674190063 671705322
1102F71705322k473983k424851k358017k294998k253723k242127k257538k286682k312851
$$ 671705322 669231339 666806488 664448471 662153473 659899750 657657623 655400085 653113403 650800552
1111F50800552k318344k289963k221679k115326j983299j844979j724052j642075j611442
$$ 650800552 648482208 646192245 643970566 641855240 639871941 638026962 636302910 634660835 633049393
1120F33049393j634445j702233j796951j898537j985740k043915k066765k057877k027816
$$ 633049393 631414948 629712715 627915764 626017227 624031487 621987572 619920807 617862930 615835114
1129F15835114j992760j966515j960106j976699k012864k057876k095146k108498k085152
$$ 615835114 613842354 611875839 609915733 607939034 605926170 603868294 601773148 599664650 597579498
1138E97579498k021064j921959j800003j670571j547699j440582j352882j281739j220245
$$ 597579498 595558434 593636475 591836472 590165901 588618202 587177620 585824738 584542999 583322754
1147E83322754j160202j093140j014862r23538q20198p07321n89295m72336l62892
$$ 583322754 582162552 581069412 580054550 579131012 578310814 577603493 577014198 576541862 576178970
1156E76178970k65159j78108r5177p057R5062K15950L55263N08690O69784Q31566R87205
$$ 576178970 575913811 575735703 575640526 575633469 575728531 575944481 576299744 576808434 577478218 578309784 579296989
1167E79296989J132355J265183J386985J501351J612854J724243J839142J957817K080498
$$ 579296989 580429344 581694527 583081512 584582863 586195717 587919960 589759102 591716919 593797417
1176E93797417K204323K323799K433929K528572K606087K667007K714653K756272K799682
$$ 593797417 596001740 598325539 600759468 603288040 605894127 608561134 611275787 614032059 616831741
1185F16831741K852898K922249L007736L104591L202553L290634L359909L404770L423615
$$ 616831741 619684639 622606888 625614624 628719215 631921768 635212402 638572311 641977081 645400696
1194F45400696L416595L386460L337326L274307L200455L117294L019333K899246K748108
$$ 645400696 648817291 652203751 655541077 658815384 662015839 665133133 668152466 671051712 673799820
1203F73799820K559280K332077K072831J792678J507721J233063R81522P59811N68009
$$ 673799820 676359100 678691177 680764008 682556686 684064407 685297470 686278992 687038803 687606812
1212F87606812M01153K49863J02920m7912k07672l74299n39321o90690q16192r06830
$$ 687606812 688007965 688257828 688360748 688312836 688105164 687730865 687191544 686500854 685684662 684777832
1222F84777832r58786r74274r61227r31778r01032q83026q86612r13772r58862j011429
$$ 684777832 683819046 682844772 681883545 680951767 680050735 679167709 678281097 677367325 676408463 675397034
1232F75397034j060944j098480j118698j120377j106186j083069j061096j048126j049576
$$ 675397034 674336090 673237610 672118912 670998535 669892349 668809280 667748184 666700058 665650482
1241F65650482j064300j085816j104736j111755j100159j066742j011658r38797q55255
$$ 665650482 664586182 663500366 662395630 661283875 660183716 659116974 658105316 657166519 656311264
1250F56311264p68738o87484o16227n56411n05372m55703l96042l14102j97754m0894
$$ 656311264 655542526 654855042 654238815 653682404 653177032 652721329 652325287 652011185 651813431 651772537
1260F51772537J56327L86657O37131Q94089J143341J373596J577606J752014J897431
$$ 651772537 651928864 652315521 652952652 653846741 654990082 656363678 657941284 659693298 661590729
1269F61590729K015838K109681K179794K226105K249908K252731K236481K201309K145081
$$ 661590729 663606567 665716248 667896042 670122147 672372055 674624786 676861267 679062576 681207657
1278F81207657K065201J962509J840744J707458J569901J431198J291046J144943R87625
$$ 681207657 683272858 685235367 687076111 688783569 690353470 691784668 693075714 694220657 695208282
1287F95208282Q13981O21185M10843J90964k2507k04544l24707l54920k75345q4304
$$ 695208282 696022263 696643448 697054291 697245255 697222748 697018204 696693497 696338577 696063232 695978928
1297F95978928K02331N49774R15833J257934J543427J752014J876984J920013J887512
$$ 695978928 696181259 696731033 697646866 698904800 700448227 702200241 704077225 705997238 707884750
1306G07884750J789704J635589J437836J207657R56802O97098M39835J97296j6403
$$ 707884750 709674454 711310043 712747879 713955536 714912338 715609436 716049271 716246567 716230164
1315G16230164j85318k93580l28216k83737j65024J2436K24914M48380O62002Q50602
$$ 716230164 716044846 715751266 715423050 715139313 714974289 714986725 715211639 715660019 716322021 717172623
1325G17172623J003647J112518J171264J177598J135025J054534R49708Q33358P15714
$$ 717172623 718176270 719288788 720460052 721637650 722772675 723827209 724776917 725610275 726325989
1334G26325989O03561N04685M27551L81622L73154M00619M53873N16129N68084N94864
$$ 726325989 726929550 727434235 727861786 728243408 728616562 729017181 729471054 729987183 730555267 731150131
1344G31150131N89066N52978M97513M36936L84521L48053L28674L19977L12195K94876
$$ 731150131 731739197 732292175 732789688 733226624 733611145 733959198 734287872 734607849 734920044 735214920
1354G35214920K58637J95770J00250l2349j99661l88794n74722p23114q02689p96203
$$ 735214920 735473557 735669327 735769577 735737228 735537567 735148773 734574051 733850937 733048248 732252045
1364G32252045p06940n59235l87725k26746j02081k8077p782l6621j02157j89896k86941
$$ 732252045 731545105 730985870 730598145 730371399 730269318 730241241 730233459 730196838 730094681 729904785 729617844
1375G29617844l86963m90799o04630p32727q74786j021652j160736j276398j353073
$$ 729617844 729230881 728740082 728135452 727402725 726527939 725506287 724345551 723069153 721716080
1384G21716080j376496j332168j208801r99451p07016l48282M2725M20303P32346R38110
$$ 721716080 720339584 719007416 717798615 716799164 716092148 715743866 715786591 716206894 716939240 717877350
1394G17877350J020889R92890Q92868P69348O69098O24389O50025P43942Q88901J055832
$$ 717877350 718898239 719891129 720783997 721553345 722222443 722846832 723496857 724240799 725129700 726185532
1404G26185532J212158J329269J391525J400452J368256J312485J250000J192779J149674
$$ 726185532 727397690 728726959 730118484 731518936 732887192 734199677 735449677 736642456 737792130
1413G37792130J121749J099015J060562R77249Q25043N97610L12348O027k76642n01709
$$ 737792130 738913879 740012894 741073456 742050705 742875748 743473358 743785706 743791733 743515091 743013382
1423G43013382o56586p56683q34045r20258j028671j148758j252060j322861j371918
$$ 743013382 742356796 741600113 740766068 739845810 738817139 737668381 736416321 735093460 733721542
1432G33721542j438293j562271j753388j974334k154160k227707k172088k014847j817246
$$ 733721542 732283249 730720978 728967590 726993256 724839096 722611389 720439301 718424454 716607208
1441G16607208j639938j517792j459427j455841j492538j551056j605835j622543j569443
$$ 716607208 714967270 713449478 711990051 710534210 709041672 707490616 705884781 704262238 702692795
1450G02692795j427613j201095r12628n95856k86560j6785J87836L15323L74527L94134
$$ 702692795 701265182 700064087 699151459 698555603 698269043 698252258 698440094 698755417 699129944 699524078
1460F99524078M12903M55551N19562N74722N84793N31617M28848L11661K16598J59302
$$ 699524078 699936981 700392532 700912094 701486816 702071609 702603226 703032074 703343735 703560333 703719635
1470G03719635J32370J18637J05438R3918R5673J23291J84326K81372M10690N63355
$$ 703719635 703852005 703970642 704076080 704169998 704265671 704388962 704573288 704854660 705265350 705828705
1480G05828705P22656Q70209R97619J116181J253738J436081J662293J894607K070770
$$ 705828705 706551361 707421570 708419189 709535370 710789108 712225189 713887482 715782089 717852859
1489G17852859K138367K085571J949997J799393J696243J667862J697998J742936J756973
$$ 717852859 719991226 722076797 724026794 725826187 727522430 729190292 730888290 732631226 734388199
1498G34388199J717529J631470J528396J438294J373444J320724J251907J145554J004105
$$ 734388199 736105728 737737198 739265594 740703888 742077332 743398056 744649963 745795517 746799622
1507G46799622Q54568P30896O50864O07300N76095N38330M92935M53492M29763M17023
$$ 746799622 747654190 748385086 749035950 749643250 750219345 750757675 751250610 751704102 752133865 752550888
1517G52550888L96042L51410K87323K26517J95083K04315K42005K82669L02276K91214
$$ 752550888 752946930 753298340 753585663 753812180 754007263 754211578 754453583 754736252 755038528 755329742
1527G55329742K54670K06298J58997J21765R7351Q6060Q5373R3002J09253J36871J75324
$$ 755329742 755584412 755790710 755949707 756071472 756168823 756254883 756340256 756433258 756542511 756679382 756854706
1538G56854706K19879K55737K65045K36206J73111R6283L4562J1520L2806Q4000J38473
$$ 756854706 757074585 757330322 757595367 757831573 758004684 758100967 758135529 758147049 758179855 758263855 758402328
1549G58402328J73188J79214J68457J60523J67618J81503J75628J20850J0605j29471
$$ 758402328 758575516 758754730 758923187 759083710 759251328 759432831 759608459 759729309 759739914 759610443
1559G59610443k47269k95181k54898j48468k9221N2186O8130K5330m3793j02997j27640
$$ 759610443 759363174 759067993 758813095 758664627 758635406 758687592 758755722 758781052 758737259 758634262 758506622
1570G58506622j12304p1488k8000m120j1444m8065r8572j44806j75323j90811k01950
$$ 758506622 758394318 758322830 758294830 758290710 758279266 758231201 758132629 757987823 757812500 757621689 757419739
1581G57419739k20032k49786k84119l12042l25165l23868l17001l15781l27530l53088
$$ 757419739 757199707 756949921 756665802 756353760 756028595 755704727 755387726 755071945 754744415 754391327
1591G54391327l88413m27932m66843n03159n36193n65262n89524o08902o22406o33163
$$ 754391327 754002914 753574982 753108139 752604980 752068787 751503525 750914001 750305099 749682693 749049530
1601G49049530o45294o64749o97480p45849q07800q76236r38950r83276r99375r84649
$$ 749049530 748404236 747739487 747042007 746296158 745488358 744612122 743673172 742689896 741690521 740705872
1611G40705872r48105r07440q83255q90809r30099r88007j041717j073761j079407
$$ 740705872 739757767 738850327 737967072 737076263 736146164 735158157 734116440 733042679 731963272
1620G31963272j067352j050034j034240j015320r84345r36355q76160q15582p62635
$$ 731963272 730895920 729845886 728811646 727796326 726811981 725875626 724999466 724183884 723421249
1629G23421249p19604o81839o46134o12869n78613n24750m19159k29950M9744L89023
$$ 723421249 722701645 722019806 721373672 720760803 720182190 719657440 719238281 719008331 719058075 719447098
1639G19447098P29828J015167J216125J338272J404419J433106J431579J405411J374588
$$ 719447098 720176926 721192093 722408218 723746490 725150909 726584015 728015594 729421005 730795593
1648G30795593J365357J393661J440048J453095J379547J203766R64279P33261N75333
$$ 730795593 732160950 733554611 734994659 736447754 737827301 739031067 739995346 740728607 741303940
1657G41303940N12466N21317N56946N84793N94253N91431N84411N71137N43365M94690
$$ 741303940 741816406 742337723 742894669 743479462 744073715 744665146 745249557 745820694 746364059 746858749
1667G46858749M25721L44314K59018J73798Q4533j6784j35803k66877l90014m79889
$$ 746858749 747284470 747628784 747887802 748061600 748146133 748129349 747993546 747726669 747336655 746856766
1677G46856766n22309n31768n50919o33774q13446j082916j395569j688995j910553
$$ 746856766 746334457 745802689 745251770 744617996 743804550 742721634 741326065 739637070 737726517
1686G37726517k036896k076645k068787k069549k137909k314987k602539k966538l360061
$$ 737726517 735689621 733612976 731544189 729474640 727336731 725021744 722419205 719452667 716092606
1695G16092606l753586m153824m580536n031738n463028n807419o024704o138916o226425
$$ 716092606 712339020 708185196 703604660 698572922 693109894 687302475 681277771 675138855 668912430
1704F68912430o363144o570969o807022p002563p115174p151947p153053p153435p164268
$$ 668912430 662549286 655978317 649171295 642168732 635053558 627901611 620748558 613595123 606430855
1713F06430855p175560p169724p126198p013893o794433o442375n969315n425034m868583
$$ 606430855 599255295 592085571 584959373 577945480 571151047 564708672 558739357 553314323 548445740
1722E48445740m328652l794136l239326k662010k087784j535263r77021l44657M13055
$$ 548445740 544117088 540322952 537083626 534421616 532333832 530798569 529821548 529476891 529889946
1731E29889946J257820K055550K647705K962646L077660L178520L441391L921776M526367
$$ 529889946 531147766 533203316 535851021 538813667 541891327 545069847 548511238 552433014 556959381
1740E56959381N084000N457115N619163N655518N698090N845451O110344O417694O643639
$$ 556959381 562043381 567500496 573119659 578775177 584473267 590318718 596429062 602846756 609490395
1749F09490395O678352O479111O093139N634232N225716M939537M767303M643860M498367
$$ 609490395 616168747 622647858 628740997 634375229 639600945 644540482 649307785 653951645 658450012
1758F58450012M297638M057388L810730L577500L350220L109741K851028K592926K369004
$$ 658450012 662747650 666805038 670615768 674193268 677543488 680653229 683504257 686097183 688466187
1767F88466187K204895K104110K047577K002335J937256J829834J676712J494445J318741
$$ 688466187 690671082 692775192 694822769 696825104 698762360 700592194 702268906 703763351 705082092
1776G05082092J186371J120529J117096J145783J169891J162644J117477J043777R57261
$$ 705082092 706268463 707388992 708506088 709651871 710821762 711984406 713101883 714145660 715102921
1785G15102921Q71200P96356P40128P06863O91223O81534O64902O36902O06003N88760
$$ 715102921 715974121 716770477 717510605 718217468 718908691 719590225 720255127 720892029 721498032 722086792
1795G22086792N94635O17523O37207O31333N89447N20858M47388L92227L68500L74832
$$ 722086792 722681427 723298950 723936157 724567490 725156937 725677795 726125183 726517410 726885910 727260742
1805G27260742M00086M30069M54712M67300M66309M52041M26102L91159L52936L16772
$$ 727260742 727660828 728090897 728545609 729012909 729479218 729931259 730357361 730748520 731101456 731418228
1815G31418228K90756K80457K89459L16315L52859L85208L96882L74069L16925K39792
$$ 731418228 731708984 731989441 732278900 732595215 732948074 733333282 733730164 734104233 734421158 734660950
1825G34660950J68609J29929J36413J80283K38342K85721L07388L04337K87933K69776
$$ 734660950 734829559 734959488 735095901 735276184 735514526 735800247 736107635 736411972 736699905 736969681
1835G36969681K55813K45743K39029K36511K40250K46887K49100K37732K10876J75934
$$ 736969681 737225494 737471237 737710266 737946777 738187027 738433914 738683014 738920746 739131622 739307556
1845G39307556J45035J28021J24664J26648J24970J17187J08719J08643J22833J49002
$$ 739307556 739452591 739580612 739705276 739831924 739956894 740074081 740182800 740291443 740414276 740563278
1855G40563278J79901K05918K18734K14234J90048J49155R9945N6076L4408M2954Q0643
$$ 740563278 740743179 740949097 741167831 741382065 741572113 741721268 741821213 741877289 741911697 741954651 742035294
1866G42035294J32522J78375K01798J96915J69296J32522R7809P2251N6839N0201N1651
$$ 742035294 742167816 742346191 742547989 742744904 742914200 743046722 743144531 743216782 743273621 743323822 743375473
1877G43375473O1722P9574J02005J21613J31454J26648J07193P9041M9209K5712J4114
$$ 743375473 743437195 743516769 743618774 743740387 743871841 743998489 744105682 744184723 744233932 744259644 744273758
1888G44273758J6098L1204N5237Q1558J03226J14212J10474R1552O0883K5787m730
$$ 744273758 744289856 744321060 744376297 744457855 744561081 744675293 744785767 744877319 744938202 744963989 744959259
1899G44959259k1286j7548N570M0359P5913J00326J06583R4299O7368L4561M654j3199
$$ 744959259 744937973 744920425 744925995 744966354 745042267 745142593 745249176 745343475 745410843 745445404 745450058 745436859
1911G45436859j2588Q316M4555Q4076J12610J18103R6512N3177J068m5624p6523q5907
$$ 745436859 745424271 745432587 745477142 745561218 745673828 745791931 745888443 745941620 745942688 745897064 745820541 745734634
1923G45734634p4920m7379q697L4485P5988J08109J23062J17111Q9112M5547j831l9825
$$ 745734634 745659714 745612335 745603638 745638123 745714111 745822220 745945282 746062393 746151505 746197052 746195221 746155396
1935G46155396n6534m8523j9684K0523N9357Q5144R2849Q1253N5161K0981j3962m2343
$$ 746155396 746098862 746050339 746030655 746051178 746110535 746195679 746288528 746369781 746424942 746445923 746431961 746389618
1947G46389618n9280n8671l9291j526M7150R4757J25961J30081J02997N1728q851o1035
$$ 746389618 746330338 746271667 746232376 746230850 746278000 746372757 746498718 746628799 746731796 746783524 746774673 746713638
1959G46713638r1095r2621o7367k3422K6779P1182R9945J06888R1248N6533J0910l4866
$$ 746713638 746622543 746529922 746462555 746439133 746465912 746537094 746637039 746743927 746835175 746891708 746902618 746867752
1971G46867752o9656q3161p0648l5019J4649O4544J00632J13297R8876O1875J1597
$$ 746867752 746798096 746714935 746644287 746609268 746623917 746688461 746789093 746902390 747001266 747063141 747074738
1982G47074738l8758p6141q9569p5531l7384J3885O3553R7809J07803R1934N5771Q698
$$ 747074738 747035980 746959839 746870270 746794739 746757355 746771240 746834793 746932602 747040405 747132339 747188110 747196808
1994G47196808l7384p2022q6746p8049m7149o11N0049R1706J13296J09100P9880L4943
$$ 747196808 747159424 747087402 747000656 746922607 746875458 746874847 746924896 747016602 747129898 747238998 747318878 747353821
2006G47353821j3886n3253p4081p1259m6005n570M0741Q0338J03149J03913Q3160M6997
$$ 747353821 747339935 747286682 747212601 747141342 747095337 747089767 747130508 747210846 747313995 747417908 747501068 747548065
2018G47548065N570l1586n5695o1264m6768j4953K6092O6147R4452J03836R2926O5155
$$ 747548065 747553635 747522049 747466354 747405090 747358322 747343369 747369461 747435608 747530060 747633896 747726822 747791977
2030G47791977K8000r155l7537n1041m5547k3499R308M3182O8970P9956P5455N7526
$$ 747791977 747819977 747810822 747773285 747722244 747676697 747653198 747662506 747705688 747774658 747854614 747930069 747987595
2042G47987595L1967M349j8464l2196l4103k3499l509K0904M4327O0578O6604O1341
$$ 747987595 748019562 748023911 748005447 747973251 747939148 747915649 747912140 747933044 747977371 748037949 748104553 748165894
2054G48165894M6234K5253M425j1368j7776j4420k899J2283K5711L4790L7232L4408
$$ 748165894 748212128 748237381 748241806 748230438 748212662 748198242 748195343 748207626 748233337 748268127 748305359 748339767
2066G48339767K8763K2888J7548J3733R918O638M654M730Q011J3428K0217K7008L2197
$$ 748339767 748368530 748391418 748408966 748422699 748432617 748439255 748443909 748448639 748456650 748470078 748490295 748517303 748549500
2079G48549500L6087L7307L5858L1815K5482J8158J0986M883K29j678%N645J5107K6168
$$ 748549500 748585587 748622894 748658752 748690567 748716049 748734207 748745193 748750076 748750305 748748627 748748627 748754272 748769379 748795547
2093G48795547L6774M3106M3946L8375K8000J4572J450p553q850k442J1063K7771M3411
$$ 748795547 748832321 748875427 748919373 748957748 748985748 749000320 749001770 748994217 748985367 748982925 748993988 749021759 749065170
2106G49065170N4474N7907N2796L9367K0142P6j5793k3346j9302m501J7700M1962O2027
$$ 749065170 749119644 749177551 749230347 749269714 749289856 749289932 749274139 749250793 749231491 749226990 749244690 749286652 749348679
2119G49348679P2708P0038N3939K8687o10k5483l9901m0512k5940J52L1586O0654P9422
$$ 749348679 749421387 749491425 749545364 749574051 749573441 749547958 749508057 749467545 749441605 749441757 749473343 749533997 749613419
2132G49613419Q2244O8818M2266R690k0142l9673m3716l0823m196K9373O0730Q1940
$$ 749613419 749695663 749764481 749806747 749816437 749796295 749756622 749712906 749682083 749677887 749707260 749767990 749849930
2144G49849930Q7127P5303M9820J6632j5259l8223m5777l5782j0604K2354N4168P5684
$$ 749849930 749937057 750012360 750062180 750078812 750063553 750025330 749979553 749943771 749933167 749955521 750009689 750085373
2156G50085373Q1482P0038M4326J1521k0523m3183n0735m1580j7700J3656M4708O7139
$$ 750085373 750166855 750236893 750281219 750292740 750272217 750229034 750178299 750136719 750119019 750132675 750177383 750244522
2168G50244522P5379O7291M4861J3580j7929m1351n0507m2725k0446J0604M2420O5689
$$ 750244522 750319901 750387192 750432053 750445633 750427704 750386353 750335846 750293121 750272675 750283279 750325699 750391388
2180G50391388P4234O4926M0207O943k5864m9209n6992m7684k3880Q774M1580O6452
$$ 750391388 750465622 750530548 750570755 750577698 750551834 750502625 750445633 750397949 750374069 750382843 750424423 750490875
2192G50490875P5913O6757M0970N035l1967n9128p0114o0959l3798L891M2496P0419
$$ 750490875 750566788 750633545 750674515 750679550 750647583 750588455 750518341 750457382 750423584 750427475 750469971 750540390
2204G50540390Q0948P0801M2724M120l5171o5689p8965p1640m4937n188L6774O9733
$$ 750540390 750621338 750692139 750734863 750738983 750703812 750638123 750559158 750487518 750442581 750437393 750474167 750543900
2216G50543900Q4610P6980M8599O714l8147p4157r2240q7280o1417k2049K0447N4703
$$ 750543900 750628510 750705490 750754089 750760803 750722656 750648499 750556259 750468979 750407562 750385513 750405960 750460663
2228G50460663P1945O7215M0283j755m8828q7967j07727j02768p3547k8229K2126O4620
$$ 750460663 750532608 750599823 750640106 750638351 750589523 750501556 750393829 750291061 750217514 750189285 750211411 750276031
2240G50276031Q9570R0179O6681K4338k6398p2479j03226j11084r4986n8365j0605
$$ 750276031 750365601 750455780 750522461 750546799 750520401 750447922 750344696 750233612 750138626 750080261 750069656
2251G50069656L6316O9428P9574O2943K4109k6703p6065j10932j22985j09101p2098
$$ 750069656 750105972 750175400 750254974 750317917 750342026 750315323 750239258 750128326 750005341 749896240 749824142
2262G49824142k2125K8610O6071Q0643O8969L4028j4115o3553j01776j18637j08719
$$ 749824142 749802017 749830627 749896698 749977341 750046310 750080338 750066223 750002670 749900894 749782257 749673538
2273G49673538p3929k0980L5934Q2169J05285R6588N7831l052p0419j27792j62964
$$ 749673538 749599609 749578629 749614563 749696732 749802017 749898605 749956436 749953384 749882965 749755173 749592209
2284G49592209j71280j56937j29623r8114o8970m6997l6011m0588o0425q8425j11694
$$ 749592209 749420929 749263992 749134369 749036255 748967285 748920288 748884277 748843689 748783264 748694839 748583145
2295G48583145j14975q9950m0512J9607P1945J03150J06964Q8959O2026M1123L8376
$$ 748583145 748468170 748378220 748337708 748357315 748429260 748532410 748639374 748728333 748790359 748831482 748869858
2306G48869858N8517R4147J32446J59836J70288J68915J65710J68305J74179J69296
$$ 748869858 748928375 749022522 749154968 749314804 749485092 749654007 749819717 749988022 750162201 750331497
2316G50331497J33667N1651p8964k37198l84140m70734m58602l41340j53045L9367
$$ 750331497 750465164 750516815 750437851 750200653 749816513 749345779 748887177 748545837 748392792 748432159
2326G48432159J62583J70975O6146j02996k65809l67050l91082l68500l54614l87879
$$ 748432159 748594742 748765717 748831863 748728867 748463058 748096008 747704926 747336426 746981812 746593933
2336G46593933m61426n18951m87137l30048q6288J41296K46888J95236N8517k2964
$$ 746593933 746132507 745613556 745126419 744796371 744710083 744851379 745098267 745293503 745352020 745329056
2346G45329056O5918L27377O35300Q06808P15103L69721r3384m95300p14951p37762
$$ 745329056 745394974 745722351 746357651 747164459 747879562 748249283 748155899 747660599 746945648 746207886
2356G46207886o32477m86908l54538k42233j36566l2578N8975J23291J58005J74789
$$ 746207886 745575409 745088501 744733963 744491730 744355164 744322586 744381561 744504852 744662857 744837646
2366G44837646J86844J97373J96152J71661J18484M3259l9902j13601j61133j66779
$$ 744837646 745024490 745221863 745418015 745589676 745708160 745751419 745711517 745597916 745436783 745270004
2376G45270004j20849k3575J09939K52304L74909M55322M85840M70047M18549L44925
$$ 745270004 745149155 745125580 745235519 745487823 745862732 746318054 746803894 747273941 747692490 748037415
2386G48037415K62298J83029J18103P3166M8142L9215L8910M1656M2801L8147K6474
$$ 748037415 748299713 748482742 748600845 748674011 748722153 748761368 748800278 748841934 748884735 748922882 748949356
2397G48949356P095j7013m0207n6534o1874n4398l6163j0300J6556L7842M7073M0817
$$ 748949356 748956451 748939438 748899231 748842697 748780823 748726425 748690262 748679962 748696518 748734360 748781433 748822250
2409G48822250J9989r994m1199o5613p7819p5303n7449k7924P096L8681N7068N6457
$$ 748822250 748842239 748832245 748791046 748725433 748647614 748572311 748514862 748486938 748494034 748532715 748589783 748646240
2421G48646240L6164J754l7384p0877q9645q8654o8664l4104N646M0512O2027O4774
$$ 748646240 748682404 748684158 748646774 748575897 748486252 748397598 748328934 748294830 748300476 748340988 748403015 748467789
2433G48467789M8370J6708k3193o2485r0866j00937q9264n8136j6403K4948N4551O5383
$$ 748467789 748516159 748532867 748509674 748447189 748356323 748255386 748166122 748107986 748091583 748116531 748171082 748236465
2445G48236465N5008K6322j2589n2795q4076r8343r2010o7826l1204P477L8833N4703
$$ 748236465 748291473 748317795 748305206 748252411 748168335 748069992 747977982 747910156 747878952 747886429 747925262 747979965
2457G47979965N0965K8152q697m9820q4763j04904j04981q5449n1651j2054K2888M4632
$$ 747979965 748030930 748059082 748050385 748000565 747915802 747810898 747705917 747620468 747568817 747556763 747579651 747624283
2469G47624283M7226L0288j907m1046p7667j01929j08871r6207o6681k7618J1749M0512
$$ 747624283 747671509 747701797 747699890 747658844 747581177 747479248 747370377 747274170 747207489 747179871 747191620 747232132
2481G47232132N1422M1809J4877k1591n7678q4457r4605q6288o1417k6474Q926L5630
$$ 747232132 747283554 747325363 747340240 747318649 747260971 747176514 747081909 746995621 746934204 746907730 746916656 746952286
2493G46952286M7073M0360J8844j1825m3259o7062p7134p0953m9744j9989J1216L5781
$$ 746952286 746999359 747039719 747058563 747046738 747003479 746936417 746859283 746788330 746738586 746718597 746729813 746765594
2505G46765594M8218M6158L0136M578k4338m9591o3934o4240n0506k6856P6K2736L5706
$$ 746765594 746813812 746859970 746890106 746894684 746870346 746820755 746756821 746692581 746642075 746615219 746615295 746638031 746673737
2518G46673737L5400K1744j602k8458n1041o4544o4927n3405l3875j1825O332J6251
$$ 746673737 746709137 746730881 746729279 746700821 746649780 746585236 746520309 746466904 746433029 746421204 746427536 746443787
2530G46443787J5030L051j6403l7918n5313o4392o3248n2643l5629j7471k671M349
$$ 746443787 746458817 746461868 746445465 746407547 746352234 746287842 746224594 746171951 746136322 746118851 746116180 746120529
2542G46120529J297j0834k8534m7607o2485o9503o6910n5390l7765j8768m120J907
$$ 746120529 746121826 746110992 746082458 746034851 745972366 745902863 745835953 745780563 745742798 745724030 745719910 745721817
2554G45721817k213j5258l3112n1193o4697p0954o8130n7144m0589k3575j0070m120
$$ 745721817 745719604 745704346 745671234 745620041 745555344 745484390 745416260 745359116 745318527 745294952 745284882 745280762
2566G45280762o485j6709l1128m6234n7525o1646n6610m3259k5787p782M807R002M654
$$ 745280762 745274277 745257568 745226440 745180206 745122681 745061035 745004425 744961166 744935379 744927597 744932404 744941406 744946060
2579G44946060p095k3270l9291n1422n5619n0964l8910k1591n417O714J0910O485m807
$$ 744946060 744938965 744915695 744876404 744824982 744769363 744718399 744679489 744657898 744652481 744659195 744670105 744676590 744671783
2592G44671783j9989l5324m5318m7989m2420k9831j2969K975J4496J8310J2970L82
$$ 744671783 744651794 744616470 744571152 744523163 744480743 744450912 744437943 744440918 744455414 744473724 744486694 744487076
2604G44487076j6022l0975m0360m1885l5553k3422q316N951J6021J9913J6632P172
$$ 744487076 744471054 744440079 744399719 744357834 744322281 744298859 744290543 744296494 744312515 744332428 744349060 744356232
2616G44356232n875j9302k9908l5476l3951k5559j1978L434J5792K0829J7929Q239
$$ 744356232 744350357 744331055 744301147 744265671 744231720 744206161 744194183 744197617 744213409 744234238 744252167 744260406
2628G44260406n111j8616k8686l3341l1586k3269j0147M577J6709K3346K2964J6251
$$ 744260406 744255295 744236679 744207993 744174652 744143066 744119797 744109650 744114227 744130936 744154282 744177246 744193497
2640G44193497N035p400j7853k3575Tj7319o866M959J5030K1057K1362J5183M349r156
$$ 744193497 744198532 744191132 744173279 744149704 744126129 744108810 744101944 744106903 744121933 744142990 744164352 744179535 744183884 744174728
2654G44174728k1667k9373l0518k5024j4572k594Q087J5182J7700J4344O027o409j9073
$$ 744174728 744153061 744123688 744093170 744068146 744053574 744050980 744059067 744074249 744091949 744106293 744112320 744105911 744086838
2667G44086838k8610l2731l0212k3270j3656n265l05Tm578j1825j9226k4567k6626
$$ 744086838 744058228 744025497 743995285 743972015 743958359 743953094 743952789 743952484 743947906 743936081 743916855 743892288 743865662
2680G43865662k6093k3346j9684j5716j1673q316o562o561q621j2207j6480k0980k5254
$$ 743865662 743839569 743816223 743796539 743780823 743769150 743760834 743754272 743747711 743739090 743726883 743710403 743689423 743664169
2693G43664169k9068l1509l2654l2120l0975k8839k7084k5559k4795k5254k6474k8229
$$ 743664169 743635101 743603592 743570938 743538818 743507843 743479004 743451920 743426361 743401566 743376312 743349838 743321609
2705G43321609l0364l2807l5400l9215m3335m7760n0049m9362m5853l9673l4103k9679
$$ 743321609 743291245 743258438 743223038 743183823 743140488 743092728 743042679 742993317 742947464 742907791 742873688 742844009
2717G42844009k8839l2501m0283n0430o0654o7444o9504o6070n7755m6158l4027k3956
$$ 742844009 742815170 742782669 742742386 742691956 742631302 742563858 742494354 742428284 742370529 742324371 742290344 742266388
2729G42266388j8921k0447k8991m2725n7831p1182p8888q0109p3089n9586m2343k5406
$$ 742266388 742247467 742227020 742198029 742155304 742097473 742026291 741947403 741867294 741794205 741734619 741692276 741666870
2741G41666870j3046q850j3352k4948m0054n3482o2256o2790n4855m0665k2507n645
$$ 741666870 741653824 741644974 741631622 741606674 741566620 741513138 741450882 741388092 741333237 741292572 741270065 741264420
2753G41264420O332J1826R384R15j2665k7923m1886n1498n3940m8981l8070k3651r232
$$ 741264420 741270752 741282578 741291962 741292877 741280212 741252289 741210403 741158905 741104965 741055984 741017914 740994263 740985031
2766G40985031J831O256J679j1902l2044n2337o7291p1106o3019m5471k4109m502R308
$$ 740985031 740986862 740993118 740994797 740982895 740950851 740898514 740831223 740760117 740697098 740651627 740627518 740623016 740632324
2779G40632324J4343J0911j53j6632l4790n2338o5155p0038o5536n0812k9526p171
$$ 740632324 740646667 740657578 740657425 740640793 740606003 740553665 740488510 740418472 740352936 740302124 740272598 740265427
2791G40265427R918J6861J2054j449j8616l4180m4479m7760m3717l5324k5100j6327
$$ 740265427 740275345 740292206 740304260 740302811 740284195 740250015 740205536 740157776 740114059 740078735 740053635 740037308
2803G40037308j1292j2131j8310k9068m2267n5008o4697o9122o7978o2485n4627m7378
$$ 740037308 740026016 740013885 739995575 739966507 739924240 739869232 739804535 739735413 739667435 739604950 739550323 739502945
2815G39502945m1351l7613l7155m0513m7836n8365o9351p7591q1711q1405p8583p5226
$$ 739502945 739461594 739423981 739386826 739346313 739298477 739240112 739170761 739093170 739011459 738930054 738851471 738776245
2827G38776245p3471p4081p6905q2092q8501r5444j02768j09024j13983j17416j17264
$$ 738776245 738702774 738628693 738551788 738469696 738381195 738285751 738182983 738073959 737959976 737842560 737725296
2838G37725296j13678j07880j02996j02387j07880j18637j30386j38855j42288j40534
$$ 737725296 737611618 737503738 737400742 737298355 737190475 737071838 736941452 736802597 736660309 736519775
2848G36519775j36337j32904j31683j32828j35040j36948j37482j37252j37024j38474
$$ 736519775 736383438 736250534 736118851 735986023 735850983 735714035 735576553 735439301 735302277 735163803
2858G35163803j41907j47552j54724j62812j72271j81961j91117j98745k04468k09427
$$ 735163803 735021896 734874344 734719620 734556808 734384537 734202576 734011459 733812714 733608246 733398819
2868G33398819k16064k25831k38800k53372k68860k86789l09372l39431l76664m17251
$$ 733398819 733182755 732956924 732718124 732464752 732195892 731909103 731599731 731260300 730883636 730466385
2878G30466385m54712m84085n01557n07888n04685m95682m84390m73175m62799m52118
$$ 730466385 730011673 729527588 729026031 728518143 728013458 727517776 727033386 726560211 726097412 725645294
2888G25645294m40674m26635m09546l88489l63617l34396l02124k69928k44217k30027
$$ 725645294 725204620 724777985 724368439 723979950 723616333 723281937 722979813 722709885 722465668 722235641
2898G22235641k31628k47879k73972l01895l24402l37371l39585l33786l24020l15933
$$ 722235641 722004013 721756134 721482162 721180267 720855865 720518494 720178909 719845123 719521103 719205170
2908G19205170l12424l15781l26385l42255l61938l82004l98789m09927m15039m16489
$$ 719205170 718892746 718576965 718250580 717908325 717546387 717164383 716765594 716355667 715940628 715524139
2918G15524139m18853m26560m42581m66843m97970n32532n67856n98221o19354o24847
$$ 715524139 715105286 714678726 714236145 713769302 713271332 712738800 712170944 711572723 710953369 710328522
2928G10328522o12564n84641n48324n14298m92325m89883n08499n46112n96772o53991
$$ 710328522 709715958 709131317 708582993 708068695 707576370 707086487 706577988 706031876 705435104 704781113
2938G04781113p11365p63855q08258q41904q63113q70362q66012q53424q36868q20847
$$ 704781113 704069748 703305893 702497635 701655731 700792618 699922256 699056244 698202820 697365952 696545105
2948F96545105q05740p87201p59201p14264o47888n60532m56314l43094k29416j21612
$$ 696545105 695739365 694952164 694192963 693478699 692830811 692270279 691813965 691470871 691241455 691119843
2958F91119843k4186O3706J41678K11029K70920L20510L57743L83148L95431L93143
$$ 691119843 691095657 691159363 691301041 691512070 691782990 692103500 692461243 692844391 693239822 693632965
2968F93632965L73001L31268K67334J82801Q3847k2888j30082k30865l19443l89557
$$ 693632965 694005966 694337234 694604568 694787369 694871216 694848328 694718246 694487381 694167938 693778381
2978F93778381m36477m58832m58374m40369m11300l78724l45153l12577k78244k37579
$$ 693778381 693341904 692883072 692424698 691984329 691573029 691194305 690849152 690536575 690258331 690020752
2988F90020752j86920j23215m7913L5325J19476J97601K64740L18756L60489L94058
$$ 690020752 689833832 689710617 689662704 689698029 689817505 690015106 690279846 690598602 690959091 691353149
2998F91353149M22974M50134M77448N04684N32608N59845N84259O00739O04324N93109
$$ 691353149 691776123 692226257 692703705 693208389 693740997 694300842 694885101 695485840 696090164 696683273
3008F96683273N69840N42984N22537N14298N19332N33753N52368N71289N88608O02569
$$ 696683273 697253113 697796097 698318634 698832932 699352264 699886017 700438385 701009674 701598282 702200851
3018G02200851O10123O07987N94787N73425N49088N29327N18113N15289N16891N16739
$$ 702200851 702810974 703418961 704013748 704587173 705136261 705665588 706183701 706698990 707215881 707732620
3028G07732620N10254M96216M76456M55856M37927M24118M12369L98788L81394L60489
$$ 707732620 708242874 708739090 709215546 709671402 710109329 710533447 710945816 711344604 711725998 712086487
3038G12086487L39279L24249L17459L20435L28598L35464L32261L15628K84958K48336
$$ 712086487 712425766 712750015 713067474 713387909 713716507 714051971 714384232 714699860 714984818 715233154
3048G15233154K15607J95389J90429J97525K08893K17133K18353K12174J99813J81962
$$ 715233154 715448761 715644150 715834579 716032104 716240997 716458130 716676483 716888657 717088470 717270432
3058G17270432J58996J31073J00937P2708N1575M1351M4708N9739Q1481J02540J15890
$$ 717270432 717429428 717560501 717661438 717734146 717785721 717827072 717871780 717931519 718013000 718115540 718231430
3069G18231430J15585J00022P1335L4561l586l5172n4092n5771m0665j5258J0910K8763
$$ 718231430 718347015 718447037 718518372 718552933 718549347 718514175 718460083 718404312 718363647 718348389 718359299 718388062
3081G18388062L3187K4796Q697r079k3193l1662l1814k3423p934J0528K4948K7543
$$ 718388062 718421249 718446045 718454742 718445663 718422470 718390808 718358994 718335571 718327637 718338165 718363113 718390656
3093G18390656J3961j6250n6153r6283j25122j34506j23901r8877o9962m9972m5166
$$ 718390656 718404617 718388367 718332214 718235931 718110809 717976303 717852402 717753525 717683563 717633591 717588425
3104G17588425n5847p4540r1095r9411r8571r3461r1552r7275j09253j21536j26419
$$ 717588425 717532578 717458038 717366943 717267532 717168961 717075500 716983948 716886673 716777420 716655884 716529465
3115G16529465j19400j01471p7133n3025l3111j9303j2130j2131k0905l8299o0501
$$ 716529465 716410065 716308594 716231461 716178436 716145325 716126022 716113892 716101761 716080856 716042557 715982056
3126G15982056q1940r5520r8877r2621q3008p6751p9728r3841j17951j45034j65787
$$ 715982056 715900116 715804596 715705719 715613098 715530090 715453339 715373611 715279770 715161819 715016785 714850998
3137G14850998j72730j61056j35803j06354q3389p4158p8812r4223j15356j39389j65024
$$ 714850998 714678268 714517212 714381409 714275055 714191666 714117508 714038696 713944473 713829117 713689728 713524704
3148G13524704j89285k06986k13012k03324j79367j47858j18331r8572r2774r9563
$$ 713524704 713335419 713128433 712915421 712712097 712532730 712384872 712266541 712167969 712075195 711975632
3158G11975632j14823j32675j49841j64871j77155j86691j92490j93405j90124j83869
$$ 711975632 711860809 711728134 711578293 711413422 711236267 711049576 710857086 710663681 710473557 710289688
3168G10289688j78070j75247j75400j79138j85700j95007k07443k21024k32086k38113
$$ 710289688 710111618 709936371 709760971 709581833 709396133 709201126 708993683 708772659 708540573 708302460
3178G08302460k36664k28882k17667k06527j99433j98059k03476k14767k29187k42920
$$ 708302460 708065796 707836914 707619247 707412720 707213287 707015228 706811752 706596985 706367798 706124878
3188G06124878k52533k56195k53830k47498k39029k30407k23847k21862k25602k35901
$$ 706124878 705872345 705616150 705362320 705114822 704875793 704645386 704421539 704199677 703974075 703738174
3198G03738174k50244k65274k77939k85797k87933k84271k74811k61078k46735k35977
$$ 703738174 703487930 703222656 702944717 702658920 702370987 702086716 701811905 701550827 701304092 701068115
3208G01068115k32544k38037k50854k67105k82822k94418k99912k98538k90299k76870
$$ 701068115 700835571 700597534 700346680 700079575 699796753 699502335 699202423 698903885 698613586 698336716
3218F98336716k60163k43301k31171k25982k30713k43607k61307k79769k94877l06549
$$ 698336716 698076553 697833252 697602081 697376099 697145386 696901779 696640472 696360703 696065826 695759277
3228F95759277l14788l19443l18451l07236k84347k54288k24991k07367k06070k18963
$$ 695759277 695444489 695125046 694806595 694499359 694215012 693960724 693735733 693528366 693322296 693103333
3238F93103333k38495k55814k66418k70234k69851k66419k59781k48336k32773k15912
$$ 693103333 692864838 692609024 692342606 692072372 691802521 691536102 691276321 691027985 690795212 690579300
3248F90579300k03781k02103k12326k31476k50396k59095k51846k29340k00119j75476
$$ 690579300 690375519 690173416 689961090 689729614 689479218 689220123 688968277 688738937 688538818 688363342
3258F88363342j64337j69449j85470k05689k23312k36130k44522k51160k57110k61612
$$ 688363342 688199005 688029556 687844086 687638397 687415085 687178955 686934433 686683273 686426163 686164551
3268F86164551k61612k55203k41318k22626k03476j89056j81351j79443j80207j81198
$$ 686164551 685902939 685647736 685406418 685183792 684980316 684791260 684609909 684430466 684250259 684069061
3278F84069061j81656j82800j86005j91574j98364k06222k16599k30789k50549k73667
$$ 684069061 683887405 683704605 683518600 683327026 683128662 682922440 682705841 682475052 682224503 681950836
3288F81950836k96402l13263l19748l15246k99530k77329k53525k33840k23389k25144
$$ 681950836 681654434 681341171 681021423 680706177 680406647 680129318 679875793 679641953 679418564 679193420
3298F79193420k40402k67792l03955l42102l74908l94287l94821l77655l47977l15094
$$ 679193420 678953018 678685226 678381271 678039169 677664261 677269974 676875153 676497498 676149521 675834427
3308F75834427k86865k68937k63748k70157k85339l05939l27682l46680l61862l74374
$$ 675834427 675547562 675278625 675014877 674744720 674459381 674153442 673825760 673479080 673117218 672742844
3318F72742844l87802m05808m28543m53262m73328m82864m77524m59442m35181m13895
$$ 672742844 672355042 671949234 671520691 671067429 670594101 670111237 669633713 669174271 668739090 668325195
3328F68325195m04968m11911m33502m64707m99038n30930n55267n67703n65491n48782
$$ 668325195 667920227 667508316 667074814 666610107 666111069 665580139 665024872 664457169 663891678 663342896
3338F63342896n23530m98428m80728m73557m74929m82865m96597n17807n45349n72815
$$ 663342896 662819366 662320938 661840210 661366653 660891724 660408859 659912262 659394455 658849106 658276291
3348F58276291n89295n85022n60302n24826m94385m83399m96063n28946n69229o04095
$$ 658276291 657686996 657101974 656541672 656016846 655522461 655039062 654542999 654014053 653444824 652840729
3358F52840729o24161o24847o10810n91583n78079n77774n88990o03637o09665n99823
$$ 652840729 652216568 651591721 650980911 650389328 649811249 649233475 648644485 648040848 647431183 646831360
3368F46831360n73731n38864n05371m82025m72641m75464m84466m92936m96292m94156
$$ 646831360 646257629 645718765 645213394 644731369 644258728 643783264 643298798 642805862 642309570 641815414
3378F41815414m89883m87061m86755m86984m85916m82407m79813m82177m91219n03921
$$ 641815414 641325531 640838470 640351715 639864731 639378815 638896408 638416595 637934418 637443199 636939278
3388F36939278n13573n13344m99649m74358m44946m21486m11567m18091m35944m52919
$$ 636939278 636425705 635912361 635412712 634938354 634493408 634071922 633660355 633242264 632806320 632353401
3398F32353401m55856m36592l98636l53432l17116l01399l08571l33442l64609l91083
$$ 632353401 631897545 631460953 631062317 630708885 630391769 630090370 629781799 629448357 629083748 628692665
3408F28692665m04930m02794l86009l60642l33404l11432k99149k96745l01514l08494
$$ 628692665 628287735 627884941 627498932 627138290 626804886 626493454 626194305 625897560 625596046 625287552
3418F25287552l11699l08495k97622k83051k69546k60544k56272k53143k46162k34566
$$ 625287552 624975853 624667358 624369736 624086685 623817139 623556595 623300323 623047180 622801018 622566452
3428F22566452k19765k06794j98288j94474j92566j89018j80435j65024j41220j11236
$$ 622566452 622346687 622139893 621941605 621747131 621554565 621365547 621185112 621020088 620878868 620767632
3438F20767632q0224n5275m2533m2267m7684m8752l7079j2512J8501M6425O4583P2365
$$ 620767632 620687408 620632133 620589600 620547333 620499649 620450897 620413818 620401306 620419807 620466232 620530815 620603180
3450F20603180P3891P4882P8774Q4877Q9340Q9187Q4343P9613Q1940R5253J17950J41716
$$ 620603180 620677071 620751953 620830727 620915604 621004944 621094131 621178474 621258087 621340027 621435280 621553230 621694946
3462F21694946J58005J63345J61095J59035J62887J72119J82686J90277J93940J96228
$$ 621694946 621852951 622016296 622177391 622336426 622499313 622671432 622854118 623044395 623238335 623434563
3472F23434563J98898K00081J96991J88217J75972J69907J75552J95084K21672K44484
$$ 623434563 623633461 623833542 624030533 624218750 624394722 624564629 624740181 624935265 625156937 625401421
3482F25401421K54097K47039K30866K16789K13661K23961K39296K48375K44675K29912
$$ 625401421 625655518 625902557 626133423 626350212 626563873 626787834 627027130 627275505 627520180 627750092
3492F27750092K13623K05116K05803K08015K02790J86271J65940J54953J65100J98173
$$ 627750092 627963715 628168831 628374634 628582649 628785439 628971710 629137650 629292603 629457703 629655876
3502F29655876K43378K85606L10631L14369L02277K84042K68822K59247K51846K42462
$$ 629655876 629899254 630184860 630495491 630809860 631112137 631396179 631665001 631924248 632176094 632418556
3512F32418556K31018K20833K17095K19535K23732K21634K08779J87492J65291J50223
$$ 632418556 632649574 632870407 633087502 633307037 633530769 633752403 633961182 634148674 634313965 634464188
3522F34464188J48086J61400J89171K29835K77291L21350L48778L50494L25546K83547
$$ 634464188 634612274 634773674 634962845 635192680 635469971 635791321 636140099 636490593 636816139 637099686
3532F37099686K39906K08397J95312J99089K10991K19460K15835J97030J69906J48354
$$ 637099686 637339592 637547989 637743301 637942390 638153381 638372841 638588676 638785706 638955612 639103966
3542F39103966J46751J73035K21176K75841L20396L45841L55453L59116L65066L75519
$$ 639103966 639250717 639423752 639644928 639920769 640241165 640587006 640942459 641301575 641666641 642042160
3552F42042160L85208L85971L72620L44314L05558K63595K25830J98441J86005J91192
$$ 642042160 642427368 642813339 643185959 643530273 643835831 644099426 644325256 644523697 644709702 644900894
3562F44900894K15836K59933L21274L91998M60968N17578N54200N70678N70526N59464
$$ 644900894 645116730 645376663 645697937 646089935 646550903 647068481 647622681 648193359 648763885 649323349
3572F49323349N41763N19181M94690M71038M50287M29688M04129L67050L18985K70462
$$ 649323349 649865112 650384293 650878983 651350021 651800308 652229996 652634125 653001175 653320160 653590622
3582F53590622K40784K50702L08685M04739N09720N87616O14700N92423N45883N07813
$$ 653590622 653831406 654082108 654390793 654795532 655305252 655892868 656507568 657099991 657645874 658153687
3592F58153687M97512N10254N26047N28412N18570N12466N23453N49850N74036N79376
$$ 658153687 658651199 659161453 659687500 660215912 660734482 661246948 661770401 662320251 662894287 663473663
3602F63473663N63736N40695N25055N20096N13306M92782M56696M18778L96804L96347
$$ 663473663 664037399 664578094 665103149 665623245 666136551 666629333 667086029 667504807 667901611 668297958
3612F68297958M12217M30755M45938M64707M98428N53055O17142O63909O63605O00968
$$ 668297958 668710175 669140930 669586868 670051575 670550003 671103058 671720200 672384109 673047714 673648682
3622F73648682M91333L77197L12576L32566M31976N66177O78940P35016P37762P18155
$$ 673648682 674140015 674517212 674829788 675162354 675594330 676160507 676839447 677574463 678312225 679030380
3632F79030380P05948P07550P09839O97708O69480O35299N98297N46723M64172L50266
$$ 679030380 679736328 680443878 681153717 681851425 682520905 683156204 683754501 684301224 684765396 685115662
3642F85115662K32238J51596J36338J85013K69393L61481M50211N41305O41251P39975
$$ 685115662 685347900 685499496 685635834 685820847 686090240 686451721 686901932 687443237 688084488 688824463
3652F88824463Q13446Q37326Q02307P23267O29120N52597N15899N19638N42298N45273
$$ 688824463 689637909 690475235 691277542 692000809 692629929 693182526 693698425 694218063 694760361 695305634
3662F95305634M96139L91464K63977J68305J43738J86920K54822K95333K86179K48184
$$ 695305634 695801773 696193237 696457214 696625519 696769257 696956177 697210999 697506332 697792511 698040695
3672F98040695K24457K46887L14484M00467M78668N37796N78690N97534N75256M92020
$$ 698040695 698265152 698512039 698826523 699226990 699705658 700243454 700822144 701419678 701994934 702486954
3682G02486954L50113J85089N5084O027M6997J46790K57797L43857L99017M35028M64173
$$ 702486954 702837067 703022156 703077240 703083267 703130264 703277054 703534851 703878708 704277725 704712753 705176926
3693G05176926M81872M72183M25187L49350K71835K19345K00958K00882J94321J67236
$$ 705176926 705658798 706130981 706556168 706905518 707177353 707396698 707597656 707798538 707992859 708160095
3703G08160095J28250J01014J01776J23291J35803J10779M4937l1738p2098m3946M8752
$$ 708160095 708288345 708389359 708491135 708614426 708750229 708861008 708905945 708874207 708802109 708758163 708806915
3714G08806915J67465K60392K93350K62070J90353J08109L9367q087l8071o0272q3008
$$ 708806915 708974380 709234772 709528122 709790192 709980545 710088654 710128021 710119934 710081863 710021591 709938583
3725G09938583j07803j25198j19019p7972j1826M5014M8828k2965j44958k52457k74734
$$ 709938583 709830780 709705582 709586563 709508591 709496765 709541779 709590607 709567642 709422684 709170227 708895493
3736G08895493j86539k2125J43203K42005K54287K05994J40762Q9188N5237L0060R079
$$ 708895493 708708954 708686829 708830032 709072037 709326324 709532318 709673080 709762268 709817505 709847565 709856644
3747G09856644o790j2818r537M273L7536J02005J96915K94800L53851L42407K66724
$$ 709856644 709849854 709837036 709827499 709831772 709869308 709971313 710168228 710463028 710816879 711159286 711426010
3758G11426010J67465R3232O7596P8430R5596R6207P6370M5777J2893j6555l5935l4408
$$ 711426010 711593475 711686707 711754303 711832733 711928329 712024536 712100906 712146683 712159576 712143021 712107086 712072678
3770G12072678n036M3717Q8882J04828Q3847M0131k365k7848l3417k4719n340K2659
$$ 712072678 712067642 712111359 712200241 712305069 712388916 712429047 712426682 712398834 712365417 712340698 712335358 712358017
3782G12358017N3177P3166P2098N1879K8534J7624J9608J9913K441l3188p3547j05133
$$ 712358017 712411194 712484360 712556458 712608337 712636871 712654495 712674103 712694016 712696457 712663269 712589722 712484589
3794G12484589j28022j50985j76545j89132j68228j07651k9984K8916M7760L5324K3727
$$ 712484589 712356567 712205582 712029037 711839905 711671677 711564026 711534042 711562958 711610718 711646042 711669769
3805G11669769L7689P2709J01852R6207N1422j1368o1798q2474p9880p6675r1553j24283
$$ 711669769 711707458 711780167 711882019 711978226 712029648 712018280 711956482 711874008 711794128 711717453 711625900 711501617
3817G11501617j56250j60827j23139n0888L1510R6969J35956J52969J56861J46866
$$ 711501617 711345367 711184540 711061401 711010513 711042023 711138992 711274948 711427917 711584778 711731644
3827G11731644J11694M4403m3716j26267j78451j94092j84174j60827j25504p4921
$$ 711731644 711843338 711887741 711844025 711717758 711539307 711345215 711161041 711000214 710874710 710799789
3837G10799789j6708K7924M1427L1891L1586O6070J18714J32904N7297j03684k79846
$$ 710799789 710783081 710811005 710852432 710884323 710915909 710981979 711100693 711233597 711290894 711187210 710907364
3848G10907364l81012l65219k64588j50451p3242k6551L1052J26114K37503L14483
$$ 710907364 710526352 710161133 709896545 709746094 709672852 709646301 709677353 709803467 710040970 710355453
3858G10355453L17383K47040J39694L7918l3416o7368o9809n1880k9220k0295l1509
$$ 710355453 710672836 710919876 711059570 711097488 711064072 710996704 710926895 710875015 710845795 710825500 710793991
3869G10793991n3100o2256m1199M501N3253Q3237R0103Q2779O9733M7836R766m3640
$$ 710793991 710740891 710678635 710637436 710641937 710695190 710778427 710868530 710951309 711021042 711068878 711078644 711035004
3881G11035004r8648j34888j42517j24283r0408m9134o485L0747N3100N4322L7460
$$ 711035004 710936356 710801468 710658951 710534668 710444260 710395126 710388641 710419388 710472488 710526810 710564270
3892G10564270J2741q774k1057k2659j6174j1292k6550q0948j71127k57721k81449
$$ 710564270 710577011 710568237 710547180 710524521 710508347 710497055 710470505 710389557 710218430 709960709 709679260
3903G09679260k04239m5776J21689K25677K42768K07977J72272J52740J26801O5231
$$ 709679260 709475021 709429245 709550934 709776611 710019379 710227356 710399628 710552368 710679169 710744400
3913G10744400k5482j08261j49994j54724j51367j56632j55411j23672o4774j4038
$$ 710744400 710718918 710610657 710460663 710305939 710154572 709997940 709842529 709718857 709654083 709640045
3923G09640045k518j9836k3117J2588N9891O0806j1215j15661j79139j62429r4147
$$ 709640045 709637527 709617691 709594574 709607162 709667053 709727859 709716644 709600983 709421844 709259415 709165268
3934G09165268l3798j0376l433J5335L5781J6633n5619j35116j54343j00632l8528
$$ 709165268 709131470 709121094 709117661 709132996 709168777 709185410 709129791 708994675 708840332 708739700 708701172
3945G08701172m6082j25732j94931j70822o6223J8615M578p9804j28479q0795K289
$$ 708701172 708655090 708529358 708334427 708163605 708097382 708115997 708120575 708040771 707912292 707831497 707833786
3956G07833786O104j02768k24915k33612j24283l0365p7362k29187l17306k31858o4621
$$ 707833786 707839890 707737122 707512207 707278595 707154312 707123947 707046585 706817398 706500092 706268234 706203613
3967G06203613k2125j88904m06265m32358k26517k7313j02997m27398o66809n40161
$$ 706203613 706181488 705992584 705586319 705153961 704927444 704900131 704797134 704369736 703702927 703162766
3977G03162766j76621k6855l65525r15909j085128o41175q6898k02561j127624k014618
$$ 703162766 702986145 702959290 702593765 701677856 700592728 699951553 699864655 699662094 698534470 696519852
3987F96519852j837998o78940j8768j353836m251327o070862m421768p31965j458892
$$ 696519852 694681854 694002914 693984146 692630310 688378983 682308121 677886353 677154388 675695496
3996F75695496j4683381m3634834q1960602j15170211
$$ 675695496 661012115 617377281 535416679 420246468
4000D20246468
$$ 420246468
##END=$$ End of the data block
