##TITLE=CSV-3 $$ Begin of the data block
##JCAMP-DX=5.00 $$ ACD/SpecManager v 10.08
##SPECTROMETER/DATA SYSTEM=Alpha
##DATE=21 Oct 2014 10:25:42
##DATA TYPE=INFRARED SPECTRUM
##DATA CLASS=XYDATA
##ORIGIN=
##OWNER=
##NPOINTS=1765
##FIRSTX=399.76428223
##LASTX=3997.64306641
##MAXX=3997.64306641
##MINX=399.76428223
##MAXY=0.89169222
##MINY=0.51085007
##XFACTOR=1.0000000000
##YFACTOR=1.000000000000000e-9
##FIRSTY=0.83776331
##DELTAX=2.03961372
##XUNITS=1/CM
##YUNITS=ARBITRARY UNITS
##XYDATA=(X++(Y..Y))
399.8H37763309J411498j192927k721489j026034l067732l773272j644194l392339
416.1H22356820k863824K652824K576530K679884L837109R91642P18475J550078j130045
434.4H33369493k9623K000272o94990m94599M39465k149224o23107J545786M5062J177012
454.8H34585547J753629m88997J243711J775741p76827O25908J126588j481235Q1062
473.2H38445127K96891l013194j997650o97612j328528P95841l77357m234672j031816
491.5H26857030L026963J884937J622796k70545m421831m938006o472409p331073n90682
509.9H09367180L102362o75738k120256q20399K243519P608116P455826L306806L650725
528.3H33118141L370702P76112J836777J646042q86143N87523J045585j104414L40283
$$ y = [837763309, 839174807, 837981880, 835260391, 834234357, 831166625, 827393353, 825749159, 822356820, 819492996, 822145820, 824722350, 827402234, 831239343, 832230985, 832949460, 834499538, 833369493, 833339870, 835340142, 834645152, 834150553, 834590018, 832440794, 831817687, 833363473, 833408535, 834585547, 836339176, 835850179, 837093890, 838869631, 838092804, 838718712, 839845300, 838364065, 838445127, 838742018, 835728824, 833731174, 833033562, 831705034, 832500875, 832123518, 827888846, 826857030, 829883993, 831768930, 833391726, 833121181, 828699350, 823761344, 817288935, 809957862, 809367180, 812469542, 811793804, 809673548, 808853149, 811096668, 818704784, 826160610, 829467416, 833118141, 836488843, 837264955, 839101732, 840747774, 839861631, 840449154, 841494739, 840390325, 840730608]
546.6H40730608P55608j330555j21534m83691l341556j222253J543641Q22485J694739
565H39047492J632750n47946O85155J209915r32693J50144R48131p30276N28216J121342
585.4H43112230r81271J2219Q81612q98778K40505J365602k41876P38561J507461n51283
605.8H45184982K30908J278699n87881K98J025200o65426J85191J705349M27306J139581
626.2H49924207K089739k90931o56485K19702j703262k719939l514468m367233J029432
644.5H40010762P018805N566239L668070L848553J678645R52900J992404M12345J44184
662.9H65292907J716435K89380o50346J390398K35080j74939J379609K99811l39031
681.2H69439304J275658L34085m96150R01223R4294o71863O49631l14236j381040k02298
$$ y = [840730608, 841486216, 840155661, 840034127, 839550436, 836208880, 834986627, 836530268, 837352753, 839047492, 840680242, 840132296, 840817451, 842027366, 841094673, 841244817, 842192948, 841462672, 841990888, 843112230, 842130959, 842143178, 843024790, 842126012, 842366517, 843732119, 843490243, 844228804, 845736265, 845184982, 845415890, 846694589, 846106708, 846107006, 847132206, 846466780, 846651971, 848357320, 848784626, 849924207, 852013946, 851723015, 851066530, 851286232, 849582970, 846863031, 843348563, 838981330, 840010762, 847029567, 852595806, 856263876, 860112429, 861791074, 862743974, 864736378, 865148723, 865292907, 867009342, 867298722, 866648376, 868038774, 868273854, 868098915, 869478524, 869778335, 869439304, 870714962, 871049047, 870552897, 871454120, 871548414, 870876551, 871526182, 871211946, 869830906, 869628608]
701.6H69628608j460612l686785k591968l04818J733601K878785J398683M79817K034009
720H70109320J579702j86384J24335q60214l076255l164411k896249q54612L800214
738.3H64575446M303693J038135N8412j007438l816604n507648q005262r164214k206385
756.7H40268135O894112R437620Q463025O186068K740741J655042J375020l58999m51863
775.1H76208901j08838j752913k413153l236533q058607j3812482j3674081o647229
791.4H26505065r63628R12428O945133J5018821J4617204P253766K454162J145363
807.7H73888314j248002m083097p823110j6309380k2092998j1231482R545922J9529879
824H40176046J5350401P611513L483594L124654K727092K246558K801359J966536N98669
$$ y = [869628608, 868167996, 864481211, 861889243, 861584425, 863318026, 866196811, 867595494, 868075311, 870109320, 871689022, 871502638, 871626973, 870766759, 867690504, 864526093, 861629844, 860775232, 864575446, 868879139, 869917274, 869975686, 868968248, 865151644, 859643996, 851638734, 842474520, 840268135, 847162247, 856599867, 865062892, 871248960, 873989701, 875644743, 877019763, 876660764, 876208901, 876100063, 874347150, 871933997, 868697464, 860638857, 846826375, 833152294, 826505065, 825541437, 826453865, 833398998, 848417819, 863035023, 870288789, 872742951, 873888314, 872640312, 868557215, 860734105, 844424725, 822331727, 811100245, 820646167, 840176046, 855526447, 863137960, 866621554, 869746208, 872473300, 874719858, 877521217, 879487753, 880086422]
842.4H80086422Q70705L69906p12216m3452K37406k01643N57661N60463l89934O6638
862.8H81401956J68026o94335k50161q1539r23991m60088q0586q87155o59764n24938
883.2H77007425j687348k156138l160775n618811m396379J629174N407274M433274
899.5H71457696J967430j72496n69284j83582r40621j138866p82072j640559k157330
917.8H65840316k161503l492534m877389o339669j0031342j4502943j7311394j5319646
934.1G91803896n668938L370881K837122L216922J2948930J9601107J6279101J0258317
950.5H54647338N281270K009451Q86798k56717j355529j325011j883984k752900k198934
968.8H53051782j669288k068341k860904l601551j043617M023134M633844J372695
$$ y = [880086422, 880957127, 881327033, 880614817, 880571365, 880808771, 880607128, 881164789, 881725252, 881335318, 881401956, 881569982, 880875647, 880625486, 880543947, 879619956, 879159868, 879079282, 878192127, 877532363, 877007425, 875320077, 873163939, 870003164, 864384353, 859987974, 861617148, 867024422, 871457696, 873425126, 873252630, 872683346, 872499764, 871559143, 870420277, 869638205, 867997646, 865840316, 863678813, 860186279, 855308890, 848969221, 838937879, 824434936, 807123542, 791803896, 786134958, 789505839, 792342961, 795559883, 808508813, 828109920, 844389021, 854647338, 859928608, 861938059, 862824857, 862568140, 861212611, 859887600, 858003616, 855250716, 853051782, 851382494, 849314153, 846453249, 842851698, 841808081, 845831215, 850465059, 851837754]
985.1H51837754k04861r65178k354443l118455m799784p472098n268335J113892K263665
1003.5H31032157r40263r88305J313090K454043J075685j792312l404140m357040o075382
1021.8H18317533o785274n878389l847659K08438M722893P041395P496893O299734
1038.2H27575564L417075J327455N98610n61715j214861r56774j473129j936317j686275
1056.5H25089633k091527k160131j119912p19488o14524k5868l62218j076757r64404
1074.9H15954804j312792j924515j780927k208352l054738l094017l533423m397572
1091.2G94648468m310965m209578m323483l587663l211319l740967l852427m212796
1107.5G63199270n333424o083429p281005r681463j1823297j3500631j5319705j7013609
$$ y = [851837754, 851632893, 850667715, 848313272, 845194817, 840395033, 832922935, 827654600, 828768492, 831032157, 830091894, 829103589, 830416679, 832870722, 833946407, 832154095, 828749955, 824392915, 818317533, 811532259, 805653870, 801806211, 802014649, 806737542, 813778937, 821275830, 827575564, 830992639, 832320094, 832918704, 832356989, 831142128, 830185354, 828712225, 826775908, 825089633, 822998106, 820837975, 819718063, 818998575, 818384051, 818358183, 817995965, 816919208, 815954804, 814642012, 812717497, 810936570, 808728218, 805673480, 802579463, 799046040, 794648468, 790337503, 786127925, 781804442, 778216779, 775005460, 771264493, 767412066, 763199270, 757865846, 751782417, 744501412, 734819949, 722996652, 709496021, 694176316, 677162707]
1123.8F77162707j9074083k0253419j6143978o141245L817558R176731J2236893J7431081
1140.1F58212245K3400366K2841811J2505174j675129j3738573k3243487l0013382
1154.4F48289025l2799602l1062305k4523854j4584243l867388O855905J7040849K4088025
1170.7E89436412K5878131K1975219J2896956K246916m643083n420029J42932J0796070
1187.1F53309524K1468222K7231932K7565300K3360074J6599059J1090696P449508
1201.3G88074315L753185N98490j091957j067400J006901K651751L254414O654084
1217.7H03833783J0765075R645224M963338Q71003j785696k074182j396954l032326
1234H21789265n535245o008387m299700j94848M356742N471468M305482L673017J912356
$$ y = [677162707, 658088624, 637835205, 621691227, 615549982, 619367540, 628544271, 640781164, 658212245, 681612611, 704454422, 716959596, 715284467, 701545894, 678302407, 648289025, 615489423, 584427118, 559903264, 545319021, 541451633, 548307538, 565348387, 589436412, 615314543, 637289762, 650186718, 652433634, 647790551, 642370522, 642513454, 653309524, 674777746, 702009678, 729574978, 752935052, 769534111, 780624807, 788074315, 791827500, 792425990, 791334033, 790266633, 791273534, 793925285, 797179699, 803833783, 814598858, 824244082, 829207420, 830078423, 828292727, 826218545, 824821591, 821789265, 816254020, 810245633, 805945933, 805751085, 810107827, 815579295, 819884777, 823557794, 825470150]
1252.3H25470150j907707o536185j1701167j3980687q188486K694607J0219335J0765911
1268.6H06835771N999982p4208m294038q116901j3517022j9798517k7120173l4087300
1285G05827594l5339236k6890517r720742J0294556K4980843L0687392L0494452K7227282
1301.3G57561624K1616638J6154468J2120247Q297383N443514L862262J864910M49657
1317.6H27370703L69966m44174k255559n254209j0821223j4228999r154201m50552
1333.9G85131752L649533L144324J005232m37855k19882p54535k766252m541218o669164
1352.3G77541935r602308j2008130j4745713j9398570k5104046k8957426l0302465
1366.6F37423277k9110789k1015346o840349N380512N620420J650095R350478K3717106
$$ y = [825470150, 823562443, 817026258, 805325091, 791344404, 783155918, 785850525, 796069860, 806835771, 812835753, 812761545, 808467507, 800350606, 786833584, 767035067, 739914894, 705827594, 670488358, 643597841, 633877099, 644171655, 669152498, 699839890, 730334342, 757561624, 779178262, 795332730, 807452977, 815750360, 821193874, 825056136, 826921046, 827370703, 827740669, 827296495, 825040936, 819786727, 808965504, 794736505, 785582304, 785131752, 788781285, 791925609, 792930841, 792492986, 792273104, 791518569, 788752317, 784211099, 777541935, 767939627, 755931497, 741185784, 721787214, 696683168, 667725742, 637423277, 608312488, 587297142, 580456793, 585837305, 591457725, 593107820, 602458298, 626175404]
1382.9F26175404L1300902L1030297K2156894O700933o924688j4548600j3117254o219089
1399.2F76554799K119720J0884285K0578623K4771750J5737295O07848j924276J0077894
1415.5G59407938J9963681K0607174J2767493N300701J968086q16703m589200p155955
1431.8H07453215r012759j2463331j1382341l338754L825783Q765638R549499N931914
1448.1G99328864J658618q96692k271414j059473L720999N415023M260718L476501
1464.5H13633144K427459J303613J8716k460718m078925m799724o869912r256840j0824918
1482.8G79091895j2828112j6524494k1893978k6627242k6293159k7464807l2308102
1497.1F15152001l1541705k6018023k0742178j6844452r155571L430188J0060608J3629735
$$ y = [626175404, 657476306, 688506603, 710663497, 717364430, 710439742, 695891142, 682773888, 676554799, 678674519, 689558804, 710137427, 734909177, 750646472, 751254320, 749330044, 759407938, 779371619, 799978793, 812746286, 818046987, 820015073, 819198370, 814609170, 807453215, 798440456, 785977125, 774594784, 771256030, 775081813, 783847451, 793396950, 799328864, 800987482, 800090790, 797819376, 796759903, 800480902, 805895925, 810156643, 813633144, 816060603, 817364216, 817382932, 814922214, 810843289, 806043565, 799173653, 789916813, 779091895, 766263783, 749739289, 727845311, 701218069, 674924910, 647460103, 615152001, 583610296, 557592273, 536850095, 520005643, 510850072, 514280260, 524340868, 537970603]
1513.4E37970603J7215490K0766616K3900449L0167699L1303763K7334392K3972214
1527.7G12631226J5879631O758988j498521p751763j0735929j0237813j80661R531378
1544G14396536J2761295J2580633J2769282J3395190J2803436J1082768J2633324J4968216
1560.3H17390680R503484O414116M913508L425479L831327L524840K088249J940310
1576.6H53031993J463950j17004j019538j956284l374815l846705m116297m943907
1593H35121393n263448n743444p418632r548605j2546777j6209483j7788113j5279650
1609.3G45323241q986831j059294P591486J5919030J6284764J2658596R815812O320417
1625.6H03867221L646850J812935R10938Q68380J092136J807928K502263K379596J947045
$$ y = [537970603, 555186093, 575952709, 599853158, 630020857, 661324620, 688659012, 712631226, 728510857, 735269845, 733771324, 726019561, 715283632, 705045819, 704865158, 714396536, 727157831, 739738464, 752507746, 765902936, 778706372, 789789140, 802422464, 817390680, 826894164, 833308280, 838221788, 841647267, 845478594, 849003434, 851091683, 853031993, 854495943, 854378939, 853359401, 851403117, 848028302, 844181597, 840065300, 835121393, 829857945, 824114501, 816695869, 807147264, 794600487, 778391004, 760602891, 745323241, 736336410, 735277116, 742868602, 758787632, 775072396, 787730992, 797546804, 803867221, 807514071, 809327006, 810237944, 811106324, 812198460, 814006388, 816508651, 818888247, 820835292]
1643.9H20835292K465904L378630K602756J967966L388167L483057K510488J332521
1660.3H41964781L00110O58571M23253j514971k399445j949847l300011m349053m553556
1678.6H25279832n823612q540988j2477637j3468027j6455352k3439169k7615070l0615390
1694.9F86844587k5871277r715676N738378J4026224J9325376K4215996K4371028K1734357
1711.3G60668993J8032670J4770091J2513816R192765M905104J565457o0201J006067
1727.6H22594762K872109L891886N539119O534397M976750M444301M224300L109336
1743.9H58186960K960325L197431L435731M080236L599882K188265J737953J606166
1760.2H80992949J071334J236856J162350L39747L0338P08163J023054Q89063O34551
$$ y = [820835292, 823301196, 826679826, 829282582, 831250548, 834638715, 838121772, 840632260, 841964781, 842264891, 842923462, 843346715, 841831744, 839432299, 837482452, 834182441, 829833388, 825279832, 819456220, 810915232, 798437595, 784969568, 768514216, 745075047, 717459977, 686844587, 660973310, 651257634, 656996012, 671022236, 690347612, 714563608, 738934636, 760668993, 778701663, 793471754, 805985570, 815178335, 820083439, 821648896, 821588695, 822594762, 825466871, 829358757, 834897876, 841432273, 846409023, 850853324, 855077624, 858186960, 861147285, 864344716, 867780447, 871860683, 875460565, 877648830, 879386783, 880992949, 882064283, 883301139, 884463489, 884803236, 884833574, 885541737, 886564791, 887453854, 888088405]
1778.6H88088405j6391j62721K95937K24591j38939j55330q1420L40939O40273J41561
1799H89176905j16885N31733M83215o0320J52052L05712K00033M26114K95699j30356
1819.4H91263902N7042L755m00841j61767J2099O0916M61519L95596j23501m2915r7096
1841.8H91428709p11739k25961M81188N7697j33037N3704k90394l69251Q94j61707
1862.2H90130103l56615l19838n93246k08199M96567Q3327l80397j57416k87592m79043
1882.6H87927651n8055k7477k30253K89321L79443p2002J60455K46108j37925m1127
1903H88436139p4029m79997k94685n8949l19600l02970k51770l51847k0086K18868
1923.4H86501074r179m2200p4625n24640n27144j76847l10421l15547l6418n1678Q3805
$$ y = [888088405, 888072014, 887909293, 888205230, 888429821, 888290882, 888135552, 888054132, 888395071, 889035344, 889176905, 889060020, 889591753, 890074968, 890014648, 890166700, 890472412, 890672445, 891098559, 891394258, 891263902, 891320944, 891324699, 890923858, 890762091, 890774190, 890835106, 891296625, 891692221, 891568720, 891525805, 891428709, 890716970, 890491009, 890972197, 891029894, 890896857, 890950561, 890660167, 890290916, 890291810, 890130103, 889773488, 889453650, 888860404, 888652205, 889148772, 889232099, 888851702, 888694286, 888406694, 887927651, 887869596, 887842119, 887611866, 887901187, 888280630, 888208628, 888369083, 888615191, 888477266, 888436139, 888362110, 887882113, 887587428, 887528479, 887208879, 886905909, 886654139, 886302292, 886282206, 886501074, 886491895, 886449695, 886375070, 885850430, 885323286, 885146439, 884836018, 884520471, 884484053, 884432375, 884516180]
1945.8H84516180L29971J2517j89483P1823m5299j69277R1373o7114l35157j58012
1966.2H84057522j86920k59042O2525L1531k05576M887m4405l26395q2732k2590l58283
1988.7H82670522k71023j87337m35650l67225k92599m43935j65999M1544k05099o378
2009H80336821L00467N007j29700l0458k54214j95384Q5712j08421j68145L6836j82390
2031.5H79696131k35081R4354k2352j59680O4730q6903k67744l457n6386k28882N722
2053.9H78800452j6511j23679K21490K47837l6419J35362J57595j23382M0174J39058
2074.3H79441977j01150P451N4300k11775m5717J30951j22130o9976O7533j93716j43051
2096.8H78814697J06097o9201n4241J36614j13189j42813J61231P510j29044O4313
$$ y = [884516180, 884846151, 884858668, 884669185, 884741008, 884695709, 884526432, 884617805, 884550691, 884215534, 884057522, 883870602, 883611560, 883674085, 883705616, 883500040, 883504927, 883460522, 883134127, 883051395, 883028805, 882670522, 882399499, 882212162, 881776512, 881409287, 881116688, 880672753, 880506754, 880548298, 880343199, 880336821, 880637288, 880642295, 880512595, 880482137, 880227923, 880032539, 880118251, 880009830, 879841685, 879878521, 879696131, 879461050, 879555404, 879533052, 879373372, 879438102, 879351199, 879083455, 879079998, 879023612, 878794730, 878800452, 878783941, 878660262, 878881752, 879129589, 879093170, 879228532, 879386127, 879262745, 879302919, 879441977, 879340827, 879348278, 879402578, 879190803, 879145086, 879276037, 879153907, 879083931, 879151464, 878957748, 878814697, 878920794, 878851593, 878797352, 878933966, 878820777, 878677964, 878839195, 878846705, 878717661, 878781974]
2117.1H78781974o8664j70827P2300k4736j90854J6570l2484j67132P4208O4671j14739
2139.6H78240287P0215M3451j66475O2823J49608r1732j79K6047k29835r5070N6267
2162H78065407j48177q7738J8060j58131M649K54453L7133k0146J13547j00613j27733
2184.5H77850711J14680j3173r5308Q8454j7286n8174J73152M2736r6500J25587M5955
2206.9H78160834j12772J06395P5101j33335j7405n8233k24650m7982n1916l03626
2227.3H77392411j98602j51694l46065j64509J4067j43051l2604J19329l8684N4538
2247.7H76505136J90080n8532q3268N3883j47581j57595K6047j58190j98067M3810
2268.1H76015723m8518q9348J69158J13845j3769J28687J5020j56104J7821l2782k43127
$$ y = [878781974, 878713310, 878542483, 878614783, 878590047, 878399193, 878415763, 878383279, 878216147, 878290355, 878355026, 878240287, 878310502, 878353953, 878187478, 878250301, 878399909, 878308177, 878307998, 878334045, 878104210, 878009140, 878065407, 877917230, 877829492, 877847552, 877689421, 877694070, 877948523, 877985656, 877965510, 878079057, 877978444, 877850711, 877965391, 877952218, 877856910, 877945364, 877928078, 877869904, 878043056, 878085792, 877989292, 878114879, 878160834, 878048062, 878154457, 878229558, 878096223, 878078818, 878020585, 877795935, 877747953, 877696037, 877392411, 877193809, 877042115, 876696050, 876531541, 876545608, 876402557, 876369953, 876489282, 876450598, 876505136, 876695216, 876636684, 876553416, 876607299, 876459718, 876302123, 876328170, 876169980, 875971913, 876015723, 875967205, 875877857, 876047015, 876160860, 876147091, 876275778, 876290798, 876134694, 876152515, 876119733, 875876606]
2290.5H75876606r0719o3121k10822l3855J1325j98126j34349j30296l53157k58863
2310.9H74414623j30773k93791k73824k28047m34876l44336p4684j61350k20955j61290
2331.3H72090697k62558j75119N842j42575j65105J3710M5359K85208L57330j72437
2351.7H71880352p30514p18415o17266m62353o3658N3168Q9705L26931K18392J15573
2372.1H70091915M13180L82363J33574K72632L21209J24932J72913J69992j00493j46091
2392.5H71836126j44005l55065k97308j45733k90811k64168j13487k39373j74582J23442
2412.9H69935036J26779J32501K85447J69515P5281K16007J15573m7624J5140j09673
2433.3H70913982k39789o8665q9943k60234j83403j97351l18051j69515j09733k61366
$$ y = [875876606, 875785887, 875722766, 875511944, 875478089, 875489414, 875291288, 875156939, 875026643, 874673486, 874414623, 874283850, 873990059, 873716235, 873488188, 873053312, 872708976, 872634292, 872472942, 872251987, 872090697, 871828139, 871653020, 871658862, 871516287, 871351182, 871364892, 871410251, 871695459, 872052789, 871880352, 871149838, 870431423, 869814157, 869351804, 869288146, 869341314, 869431019, 869757950, 869976342, 870091915, 870505095, 870887458, 871021032, 871293664, 871614873, 871739805, 871912718, 872082710, 871982217, 871836126, 871692121, 871337056, 871039748, 870894015, 870603204, 870339036, 870225549, 869986176, 869811594, 869935036, 870061815, 870194316, 870479763, 870649278, 870724559, 870940566, 871056139, 871008515, 871023655, 870913982, 870674193, 870605528, 870515585, 870255351, 870071948, 869874597, 869556546, 869387031, 869277298, 869015932]
2453.7H69015932j81019j35601k88129j55806J5139r3162o4015Q583j15514l9339R5189
2476.1H68062258n7578o2049Q2970m1425p1347R2089j7404j28448n7161j76370k22683
2498.5H67402852l9339j16051k89738k15351k39909k86460r8944j00374k26259p4566
2518.9H65715861j7404j31369k1815j4603k31028j93238j13428k02834n9724P7486
2539.3H64807904r9659j15335k504p2538P271J47760J4723l2425L8981o4909j2994
2561.8H64616275J73926L6001j02996j9312r1672j38521M172o7473j77145o0081r7096
2584.2H64076078j62184M6313Q5830o5863j2696k7656j44959j0252K8491j80542j77920
2606.6H63454640j34409k54452j82628j18018k97069l28303k69770l60549k90632j66535
$$ y = [869015932, 868834913, 868699312, 868411183, 868255377, 868270516, 868177354, 868113339, 868121922, 868006408, 867967069, 868062258, 868004680, 867942631, 868025601, 867984176, 867912829, 868004918, 867987514, 867859066, 867801905, 867625535, 867402852, 867363513, 867247462, 866957724, 866742373, 866502464, 866216004, 866117060, 866016686, 865790427, 865715861, 865698457, 865567088, 865545273, 865530670, 865299642, 865106404, 864992976, 864790142, 864730418, 864807904, 864708245, 864592910, 864590406, 864517868, 864525139, 864672899, 864687622, 864655197, 864694178, 864629269, 864616275, 864790201, 864826202, 864723206, 864703894, 864612222, 864473701, 864477873, 864410400, 864233255, 864173174, 864076078, 863913894, 863960207, 864046037, 863980174, 863967478, 863939822, 863794863, 863784611, 863813102, 863632560, 863454640, 863320231, 863065779, 862883151, 862765133, 862468064, 862139761, 861869991, 861509442, 861218810, 861052275]
2627H61052275l15845l72351k68220k98739j82927O6877L6895k4617N7280j6629p9334
2649.5H59654665J3351p1287j72496o8962j51038l16322k63214l41416n01752l84688
2669.9H57396841k78234k53082j5080R7454n6029n3703J8954L1710J92880K89917J84834
2692.3H57556462K19822K79010J55150J76311K50220Q3447k325M0531p0095j00016
2712.7H58588517j5378j38343k31206j42694j99437k50637j21832j29759j70827m8578
2733.1H57139826j9074m4346J4365n5849j67430j10507r6619j21951J728M8101k8014
2755.5H56560230J3531J4066o8843L4571R2804p8321j70290k35617l86238l74794k91705
2778H55109394l05355k34902j65820k52962k53022k06053l71575n10991n06461o17802
$$ y = [861052275, 860736430, 860364079, 860095859, 859797120, 859614193, 859681070, 859717965, 859693348, 859750628, 859733999, 859654665, 859668016, 859596729, 859424233, 859355271, 859204233, 858887911, 858624697, 858283281, 857781529, 857396841, 857118607, 856865525, 856850445, 856947899, 856891870, 856838167, 856857121, 856888831, 857081711, 857371628, 857556462, 857776284, 858055294, 858210444, 858386755, 858636975, 858720422, 858718097, 858758628, 858688533, 858588517, 858573139, 858434796, 858203590, 858060896, 857861459, 857610822, 857488990, 857359231, 857188404, 857139826, 857120752, 857076406, 857090771, 857034922, 856867492, 856756985, 856660366, 856538415, 856540143, 856588244, 856560230, 856573761, 856587827, 856518984, 856553555, 856646359, 856568038, 856397748, 856162131, 855775893, 855401099, 855109394, 854804039, 854569137, 854403317, 854150355, 853897333, 853691280, 853319705, 852808714, 852302253, 851684451]
2798.4H51684451p44820p46667p73787o59287l35753k16365k29955r8586q6308j87397
2818.8H47605526j63316k00749k76863k03431j73807j72973j1146P2420m1247k39968
2839.1H46194446n94854r15289r48787r88424j177907j099646p74562n87046l77298
2857.5H38730633j35064r2029J4185J92285J31011R0599J58548o2942l18527k32041
2877.9H38476658j47164j92046j93834k57612l11613k44856k80857l85761m31955n73873
2898.3H35457087o46055m88997m53293n59211m62830k88486k81871l51190m58360n70357
2918.7H30896437m90725k88129j61349K7656J49727p8440k15053L0696L65198P30753
2939.1H30966771R77337Q15928M74870K49744K30372N67853Q82030P34269N34415N23091
$$ y = [851684451, 850939631, 850192964, 849419177, 848759890, 848424137, 848207772, 847977817, 847879231, 847792923, 847605526, 847442210, 847241461, 846964598, 846761167, 846587360, 846414387, 846403241, 846475661, 846434414, 846194446, 845599592, 844684303, 843735516, 842747092, 841569185, 840469539, 839694977, 839107931, 838730633, 838595569, 838503540, 838517725, 838710010, 838841021, 838931620, 839090168, 839027226, 838708699, 838476658, 838329494, 838137448, 837943614, 837686002, 837374389, 837129533, 836848676, 836462915, 836030960, 835457087, 834811032, 834322035, 833868742, 833309531, 832846701, 832558215, 832276344, 831925154, 831466794, 830896437, 830405712, 830117583, 829956234, 829983890, 830133617, 830055177, 829840124, 829870820, 830236018, 830966771, 831944108, 832760036, 833234906, 833484650, 833715022, 834282875, 835164905, 835899174, 836433589, 836956680]
2959.5H36956680M36604L21746L03328J87158l6597j75595m93229j193821j827061
2977.8H34479213j610697m7802J813352K151072J132130L14057J70708L16143M75228
2996.2H39193404L97920J94490L54111P49588Q88229P43210L78013n8949k49207k07126
3016.6H42383683k3604L42489N58495L83556J65761N7637j22189k45035k33591k89619
3037H42977583k38835j4842J7226q8334j27137k18034k98857k62023k95817m06683
3057.4H41044247m38154m55916m27842k58207k87771n83589o72698n78642n15580m12584
3077.8H36413264l96371m44173l32356k65956l40044k87056j99735j28747J55330M09007
3098.2H34583163K99335R1731J9551l58M5657P1526Q5294K79844L48091M3273l19779
$$ y = [836956680, 837393284, 837715030, 838018358, 838205516, 838168919, 837993324, 837500095, 836306274, 834479213, 832868516, 832820714, 834634066, 836785138, 837917268, 838231325, 838402033, 838718176, 839193404, 839591324, 839785814, 840139925, 840889513, 841777742, 842520952, 842898965, 842840016, 842590809, 842383683, 842360079, 842702568, 843261063, 843644619, 843810380, 843868017, 843745828, 843500793, 843267202, 842977583, 842738748, 842723906, 842741132, 842652798, 842525661, 842307627, 842008770, 841746747, 841450930, 841044247, 840606093, 840150177, 839722335, 839464128, 839176357, 838592768, 837920070, 837341428, 836825848, 836413264, 836016893, 835572720, 835240364, 834974408, 834634364, 834347308, 834147573, 834018826, 834174156, 834583163, 834882498, 834974229, 834993780, 834993422, 835039079, 835110605, 835195899, 835475743, 835823834, 835867107, 835547328]
3120.6H35547328n40018n76198l86059j75775k76148m65691l53396j67012j86026l94047
3141H32026958o26802o32048m46200l04043k39730l65675o79135p69973n99682n31674
3161.4H26831996n91754n74470n50985o27995o51181o63161p35521o95229o54042p61807
3181.8H20325851q09311p62761p57873p49648p61807q94069r94146r60171r30012q74758
3202.2H11831295p86364q25405r26137r42886r37819r26971q88587r20951r85682r88781
3222.6H02701712j026512j081347j029015r15885q76605j029909j245558j247287j071751
3240.9G93177843r47714q89420q70765r92536j066625q78990p36594q52347q88407
3259.3G85054445p74920p54535o97493n16177m16755n68569q43942r76920r23992q15570
$$ y = [835547328, 835007310, 834431112, 834045053, 833869278, 833593130, 833127439, 832774043, 832607031, 832421005, 832026958, 831400156, 830768108, 830321908, 830017865, 829778135, 829412460, 828733325, 827963352, 827363670, 826831996, 826240242, 825665772, 825114787, 824486792, 823835611, 823172450, 822436929, 821741700, 821087658, 820325851, 819516540, 818753779, 817995906, 817246258, 816484451, 815590382, 814596236, 813636065, 812706053, 811831295, 811044931, 810219526, 809293389, 808350503, 807412684, 806485713, 805597126, 804676175, 803690493, 802701712, 801675200, 800593853, 799564838, 798648953, 797772348, 796742439, 795496881, 794249594, 793177843, 792230129, 791340709, 790469944, 789477408, 788410783, 787531793, 786795199, 785942852, 785054445, 784279525, 783524990, 782827497, 782311320, 781894565, 781325996, 780482054, 779505134, 778581142, 777765572]
3279.7G77765572q07524q46862q64089q83877p63715o52313q60393j194656j414001
3298G69478142j458227j196623q49068j003445j584649j946211j978457j899123j819014
3316.4G55743325j813472j850724j825332j828790k081633k357006k378166k325773
3332.7G39282429k283394k220750k344072k587616k734602k885043k871752k645195
3349G18710005k759993l159463l252983l104747l033638l136277l243804l035605k788722
3367.4F91194773l013194l456652l500223l162384k873838k717853k623796k520919
3383.7F67325914k325535k104044j950621j957298k075732k048015j823604j673699
3400F51367366j824140k028585j916885j643658j439333j315772j295448j252293j097799
$$ y = [777765572, 776958048, 776111186, 775247097, 774363220, 773599505, 772947192, 772086799, 770892143, 769478142, 768019915, 766823292, 765974224, 764970779, 763386130, 761439919, 759461462, 757562339, 755743325, 753929853, 752079129, 750253797, 748425007, 746343374, 743986368, 741608202, 739282429, 736999035, 734778285, 732434213, 729846597, 727111995, 724226952, 721355200, 718710005, 715950012, 712790549, 709537566, 706432819, 703399181, 700262904, 697019100, 693983495, 691194773, 688181579, 684724927, 681224704, 678062320, 675188482, 672470629, 669846833, 667325914, 665000379, 662896335, 660945714, 658988416, 656912684, 654864669, 653041065, 651367366, 649543226, 647514641, 645597756, 643954098, 642514765, 641198993, 639903545, 638651252, 637553453]
3418.4F37553453r80854q84831p03156n06341l33726k57850j81317K6047L6835k15888
3438.8F33552372k11775J30296M08530N45800O37650P04825Q15273R82225J119792
3457.1F38684988J174986J106322J108110J396120J604378J280129P88748Q14140J183391
3475.5F49141312J472234J503349J261294J182973J373470J415074J352966J460433
3491.8F60163105J574993J544594J432598J381815J434981J415849J343370J403331
3508.1F71694636J612902J832902J781524J577735J597821J725972J847923J792490
3524.4F85463905J524389J591087J943230K074242K084434K031922J845539J858234
3540.8G00416982K021313J947284J748263J733006J806259J903653K043903K090275
$$ y = [637553453, 636572599, 635687768, 634984612, 634478271, 634144545, 633886695, 633705378, 633731425, 633768260, 633552372, 633340597, 633470893, 633879423, 634425223, 635062873, 635767698, 636582971, 637565196, 638684988, 639859974, 640966296, 642074406, 643470526, 645074904, 646355033, 647143781, 647957921, 649141312, 650613546, 652116895, 653378189, 654561162, 655934632, 657349706, 658702672, 660163105, 661738098, 663282692, 664715290, 666097105, 667532086, 668947935, 670291305, 671694636, 673307538, 675140440, 676921964, 678499699, 680097520, 681823492, 683671415, 685463905, 686988294, 688579381, 690522611, 692596853, 694681287, 696713209, 698558748, 700416982, 702438295, 704385579, 706133842, 707866848, 709673107, 711576760, 713620663, 715710938]
3557.1G15710938K071619J999199J673162J410306K062678K976477K799511K295673
3573.4G32999563K258063K406954K639652K816558K516388J969517K047419K768100
3589.7G52422214K885460K595067K650321K812803K732992K639711K509475K134084
3606G73382127K028406K327919K415955K349198K174735K142787K700865K821207K043307
3624.4G94386506J035333R23335K252341K643108K071023J670897J385212J244545
3640.7H07612300J196325P35044o0081J32978J575231J853287J155437J109361J328767
3659H16638649Q82446L92914J48475l58224p17222j67251r9242m10974N87940J322389
3679.4H18219900J139104P66039K76506j13487J3471P15554J112163Q47220L20911
$$ y = [715710938, 717782557, 719781756, 721454918, 722865224, 724927902, 727904379, 730703890, 732999563, 735257626, 737664580, 740304232, 743120790, 745637178, 747606695, 749654114, 752422214, 755307674, 757902741, 760553062, 763365865, 766098857, 768738568, 771248043, 773382127, 775410533, 777738452, 780154407, 782503605, 784678340, 786821127, 789521992, 792343199, 794386506, 795421839, 796345174, 798597515, 801240623, 803311646, 804982543, 806367755, 807612300, 808808625, 809543669, 809483588, 809616566, 811191797, 813045084, 814200521, 815309882, 816638649, 817521095, 817914009, 818062484, 817704260, 816987038, 816819787, 816720545, 816309571, 816897511, 818219900, 819359004, 820125043, 820401549, 820288062, 820301533, 821017087, 822129250, 822976470, 823297381]
3697.8H23297381j18136j05560L78370M08352k43306p90239k28703Q18014P82133J74999
3718.2H24373305k22385l28899k31266Q4579L06368q9407p13169o47664L29375R57012
3738.6H23817849K70426r63270r81033J06335j92762m89890O41882J056016M05490
3756.9H23671043L6895L16560K88964j04249j94490o0856K07424L64483J19626k25365
3777.3H24420035k59876j3233O974l4511J22964J46151m0233l39925m94659l84927
3797.7H23128760n94616n41031J64508J77443K61665O50525K44796n68032p78437m03225
3818.1H21742356m34518m649O14106L52145q107k17497k42352j95921n35130o10054
3838.5H20460379N0545N33461O40572M29749k40982j322031j919210q4519J447678
$$ y = [823297381, 823179245, 823073685, 823452055, 823860407, 823617101, 822826862, 822598159, 823416173, 824198306, 824373305, 824150920, 823822021, 823590755, 823675334, 823981702, 823892295, 823179126, 822531462, 822860837, 823817849, 824088275, 823125005, 822143972, 822250307, 822057545, 821567655, 822209537, 823265553, 823671043, 823707938, 824024498, 824313462, 824209213, 824014723, 823953867, 824161291, 824525774, 824645400, 824420035, 824160159, 824146926, 824153900, 824119389, 824242353, 824388504, 824348271, 824008346, 823513687, 823128760, 822534144, 821993113, 822157621, 822335064, 822596729, 823247254, 823492050, 822924018, 822145581, 821742356, 821307838, 821303189, 821917295, 822269440, 822261333, 822043836, 821801484, 821605563, 821070433, 820460379, 820510924, 821044385, 821684957, 822114706, 821873724, 820551693, 818632483, 818547964, 819995642]
3856.9H19995642Q18133j53482n55515k47717q6248l06785l0577L61144M56035K08319
3877.3H20458949l96908l33667K5809k9623Q3208q6665k64764K35975L09646m05550
3897.7H19596410q40247n53727J9789O07609P37131L62933q464k57492m17590k44201
3918.1H19002151Q0288J6868j86324j9848O3002j55390l9816K58387J72674o7889k72930
3940.5H18851173l21150k8610P8082j10567m0531J29283R0003M649k9147m7088l0636
3962.9H18545461j5557k4378j3173m3750j17361r0599j6094m4644m5597L0875k3603
3985.4H18141580j44482j59800j20163n2333J2517j430
3997.6H17675889
$$ y = [819995642, 820813775, 820660293, 820104778, 819857061, 819770813, 819464028, 819433451, 819794595, 820250630, 820458949, 820062041, 819728374, 819754183, 819724560, 819807768, 819721103, 819456339, 819692314, 820001960, 819596410, 818756163, 818202436, 818222225, 818829834, 819566965, 819929898, 819921434, 819663942, 819246352, 819002151, 819082439, 819099307, 818912983, 818893135, 818956137, 818800747, 818760931, 819019318, 819191992, 819124103, 818851173, 818530023, 818501413, 818579495, 818468928, 818428397, 818557680, 818647683, 818652332, 818623185, 818576097, 818545461, 818529904, 818505526, 818492353, 818448603, 818331242, 818240643, 818224549, 818179905, 818134308, 818165183, 818141580, 817997098, 817837298, 817717135, 817664802, 817677319, 817675889]
##END=$$ End of the data block
