##TITLE=CSV-2 $$ Begin of the data block
##JCAMP-DX=5.00 $$ ACD/SpecManager v 10.08
##SPECTROMETER/DATA SYSTEM=Alpha
##DATE=21 Oct 2014 10:25:42
##DATA TYPE=INFRARED SPECTRUM
##DATA CLASS=XYDATA
##ORIGIN=
##OWNER=
##NPOINTS=1765
##FIRSTX=399.76428223
##LASTX=3997.64306641
##MAXX=3997.64306641
##MINX=399.76428223
##MAXY=0.87992847
##MINY=0.20227773
##XFACTOR=1.0000000000
##YFACTOR=1.000000000000000e-9
##FIRSTY=0.84460920
##DELTAX=2.03961372
##XUNITS=1/CM
##YUNITS=ARBITRARY UNITS
##XYDATA=(X++(Y..Y))
399.8H44609201j4491916n243540P609666P496595l237247j2313307j9348025k5038421
$$ 844609201 830117285 824873745 832483411 839980006 836742759 824429452 805081427 780043006
416.1G80043006j7295182J0515869K4276376K1356582J7294109J1306703O885886N351484
$$ 780043006 762747824 773263693 797540069 818896651 836190760 847497463 854383349 859734833
432.4H59734833K552390j199007j271188J329482J308202k273738m420400k163350
$$ 859734833 862287223 861088216 859817028 861146510 862454712 860180974 855760574 853597224
448.7H53597224J094162R13501j251936j525581j355469m704177q890987p920325j988113
$$ 853597224 854691386 855604887 854352951 852827370 851471901 846767724 837876737 829956412 827968299
467.1H27968299L093303M265010M424155O199121O766796L352821p51376q60512J226842
$$ 827968299 831061602 835326612 839750767 845949888 852716684 856069505 855318129 854457617 855684459
485.4H55684459L28899l601134o605625q497179j0847568j1213065j3565421k3368060
$$ 855684459 856013358 852412224 845806599 837309420 826461852 815248787 801683366 778315306
501.7G78315306j9232035J0716915L1511247K4372995J1252582M481256N63503l56377
$$ 778315306 759083271 769800186 801311433 825684428 836937010 841418266 841981769 841625392
518.1H41625392K024174L947556K679467K7597o64532p84218n612433j4482498j5168429
$$ 841625392 843649566 847597122 850276589 850304186 849639654 848855436 843243003 828760505 813592076
536.4H13592076p72893J1955619P667303l011823k694964P475793J2100399P069826
$$ 813592076 812819183 824774802 832442105 829430282 826735318 834211111 846311510 853381336
552.7H53381336K021253J714527K426804R16361r89019m44532J311183J135170q41438
$$ 853381336 855402589 857117116 859543920 860460281 859471262 859026730 860337913 861473083 860631645
571.1H60631645j389921M33564J504004j09076j680374n77212J048207j00314k838791
$$ 860631645 859241724 859675288 861179292 861070216 859389842 858812630 859860837 859760523 856921732
589.4H56921732l179669m44114J829445J655042P49290J120985J592636m81248l580868
$$ 856921732 853742063 853297949 855127394 856782436 857531726 858652711 860245347 859764099 856183231
607.8H56183231k602875K214729M060150J019179j516580r04381j76311j016796j314461
$$ 856183231 853580356 855795085 859855235 860874414 859357834 858453453 858277142 857260346 855945885
626.2H55945885l5286J021862n31912m911422p696510o401360n688965o939173l159225
$$ 855945885 855910599 856932461 856400549 851489127 843792617 837391257 831702292 824763119 821603894
644.5H21603894P523179J5694320J4154852P091820K382577J978159K479672J110077
$$ 821603894 829127073 844821393 858976245 866068065 868450642 870428801 872908473 874018550
660.8H74018550p38323j153290r65715r64164k143801m997372o783903m118383k10583
$$ 874018550 873280227 872126937 871161222 870197058 868053257 863055885 856271982 852153599 851943016
679.2H51943016j0431P21991N016268N575597M21882l602922l803254k549648R39965
$$ 851943016 851932585 852654576 857670844 863246441 863668323 860065401 856262147 853712499 854652464
697.5H54652464N842686P277489N113780J580954j911759l259361m922629q798360
$$ 854652464 860495150 867772639 872886419 874467373 872555614 869296253 864373624 855575264
713.9H55575264n407334N947590J0951757P700265L228307q29697l188252m045070
$$ 855575264 850167930 856115520 867067277 874767542 877995849 877166152 873977900 869932830
730.2H69932830p021665j1009336p675409L526926J0406792O775022j098514n625904
$$ 869932830 862911165 851901829 844226420 847753346 858160138 864935160 863836646 858210742
746.5H58210742l758966J646697M556000L451348J949787J335501K41697o02483L37481
$$ 858210742 854451776 856098473 860654473 864105821 866055608 867391109 867632806 867030323 867367804
764.9H67367804K052903K006054k62499k187848j652837m67240j435340m269242o522596
$$ 867367804 869420707 871426761 871164262 868976414 867323577 866856337 865420997 861151755 854629159
783.2H54629159q662403j4922440k8603911l8954020k2377610J2517870L0744075K9215813
$$ 854629159 845966756 831044316 802440405 763486385 741108775 753626645 784370720 813586533
799.5H13586533K1737039J2332320L848732l515780q667111j0129750r991229j2210905
$$ 813586533 835323572 847655892 851504624 847988844 839321733 829191983 819200754 806989849
815.8H06989849k4516642n0780595n3408801K852439N4146410L6691129n947411j7719567
$$ 806989849 782473207 731692612 678283811 681136250 735282660 771973789 766026378 748306811
832.2G48306811j14620K2113681K9532790J5649617q394063k6259303k0151019J1798978
$$ 748306811 748192191 770305872 799838662 815488279 807094216 780834913 760683894 772482872
848.5G72482872L5336375K9394090J0266126m530669m342317R132802J5774548R193302
$$ 772482872 807819247 837213337 847479463 842948794 838606477 847739279 863513827 872707129
864.8H72707129K531588K42650k610266r203136j4857411p292510J0031343J5679955
$$ 872707129 875238717 875481367 872871101 863667965 848810554 841518044 851549387 867229342
881.1H67229342P842482J507222o60956m037738j0268211j4266431q997560K820254
$$ 867229342 875071824 876579046 875918090 871880352 861612141 847345710 838348150 841168404
897.4H41168404Q718669L942788l416658n337119k228439j337528l351688p33257L132403
$$ 841168404 849887073 853829861 850413203 845076084 842847645 841510117 838158429 837425172 840557575
915.8H40557575j039862p880390r141505j0104894j8383980l2106579m2526424l8914740
$$ 840557575 839517713 831637323 822495818 812390924 794006944 761900365 719373941 680459201
932.1F80459201j8072784R365797L1532109M3830931M3970466L3148170J9180476R457827
$$ 680459201 662386417 671752214 703284323 747115254 791085720 824233890 843414366 852872193
948.4H52872193M890323K569019m17471n587279j1234582q905172K035320N822062
$$ 852872193 857762516 860331535 859914064 854326785 843092203 834187031 836222351 842044413
964.7H42044413j279116o450653o414890m231334Q56877O181001P602632N472660K217710
$$ 842044413 840765297 834314644 827899754 823668420 824525297 830706298 838308930 843781590 845999300
983.1H45999300k52366j344859k229929m252494p233440j0868490j6045869k2728920
$$ 845999300 845746934 844402075 842172146 837919652 830686212 819817722 803771853 781042933
999.4G81042933k7748942k8227508k4478555j9810915q441209J3441920K2216439J1184931
$$ 781042933 753293991 725066483 700587928 680777013 672335804 685777724 707994163 719179094
1015.7G19179094M190981K276957o887734j7614007j8796801j3441026p372797O759822
$$ 719179094 723370075 725647032 718759298 701145291 682348490 668907464 661534667 668294489
1032F68294489K8512061L9590299L3081889K0986855J2773157Q686661N611480J872420
$$ 668294489 696806550 736396849 769478738 790465593 803238750 811925411 817536891 819409311
1048.4H19409311k200425n316257n218447j124203L006697K753615j145184o021917
$$ 819409311 817208886 811892629 806674182 805549979 808556676 811310291 810165107 804143190
1064.7H04143190j0894239j5515208j7183244j2849927o387949m429102o415725j1414706
$$ 804143190 793248951 777733743 760550499 747700572 741312623 736883521 730467796 719053090
1081G19053090k3359478l6131859k9534995k13802K4507165L0135512L0718327L2089233
$$ 719053090 695693612 659561753 630026758 629812956 654320121 684455633 715173960 747263193
1097.3G47263193K6602447J4036656K207100k077401J283944M232764M37737p921636
$$ 747263193 773865640 787902296 790109396 788031995 789315939 793548703 793986440 786064804
1113.6G86064804j5338362j6067743q622646K033889J2214124J8635214J7463088J1691391
$$ 786064804 770726442 754658699 746036053 748069942 760284066 778919280 796382368 808073759
1129.9H08073759O662846L857851K571165J492739M5359j050174j290023j357019j920998
$$ 808073759 814736605 818594456 821165621 822658360 822703719 821653545 820363522 819006503 817085505
1148.3H17085505k809883l463506m040897n130828o615877p612049p942796q754134
$$ 817085505 814275622 810812116 806771219 801640391 795024514 787412465 779469669 770715535
1164.6G70715535j1126459j4564156j8342972k4274171l2335758l4690916k4424673
$$ 770715535 759589076 745024920 726681948 702407777 670072019 635381103 610956430
1178.9F10956430j2647390j5752852k9478788m1483343m6663910l9352119j5045196
$$ 610956430 598309040 582556188 553077400 511594057 464930147 425578028 410532832
1193.2D10532832J7161518L6094666L1236202J5654504P133782P930994J2013256J7920733
$$ 410532832 427694350 463789016 495025218 510679722 517813504 525744498 537757754 555678487
1209.5E55678487K4887621K7199686J9788265N229414o465257o028771L826320J1716545
$$ 555678487 580566108 607765794 627554059 632783473 626318216 620289445 624115765 635832310
1225.8F35832310J2915253J1709929J2182414J4823497J7706394J7860413J4847934
$$ 635832310 648747563 660457492 672639906 687463403 705169797 723030210 737878144
1240.1G37878144J1798978J0329306P974028K486885m530132r673655j1604726j1002183
$$ 737878144 749677122 760006428 767980456 770467341 765937209 756263554 744658828 733656645
1256.4G33656645r091556q814872j2345314j4874637r124934J433253L902852o899476
$$ 733656645 724565089 715750217 703404903 688530266 679405332 680838585 684741437 677841961
1272.7F77841961k3922503l9918780m9658060m1354537j1561155R087681p878840l8922071
$$ 677841961 653919458 614000678 564342618 522988081 511426926 520514607 512635767 473713696
1289D73713696m5014352k2015452J1864454M0080189N0465465L3539355n090297l2638073
$$ 473713696 428699344 406683892 418548346 458628535 509094000 542633355 537543058 504904985
1305.4E04904985k5623381o610721k544522p768870q316695j389027J0224223K2829026
$$ 504904985 479281604 472670883 470126361 462357491 454040796 452651769 462875992 485705018
1321.7D85705018L1482458L3062816L0043006K7991295K8934836L0904949L0660331
$$ 485705018 517187476 550250292 580293298 608284593 637219429 668124378 698784709
1336F98784709K6780128K0527244J3903797R321332P270097O256879M520595J319289
$$ 698784709 725564837 746092081 759995878 769317210 776587307 782844186 787364781 788684070
1352.3G88684070k557158n853951p961631j0779917j7859102k7954459l3105433k5168717
$$ 788684070 786126912 780272961 772311330 761531413 743672311 715717852 682612419 657443702
1368.6F57443702l160953J5533328J1365533k0243168n1117003m1540146L609478L7266553
$$ 657443702 654282749 669816077 681181610 660938442 609821439 568281293 571890771 609157324
1384.9F09157324M3401301L2184601J1839807q925617k1550715r038448K0246982K3823381
$$ 609157324 652558625 684743226 696583033 687657416 666106701 657068253 677315235 701138616
1401.2G01138616Q59260j576662K0665109K9481709J9956827R576619M722715L781795
$$ 701138616 701997876 700421214 721086323 750568032 770524859 780101478 784824193 788605988
1417.5G88605988O917655J0601938J1373043R697020O602705L928602J927197Q04603
$$ 788605988 795523643 806125581 817498624 827195644 833798349 837726951 839654148 840458751
1433.9H40458751N29825M98891R99749K125740K818584K521873J783550R16958k15173
$$ 840458751 840988576 841487467 842487216 844612956 847431540 849953413 851736963 852653921 852438748
1452.2H52438748j436114l352523m850388l261030j049041J227557L130496L056705
$$ 852438748 851002634 847650111 842799723 839538693 838489652 839717209 842847705 845904410
1468.5H45904410J735031M30584p42435k916217p903159j9200563l6031425l9526403
$$ 845904410 847639441 848070025 847327590 844411373 836508214 817307651 781276226 741749823
1484.9G41749823j5303612J6851902K2538603J1713981J3125360K3059845K2601843
$$ 741749823 726446211 743298113 765836716 777550697 790676057 813735902 836337745
1499.1H36337745J3050199O558776L877878K863765K177715K212584K499640K388179
$$ 836337745 849387944 855946720 859824598 862688363 864866078 867078662 869578302 871966481
1515.4H71966481J859069J102746N30362J66416j44482l99470m74215n79714r36032
$$ 871966481 873825550 874928296 875458658 875625074 875480592 875081122 874606907 874027193 873091161
1533.8H73091161r64820r82940j689613j922429j296818r94742j017392j446843k292394
$$ 873091161 872126341 871143401 869453788 867531359 866234541 865239799 864222407 862775564 860483170
1552.2H60483170l480196m951776j0318517j5741706o367445N493283J1210621O341159
$$ 860483170 857002974 852051198 841732681 825990975 819623530 825116813 836327434 842668593
1568.5H42668593l167987q657575j2928903k0779729k6835918l3991933l7911832j7288506
$$ 842668593 839500606 830843031 817914128 797134399 770298481 736306548 698394716 681106210
1584.8F81106210J9799351L6631823K4710894O989121l218949p091105p573127p474721
$$ 681106210 700905561 737537384 762248278 769237399 766018450 758927345 751354218 743879497
1601.1G43879497q605361j1948883j8240691k4807453k4632215j7361880j4852524
$$ 743879497 735274136 723325253 705084562 680277109 655644894 638283014 623430490
1615.4F23430490k3088216k4498225q504033K3641765N0487459N2677393M0319085
$$ 623430490 600342274 575844049 567340016 590981781 641469240 694146633 734465718
1629.7G34465718K4478376J6015589J3390720Q952618N261064M647731N128980O506681
$$ 734465718 758944094 774959683 788350403 797303021 802564085 807211816 812340796 818847477
1646H18847477O741703M122257K479136K340436K435208K714335K756656K168476J162112
$$ 818847477 825589180 829711437 832190573 834531009 836966217 839680552 842437208 844605684 845767796
1664.3H45767796N02408K78532J11699m07994j304984k191305k432406k578974l427505
$$ 845767796 846270204 846548736 846660435 846252441 844947457 842756152 840323746 837744772 834317267
1682.7H34317267n027533m674673l985166m665673n328953q091867j1106313j1200428
$$ 834317267 829289734 824615061 820629895 815964222 810635269 802543402 791437089 780236661
1699G80236661j0719001q803844r756983j2546658j3707996j5785574j9279659k3963213
$$ 780236661 769517660 760713816 750956833 738410175 724702179 708916605 689636946 665673733
1715.3F65673733l1132519l3109248l1640291l8319290m8263609n4859043n8743655
$$ 665673733 634541214 601431966 569791675 531472385 483208776 428349733 369606078
1729.6C69606078n8357060o0995847m4564173l411263M0039748P5294837Q5187495
$$ 369606078 311249018 250253171 205688998 202277735 242317483 317612320 402799815
1743.9D02799815P5381607N6776762L9001584K3371637J2176096N910576n49794j0071873
$$ 402799815 478181422 534958184 573959768 597331405 609507501 615418077 614868283 604796410
1760.2F04796410k0099163k5670469k8300584k5266349k064407L4653187M8983455
$$ 604796410 584697247 559026778 530726194 505459845 503395438 538048625 587032080
1774.5E87032080L5965740K1713436J3283789J2386441J8455685K3767411K2887826
$$ 587032080 622997820 644711256 657995045 670381486 688837171 712604582 735492408
1788.8G35492408K0948291J9676447J4934540J0141969Q334815Q062720P940233P219672
$$ 735492408 756440699 776117146 791051686 801193655 809528470 817591190 825531423 832751095
1805.1H32751095O262660N073071L840506K734840J962185J594543J485527J635611
$$ 832751095 839013755 844086826 847927332 850662172 852624357 854218900 855704427 857340038
1821.4H57340038J830637J980841J729966J391887J133263J012326R76562R53496Q96156
$$ 857340038 859170675 861151516 862881482 864273369 865406632 866418958 867395520 868349016 869245172
1839.8H69245172P45475O01888M66764M42087M17411L89755K53618J30951J0670k60353
$$ 869245172 869990647 870592535 871059299 871501386 871918797 872308552 872562170 872693121 872703791 872443438
1860.2H72443438p46906j157880j054168l70681O06298J086831J083851R73285R73820
$$ 872443438 871696532 870538652 869484484 869113803 869720101 870806932 871890783 872864068 873837888
1878.5H73837888R16958O91950M02213R6082k78234o57916o84202l51787J09434K51413
$$ 873837888 874754846 875446796 875849009 875945091 875666857 875008941 874324739 873972952 874082386 874333799
1898.9H74333799P4744l1829J32740L10957J78278k48492n71966l89815J02282M32193
$$ 874333799 874408543 874376714 874509454 874820411 874998689 874750197 874178231 873788416 873890698 874322891
1919.3H74322891K72811j24276l93510m32372l60310j97828p033K66313P67589J136124
$$ 874322891 874595702 874471426 874077916 873645544 873285234 873087406 873080373 873346686 874114275 875250399
1939.7H75250399J151085R14991N80966L31819K80977L33070K99156J69039Q3029Q9944
$$ 875250399 876401484 877316475 877897441 878229260 878510237 878843307 879142463 879311502 879394531 879484475
1960.1H79484475M2617r2506j81914o7055J42276K03014Q6963K444R4473J76251L7432
$$ 879484475 879527092 879434586 879252672 879185617 879327893 879530907 879617870 879620314 879714787 879891038 879928470
1982.5H79928470j79112j57833L8862Q8751p1287j75834j24275q9944j56522k16722
$$ 879928470 879749358 879591525 879630387 879719138 879647851 879472017 879347742 879257798 879101276 878884554
2002.9H78884554j59502l9101j3172j46747k65837k19285j02043j21892k73883l01600
$$ 878884554 878725052 878685951 878672779 878526032 878260195 878040910 877938867 877816975 877543092 877241492
2023.3H77241492j47164m9293j40249k44201j79231k3722J5854r7394j58846r6500
$$ 877241492 877094328 877045035 876904786 876660585 876481354 876457632 876473486 876376092 876217246 876120746
2043.7H76120746j38402m01735o30856n77151l58999k09570q6963K36570O85156Q70824
$$ 876120746 875982344 875580609 874949753 874372602 874013603 873804033 873717070 873953640 874638796 875509620
2064.1H75509620O53982L50535K56717K99513K08795l0696j21415M0412J80602N9963
$$ 875509620 876163602 876514137 876770854 877070367 877279162 877248466 877127051 877167463 877348065 877408028
2084.5H77408028r9540q047J71185J03831j49786k23041o616J65403K3842j62602p3194
$$ 877408028 877308488 877300441 877471626 877575457 877425671 877202630 877196014 877361417 877385259 877222657 877149463
2106.9H77149463J24097M6134k53797l77417k03371l5524j39177l30984k71142j7703
$$ 877149463 877273560 877319694 877065897 876688480 876485109 876449585 876310408 875979424 875708282 875690579
2127.3H75690579J8597j73747j60993J63675L85344K50220L1233O9797K43127J74523
$$ 875690579 875709176 875535429 875374436 875538111 875923455 876173675 876204908 876274705 876517832 876692355
2147.7H76692355q2195j43111J21474L54648K46942K3127M8577K43605K49445J9670
$$ 876692355 876610160 876467049 876588523 876943171 877190113 877213240 877261817 877505422 877754867 877774537
2168.1H77774537j23263L7849K17915R3579j54734j55568L6121M9233j88947l46005
$$ 877774537 877651274 877689123 877907038 878000617 877845883 877690315 877726436 877775669 877586722 877240717
2188.5H77240717j91152L7015j7703k83241l45886j07109L0815j67489l36349j57296
$$ 877240717 877049565 877086580 877068877 876785636 876439750 876332641 876363456 876195967 875859618 875702322
2208.9H75702322Q2612Q344k76923l56436j30713R418j72973l31402j35123J62065
$$ 875702322 875784934 875793278 875516355 875159919 875029206 875038624 874865651 874534249 874399126 874561191
2229.3H74561191J28924j38878j80602M8577J24574j44303m05371l27706j03236j62959
$$ 874561191 874690115 874551237 874370635 874419212 874543786 874399483 873994112 873666406 873563170 873400211
2249.7H73400211m39584m28080p1705J46747j5915j89364k3722K05397P8738k77281
$$ 873400211 872960627 872532547 872460842 872607589 872591674 872402310 872378588 872583985 872662723 872385442
2270.1H72385442l65078r9719J4723k36452m36544k69771J0013P153j77264j80006
$$ 872385442 872020364 871920645 871935368 871698916 871262372 870992601 871002614 871009767 870832503 870652497
2290.5H70652497L874L3856k36154m99606m41134k45989l44038o82592p94828n34177
$$ 870652497 870656371 870690227 870454073 869954467 869513333 869267344 868923306 868240714 867445886 866911709
2310.9H66911709k47240k23517l56496l78012k27213q3864j08957k22564j88589o1870
$$ 866911709 866664469 866440952 866084456 865706444 865479231 865395367 865286410 865063846 864875257 864813387
2331.3H64813387j24156l25680k90394K4438K57552M36842R28879J105607K97963q91924
$$ 864813387 864689231 864363551 864073157 864097595 864355147 864791989 865720868 866826475 867124438 866232514
2351.7H66232514j611054j498282r80973n88596l73661o4671M17352Q42630R49502
$$ 866232514 864621460 863123178 862142205 861553609 861179948 861115277 861532629 862375259 863324761
2370.1H63324761Q37922Q45314R56535R11295P26462N76615N63502N58675L79324J04189
$$ 863324761 864162683 865007997 865964532 866875827 867602289 868178904 868742406 869301081 869680405 869784594
2390.4H69784594o0201m5359J5139k7537r4354L993J71721J56582k4915r7394N4836
$$ 869784594 869724393 869679034 869694173 869666636 869572282 869576275 869747996 869904578 869879663 869782269 869837105
2412.9H69837105J84596P6234j10566j13845N305j8418j75596j95086l8027O8724l0816
$$ 869837105 870021701 870097935 869987369 869873524 869878829 869860411 869684815 869489729 869451702 869520426 869489610
2435.3H69489610j83642j33753M5538N3585j53601k51234j11043k7597j71065l30866
$$ 869489610 869305968 869172215 869217753 869271338 869117737 868866503 868755460 868727863 868556798 868225932
2455.7H68225932k60770o5983m1425j85132k67446j96338r3698j38342k41518j62900
$$ 868225932 867965162 867899179 867857754 867672622 867405176 867208838 867115140 866976798 866735280 866572380
2476.1H66572380J8835R835j51396j99973j04726m3332j38462k37405j48833L6418
$$ 866572380 866591215 866601050 866449654 866249681 866144955 866101623 865963161 865725756 865576923 865613341
2496.5H65613341Q0824n3704j42574m2319P8738L0279p4625m7803O5625Q5651o437
$$ 865613341 865694165 865640461 865497887 865455568 865534306 865564585 865489960 865442157 865507782 865593433 865586996
2518.9H65586996m7147K2590O5982n960j20223j53422r8467r5367j61231j77562j19448
$$ 865586996 865539849 865562439 865628421 865622461 865502238 865348816 865250349 865154982 864993751 864816189 864696741
2541.4H64696741o9380q3267j38879j70469j63138j72079k26855l06130l52382l63589
$$ 864696741 864627361 864544094 864405215 864234746 864071608 863899529 863672674 863366544 863014162 862650573
2561.8H62650573l36647j44720K16484M61936M43280K84731J03236k3008r0420j30713
$$ 862650573 862313926 862169206 862385690 862847626 863290906 863575637 863678873 863655865 863565445 863434732
2582.2H63434732j73509k09391j79887q5950L8505Q8513K7477j2219M77j4424l4809
$$ 863434732 863261223 863051832 862871945 862785995 862824500 862913013 862940490 862928271 862928748 862914324 862879515
2604.6H62879515K7120J40428J68741O9976l9339m7743j20l4690j66118k30670j69277
$$ 862879515 862906635 863047063 863215804 863285780 863246441 863198698 863198578 863163888 862997770 862767100 862597823
2627H62597823j21772j29640j16110l7968O5267N1617j02222j99019j49906r4891r9241
$$ 862597823 862476051 862346411 862230301 862192333 862257600 862309217 862206995 862007976 861858070 861763179 861663938
2649.5H61663938r6322m3451N483m9114j44660j42813m0054M9769J20j20879r2208
$$ 861663938 861567616 861524165 861529648 861480534 861335874 861193061 861153007 861202776 861202896 861082017 860989809
2671.9H60989809M3154N4300m1604r1672o6936l3617o0738j04963k9445Q5831M3630
$$ 860989809 861032963 861087263 861045659 860953987 860887051 860853434 860792696 860687733 860658288 860744119 860787749
2694.3H60787749q4161j17958l7372K3544m7207j27852p5579l874n7578j66416j60814
$$ 860787749 860703588 860585630 860548258 860571802 860524595 860396743 860321164 860317290 860259712 860093296 859932482
2716.8H59932482n3882k1398r3520j40250j12712n8890l2305r0242j50501j28866j65283
$$ 859932482 859878600 859857202 859763682 859623432 859510720 859451830 859419525 859329283 859178782 859049916 858884633
2739.2H58884633l22402l89755k68995j81616k82109m25577l76999j43171N8294J02818
$$ 858884633 858562231 858172476 857903481 857721865 857439756 857014179 856637180 856494009 856552303 856655121
2759.6H56655121J5020p9810q6546m8161o2466j17957j11699q2732j68144l12388l43561
$$ 856655121 856670141 856590331 856503785 856455624 856393158 856275201 856163502 856080770 855912626 855600238 855256677
2782H55256677k49982j53661j18136j19985j00255o4015j15097k38418k90275k20537
$$ 855256677 855006695 854853034 854734898 854614913 854514658 854450643 854335546 854097128 853806853 853586316
2802.4H53586316j31607j43886j88887j52826j22666j87695k64705k47120j40131r4593
$$ 853586316 853454709 853310823 853121936 852969110 852846444 852658749 852394044 852146924 852006793 851912200
2822.8H51912200k17258l53277l55780k88427k90334l71039l81172l94344n42343o93560
$$ 851912200 851694942 851341665 850985885 850697458 850407124 850036085 849654913 849260569 848718226 848024666
2843.2H48024666p85291r01759j148700j594067k323389l678203o127536r230256r987950
$$ 848024666 847239375 846337616 845188916 843594849 841271460 837593257 831465721 822235465 812247515
2861.6H12247515m963994L464043Q514047Q108258N563318L360689J926720J190186
$$ 812247515 807283521 810747564 819261611 827369869 832933187 836293876 838220596 839410782
2877.9H39410782Q00967M94838L07143J70469j9848k11359l11017l19004m75585q89421
$$ 839410782 840211749 840706587 841013730 841184199 841164351 840952992 840641975 840322971 839847386 838957965
2898.3H38957965j347303j918495k713322l048957k127051m25875Q73089J394987J473188
$$ 838957965 837610662 835692167 832978845 829929888 827802837 827376962 828250051 829645038 831118226
2916.6H31118226J333833J044392P33018M69148K66016Q7917k46346o94454j103103
$$ 831118226 832452059 833496451 834229469 834698617 834964633 835052550 834806204 834111750 833008647
2935H33008647j582384k141118k470017k342641j878917j175404j26719J046300J730203
$$ 833008647 831426263 829285145 826815128 824472487 822593570 821418166 821291447 822337747 824067950
2953.4H24067950J863718J862288J769364J480400J044512O78837M98176L50475O2287
$$ 824067950 825931668 827793956 829563320 831043720 832088232 832767069 833265245 833615720 833678007
2971.7H33678007m68433j168906j856983k940118n591810j0048926j1701644l670156
$$ 833678007 833209574 832040668 830183685 827243567 821651757 811602831 799901187 796231031
2988G96231031Q892596J2255132O043137r8944k691090l562451m400670n823612o907642
$$ 796231031 805123627 817378759 823421896 823322952 820631862 817069411 812668741 806845129 799937487
3006.4G99937487m812777J791894Q657932J0535300P975459M626453K270520J056135
$$ 799937487 795124710 796916604 805574536 816109836 824085295 828711748 830982268 832038403
3022.7H32038403O27458N15639N27978N51761N04851L21507P6056J02699K36869O3419
$$ 832038403 832665861 833181500 833709478 834261239 834766090 835087597 835163653 835266352 835503221 835566640
3043.1H35566640l09229n58972n76258n99265p40349q06690o89387k69055L80873P56920
$$ 835566640 835257411 834698439 834122181 833522916 832782567 831975877 831286490 831017435 831398308 832155228
3063.5H32155228O47604K55883j26243k40803j68859p6950q5890l57032o49274o50942
$$ 832155228 832802832 833058715 832932472 832691669 832522810 832445860 832359970 832002938 831353664 830702722
3083.9H30702722n77867n25415m17650l60489k76505j34290j74224o56605j517892
$$ 830702722 830124855 829599440 829181790 828821301 828544796 828410506 828236282 827579677 826061785
3102.2H26061785k229631k287447j504302O318J745283K781868K503455J457393M70341
$$ 826061785 823832154 821544707 820040405 820046723 821792006 824573874 827077329 828534722 829005063
3120.6H29005063j02818q1182L28183N74589L81351P2360O4432K24948J26481k59578
$$ 829005063 828902245 828821063 829149246 829723835 830105186 830177546 830241978 830466926 830593407 830333829
3141H30333829m87149l84748k28107r9361J6332j07288l80814m71116m40120m27246
$$ 830333829 829846680 829461932 829233825 829134464 829150796 829043508 828662694 828191578 827751458 827324212
3161.4H27324212l97087l31163k68221k50697k93910l87133m82440m94837m42386m29452
$$ 827324212 826927125 826595962 826327741 826077044 825783134 825396001 824913561 824418724 823976338 823546886
3181.8H23546886m60088n06460n67079o10650n93960n21064m67002m53890m21941l72588
$$ 823546886 823086798 822580338 822013259 821402609 820808649 820287585 819820583 819366693 818944752 818572164
3202.2H18572164l30925l02852l19004l76165m41372m96387n16057m73857m60744n43654
$$ 818572164 818241239 817938387 817619383 817243218 816801846 816305459 815789402 815315545 814854801 814311147
3222.6H14311147o09398n86867n70834o23405o49512o56784o81459o74785o59048o69003
$$ 814311147 813701749 813114882 812544048 811920643 811271131 810614347 809932888 809258103 808599055 807930052
3243H07930052o84678o74904o87539p26402o97732o22749o34790o91414o88314o49452
$$ 807930052 807245374 806570470 805882931 805156529 804458797 803836048 803201258 802509844 801821530 801172078
3263.4H01172078n36681l13997j53541l08395n79238o65188o96480o97255o21319n80489
$$ 801172078 800635397 800321400 800167859 799859464 799280226 798615038 797918558 797221303 796599984 796019495
3283.8G96019495n88775n51343m36843m14967n98967q55327j035392r96888p27892
$$ 796019495 795430720 794879377 794442534 794027567 793428600 792573273 791537881 790540993 789813101
3302.1G89813101n11288o76096j141429j491546j537204j398742j314104j332104j334250
$$ 789813101 789301813 788625717 787484288 785992742 784455538 783056796 781742692 780410588 779076338
3320.5G79076338j301825j317859j526356j773953j791298j715184j623094j488507
$$ 779076338 777774513 776456654 774930298 773156345 771365047 769649863 768026769 766538262
3336.8G66538262j615107j955509k122640k149821k047300j802862j872361k272605
$$ 766538262 764923155 762967646 760845006 758695185 756647885 754845023 752972662 750700057
3353.1G50700057k418101k261460k160072k242625k305687k132594j993358k261103
$$ 750700057 748281956 746020496 743860424 741617799 739312112 737179518 735186160 732925057
3369.4G32925057k675116k650022k247811j997232j974583j966595j894355j726925
$$ 732925057 730249941 727599919 725352108 723354876 721380293 719413698 717519343 715792418
3385.7G15792418j446248j155078j169682j474142j501381j147330r63092j217723
$$ 715792418 714346170 713191092 712021410 710547268 709045887 707898557 706935465 705717742
3402.1G05717742j494884j360834j035273r04679r41932r78411r63330q64804p33017
$$ 705717742 704222858 702862024 701826751 700922072 699980140 699001729 698038399 697173595 696440578
3420.4F96440578o36101n01693l29673k29776k33948j98185q8692r5785j89066j55091
$$ 696440578 695804477 695302784 694973111 694743335 694509387 694311202 694222510 694126725 693937659 693782568
3440.8F93782568l9339K5868O6698R4116R9182J00732J74403L77953O40094Q70109
$$ 693782568 693743229 693769097 693835795 693929911 694029093 694129825 694304228 694682181 695322275 696192384
3461.2F96192384R74834R16242Q53598Q97825Q80063O68347M10616L09944M96865R75608
$$ 696192384 697167218 698083460 698937058 699834883 700714946 701383293 701793909 702103853 702600718 703576326
3481.6G03576326J372397J436830J385867J338959J276672J246512J261950J297891
$$ 703576326 704948723 706385553 707771420 709110379 710387051 711633563 712895513 714193404
3497.9G14193404J391053J483917J456201J403451J449466J491189J465142J390457
$$ 714193404 715584457 717068374 718524575 719928026 721377492 722868681 724333823 725724280
3514.2G25724280J340568J409113J499474J533926J486123J456618J566470J664698
$$ 725724280 727064848 728473961 729973435 731507361 732993484 734450102 736016572 737681270
3530.6G37681270J609265J539290J565159J568377J508355J457155J435518J408875
$$ 737681270 739290535 740829825 742394984 743963361 745471716 746928871 748364389 749773264
3546.9G49773264J351714J313031J382589J477361J495957J492024J494288J469493
$$ 749773264 751124978 752438009 753820598 755297959 756793916 758285940 759780228 761249721
3563.2G61249721J465976J611173J700998J595855J522421J573325J659810J752675
$$ 761249721 762715697 764326870 766027868 767623723 769146144 770719469 772379279 774131954
3579.5G74131954J839518J874566J804114J652717J670122J747370J731158J781344
$$ 774131954 775971472 777846038 779650152 781302869 782972991 784720361 786451519 788232863
3595.8G88232863J918971J927197J801789J692593J606882J647115J726567J654327
$$ 788232863 790151834 792079031 793880820 795573413 797180295 798827410 800553977 802208304
3612.1H02208304J564861J469254J412034J499534J430571J186192R73523R64641J234830
$$ 802208304 803773165 805242419 806654453 808153987 809584558 810770750 811744273 812708914 813943744
3630.5H13943744J281678J144410J036882R75013R53972Q88705P51019N86212O37650
$$ 813943744 815225422 816369832 817406714 818381727 819335699 820224404 820975423 821561635 822199285
3648.8H22199285Q40187O85513M70519N85556P01845M33803J58190J74940J71602N1200
$$ 822199285 823039472 823724985 824195504 824781060 825482905 825916708 826074898 826249838 826421440 826472640
3669.2H26472640J45793J08957j75535L7312L67284L73721L94106M72009M83334K58208
$$ 826472640 826618433 826727390 826551855 826589167 826956451 827330172 827724278 828196287 828679621 828937829
3689.6H28937829J20699L34740M25994K72214Q1242k563R4592J79351R7990m4167l875
$$ 828937829 829058528 829393268 829819262 830091476 830172718 830170155 830264747 830444098 830542088 830497921 830494046
3712.1H30494046K03490J93418P569j51276k06590j50323P630J41799Q5413l4272o2168
$$ 830494046 830697536 830890954 830898523 830747247 830540657 830390334 830397964 830539763 830625176 830590904 830528736
3734.5H30528736P4089K26915P0750l46720m23908J09553K24769O974P4744J71602
$$ 830528736 830602825 830829740 830900490 830553770 830129862 830239415 830464184 830471158 830545902 830717504
3754.9H30717504P5102j4126K7179L2723j8954k6286q3565j19687l9517N0783J03950
$$ 830717504 830792606 830778480 830805659 830838382 830819428 830793142 830709577 830589890 830550373 830601156 830705106
3777.3H30705106L2187q9526j23978p5042M2736O7532m0829j71244k04623j19567k12609
$$ 830705106 830737293 830647767 830523789 830448747 830491483 830559015 830518186 830346942 830142319 830022752 829810143
3799.8H29810143k67804L1710O9081k6345M8041J2100j36077j68324p1704j93238j73688
$$ 829810143 829542339 829574049 829643130 829616785 829664826 829676926 829540849 829372525 829300821 829107583 828933895
3822.2H28933895R2923O8069n0903r1791p5102J133j04308k75553q2433J27971R3222
$$ 828933895 829026818 829094887 829043984 828952193 828877091 828878224 828773916 828498363 828415930 828543901 828637123
3844.6H28637123j0848j04010l20494o69718l00348L11911K15710o0559k13980j43707
$$ 828637123 828626275 828522265 828201771 827532053 827231705 827543616 827759326 827698767 827484787 827341080
3865H27341080k6524j30415k10047j53184l7551P6652n2929j33515l6120q2672r3341
$$ 827341080 827314556 827184141 826974094 826820910 826783359 826860011 826807082 826673567 826637447 826554775 826461434
3887.5H26461434r1314j11937N7637J22667j10567l08991k46047j09256J2815O7949
$$ 826461434 826370120 826258183 826315820 826438487 826327920 826018929 825772882 825663626 825676441 825744390
3907.9H25744390Q166k2530k5332j42217k71201j99080n6386Tq8930l7670M17m887
$$ 825744390 825752556 825730026 825704694 825562477 825291276 825092196 825035810 824979424 824890494 824852824 824853241 824848354
3932.3H24848354m3690j74463k35617j18614m9233m0472K0862M9472M2915M5359J1445
$$ 824848354 824804664 824630201 824394584 824275970 824226737 824186265 824207127 824256599 824299514 824344873 824356318
3954.8H24356318l338K3961j3531m9412k98M7863K8372m6611q6129l3677j2993p5102
$$ 824356318 824352980 824376941 824363410 824313998 824313700 824361563 824389935 824343324 824257195 824223518 824210525 824135423
3979.3H24135423q9109o5089q8095j26124j69038j45436m6313l9577j12295
$$ 824135423 824046314 823981225 823893130 823767006 823597968 823452532 823406219 823366642 823254347
3997.6H23254347
$$ 823254347
##END=$$ End of the data block
