##TITLE=CSV-1 $$ Begin of the data block
##JCAMP-DX=5.00 $$ ACD/SpecManager v 10.08
##SPECTROMETER/DATA SYSTEM=Alpha
##DATE=21 Oct 2014 10:25:42
##DATA TYPE=INFRARED SPECTRUM
##DATA CLASS=XYDATA
##ORIGIN=
##OWNER=
##NPOINTS=1765
##FIRSTX=399.76428223
##LASTX=3997.64306641
##MAXX=3997.64306641
##MINX=399.76428223
##MAXY=0.86194962
##MINY=0.09881046
##XFACTOR=1.0000000000
##YFACTOR=1.000000000000000e-9
##FIRSTY=0.84254944
##DELTAX=2.03961372
##XUNITS=1/CM
##YUNITS=ARBITRARY UNITS
##XYDATA=(X++(Y..Y))
$$ plain form
399.8 842549443 837982595 833565116 837038279 842295945 840892494 838024616 840067208 842320204
416.1 842320204 839191496 835112929 834351599 830874979 823419392 817674756 811432958 796184003
432.4 796184003 771452487 744713843 724166572 711003065 703727722 707345068 718789160 719282746
448.7 719282746 698661447 675723910 681222200 720883071 768022895 794726431 800117791 797163844
465 797163844 800463557 810854077 817960918 818172395 813252568 801702797 789616466 790498316 802248776
483.4 802248776 809056342 805216134 798357666 796928227 800570846 804851949 812555552 823671699
499.7 823671699 830256045 830919266 830874562 829820991 825615108 820898473 817509651 812532723 806472063
518.1 806472063 806508482 814618886 823718965 828466237 830649137 831375360 827830315 820566595 812916279
$$ packed form
399.8H42549443m566848m417479L473163N257666j403451k867878K042592K252996
416.1H42320204l128708m078567p61330l476620p455587n744636o241798j5248955
432.4G96184003k4731516k6738644k0547271j3163507p275343L617346J1444092M93586
448.7G19282746k0621299k2937537N498290L9660871M7139824K6703536N391360k953947
465G97163844L299713J0390520P106841K11477m919827j1549771j2086331Q81850J1750460
483.4H02248776O807566l840208o858468j429439L642619M281103P703603J1116147
499.7H23671699O584346O63221m4704j053571m205883m716635l388822m976928o060660
518.1H06472063L6419Q110404R100079M747272K182900P26223l545045p263720p650316
$$ plain form
536.4 812916279 800013661 766940415 706873775 656069338 671565533 740656555 799724460
550.7 799724460 827668965 837783277 840024769 840729654 842489898 843059421 841762662 841446280 842233300
569.1 842233300 841220975 838463545 835629582 832225800 829328418 828867137 829363048 829537570 830408692
587.4 830408692 831758082 831632197 829175174 825886548 822295845 815795243 808696389 810263932 821339071
605.8 821339071 831742227 835366964 834342480 831565082 827924788 826043963 827552080 828385174
622.1 828385174 823257804 809757113 791072309 777607858 778667212 790093541 799311221 799447477
638.4 799447477 789813817 776049912 770619869 776342452 781858802 783889830 790664494 804173589
654.7 804173589 818837523 830241084 836969852 839069545 837533236 832958162 826974928 822747529
$$ packed form
536.4H12916279j2902618l3073246o0066640n0804437J5496195O9091022N9067905
550.7G99724460K7944505J0114312K241492P04885J760244N69523j296759l16382P87020
569.1H42233300j012325k757430k833963l403782k897382m61281M95911J74522Q71122
587.4H30408692J349390j25885k457023l288626l590703o500602p098854J567543J1075139
605.8H21339071J0403156L624737j024484k777398l640294j880825J508117Q33094
622.1H28385174n127370j3500691j8684804j3464451J059354J1426329R217680J36256
638.4G99447477r633660j3763905n430043N722583N516350K031028O774664J3509095
654.7H04173589J4663934J1403561O728768K099693j536309m575074n983234m227399
$$ plain form
671 822747529 818583429 813044012 803726017 785733879 755165696 712459505 670950413 654549956
687.3 654549956 670517862 694341004 692870557 663078308 642565846 659538925 693114042 705392301
703.7 705392301 679218054 619450808 557859898 547750592 607010663 692029476 755998969
717.9 755998969 790867627 807811797 815177143 815972388 811538935 801803648 785396814 767242193
734.3 767242193 762107790 778089523 803550601 823480427 835759282 844207168 849473953 851483166
750.6 851483166 852381527 853042901 851518571 846967220 840522408 831153035 815800786 792485178
766.9 792485178 759203732 717668355 689258814 704889834 758059382 807647407 832587242
781.2 832587242 841421783 844583392 843996167 838491440 828615308 814526737 794278562 766895473
$$ packed form
671H22747529m164100n539417r317995j7992138l0568183m2706191m1509092j6400457
687.3F54549956J5967906K3823142j470447k9792249k0512462J6973079L3575117J2278259
703.7G05392301k6174247n9767246o1590910j0109306N9260071Q5018813O3969493
717.9G55998969L4868658J6944170P365346P95245m433453r735287j6406834j8154621
734.3G67242193n134403J5981733K5461078J9929826J2278855Q447886N266785K009213
750.6H51483166Q98361O61374j524330m551351o444812r369373j5352249k3315608
766.9G92485178l3281446m1535377k8409541J5631020N3169548M9588025K4939835
781.2H32587242Q834541L161609n87225n504727r876132j4088571k0248175k7383089
$$ plain form
797.5 766895473 736042321 717758000 731178343 765352190 789718807 796968520 799385369 802535713
813.8 802535713 800903261 791708112 785231173 794337273 815873086 834687352 842671156 842822611
830.1 842822611 839707792 831385493 813089967 788897872 776766777 785830855 800521553 806554317
846.4 806554317 806360424 803397238 790308177 752183080 695673525 674097538 716128469 769166529
862.8 769166529 780838311 745724559 675440311 615607023 630713463 710604548 783771515
877 783771515 820484936 834126770 835522830 829476655 817554414 793477178 751025856 708572507
893.4 708572507 698620021 716750562 734566927 750967264 768609047 769016862 739692390 693811953
909.7 693811953 660479009 652580380 660373151 668791115 664553583 654106975 661106765 691354573
$$ packed form
797.5G66895473l0853152j8284321J3420343L4173847K4366617P249713K416849L150344
813.8H02535713j632452r195149o476939R106100K1535813J8814266P983804J51455
830.1H42822611l114819q322299j8295526k4192095j2131095R064078J4690698O032764
846.4H06554317j93893k963186j3089061l8125097n6509555k1575987M2030931N3038060
862.8G69166529J1671782l5113752p0284248n9833288J5106440P9891085P3166967
877G83771515L6713421J3641834J396060o046175j1922241k4077236m2451322m2453349
893.4G08572507r952486J8130541J7816365J6400337J7641783M07815k9324472m5880437
909.7F93811953l3332944p898629P792771Q417964m237532j0446608O999790L0247808
$$ plain form
926 691354573 727034271 751745582 765026271 774900615 785535097 795484781 803166509 808095276
942.3 808095276 806645691 792592168 767632604 751513183 761046112 782956719 796213090 798012733
958.6 798012733 791250587 775616050 751849592 721702397 693063617 683884025 703599274 737251580
974.9 737251580 763170898 774093449 774365306 770427704 767839372 767229855 763891280 754367173
991.3 754367173 736719847 709527254 678085744 652805150 632168710 604692400 571899772
1005.5 571899772 547271430 538319409 535355747 521123827 496272415 474753261 457416624 437502682
1021.8 437502682 427848607 453014225 513401210 582825840 639413595 679967284 709382832
1036.1 709382832 730351567 742330492 745148718 739634037 723797500 696602404 670514882 663901627
$$ packed form
926F91354573L5679698K4711311J3280689R874344J0634482R949684P681728M928767
942.3H08095276j449585j4053523k4959564j6119421R532929K1910607J3256371J799643
958.6G98012733o762146j5634537k3766458l0147195k8638780r179592J9715249L3652306
974.9G37251580K5919318J0922551K71857l937602k588332o09517l338575r524107
991.3G54367173j7647326k7192593l1441510k5280594k0636440k7476310l2792628
1005.5E71899772k4628342q952021k963662j4231920k4851412k1519154j7336637j9913942
1021.8D37502682r654075K5165618O0386985O9424630N6587755M0553689K9415548
1036.1G09382832K0968735J1978925K818226n514681j5836537k7195096k6087522o613255
$$ plain form
1052.4 663901627 671562374 667937040 639809430 592720151 542715132 516634464 532337308 571632266
1068.8 571632266 600548029 608961403 605233014 592481911 578664303 586671472 626020133 677015543
1085.1 677015543 716623008 738831758 749058247 752837539 750817716 741869450 727035642 707288444
1101.4 707288444 681742489 652810991 629320860 615594566 603281498 589833081 591269612
1115.7 591269612 617758155 656665683 691204727 716455281 733877063 744457722 749954700
1129.9 749954700 753279746 755315959 754913032 752430677 749648094 746452093 741267979 734076083
1146.3 734076083 725213766 714079201 702711463 693884194 686189473 676809907 664907098 650911272
1162.6 650911272 634051204 611632645 581919014 546650648 511790395 484072387 462833971
$$ packed form
1052.4F63901627P660747l625334k8127610m7089279n0005019k6080668J5702844L9294958
1068.8E71632266K8915763Q413374l728389j2751103j3817608Q007169L9348661N0995410
1085.1F77015543L9607465K2208750J0226489L779292k019823q948266j4833808j9747198
1101.4G07288444k5545955k8931498k3490131j3726294j2313068j3448417J436531
1115.7E91269612K6488543L8907528L4539044K5250554J7421782J0580659N496978
1129.9G49954700L325046K036213m02927k482355k782583l196001n184114p191896
1146.3G34076083q862317j1134565j1367738q827269p694721r379566j1902809j3995826
1162.6F50911272j6860068k2418559k9713631l5268366l4860253k7718008k1238416
$$ plain form
1176.9 462833971 440737516 414029896 383068919 347981602 314504594 295451015 292551249
1191.1 292551249 289700449 276269525 258036494 243688837 237826720 243684709 262344450 291186661
1207.5 291186661 327265680 367272377 404162377 431330770 448053300 457510799 464331985 472481549
1223.8 472481549 481122762 484924048 480931252 475035340 478031397 492903948 512259126 529557168
1240.1 529557168 545122862 560777545 573045909 575267255 564976633 546643674 527688026
1254.4 527688026 508534253 479549319 435903668 392941475 377108157 400581837 447740942
1268.6 447740942 489337146 507310033 500844955 475776285 437696218 393196255 350142270
1282.9 350142270 314777702 290085495 277558267 275618255 276613802 272187591 260502189 245092660
$$ packed form
1176.9D62833971k2096455k6707620l0960977l5087317l3477008j9053579k899766
1191.1B92551249k850800j3430924j8233031j4347657n862117N857989J8659741K8842211
1207.5B91186661L6079019M0006697L6890000K7168393J6722530R457499O821186Q149564
1223.8D72481549Q641213L801286l992796n895912K996057J4872551J9355178J7298042
1240.1E29557168J5565694J5654683J2268364K221346j0290622j8332959j8955648
1254.4E27688026j9153773k8984934m3645651m2962193j5833318K3473680M7159105
1268.6D47740942M1596204J7972887o465078k5068670l8080067m4499963m3053985
1282.9C50142270l5364568k4692207j2527228j940012R95547m426211j1685402j5409529
$$ plain form
1299.2 245092660 229421631 214313239 199407414 186104640 176317483 170298085 168447733 173773453
1315.6 173773453 189465120 214839086 245810449 279431969 315824836 355929494 399365336
1329.8 399365336 443262011 484019935 517719865 538455904 542417049 539831698 547955751 569155037
1346.2 569155037 592623949 610147893 620080948 622273088 616730213 606315672 598880231 602948785
1362.5 602948785 615558803 622925997 618952990 613708794 616611540 611728847 576851308 521864831
1378.8 521864831 464700520 416961551 404575735 441102207 476712316 460412920 425600022
1393.1 425600022 435066104 498666614 580363274 645522177 684435189 709258080 726607978
1407.3 726607978 739925623 752104998 763286114 772834420 781247437 788459659 792543352 793355465
$$ packed form
1299.2B45092660j5671029j5108392j4905825j3302774r787157o019398j850352N325720
1315.6A73773453J5691667K5373966L0971363L3621520L6392867M0104658M3435842
1329.8C99365336M3896675M0757924L3699930K0736039L961145k585351Q124053K1199286
1346.2E69155037K3468912J7523944R933055K192140n542875j0414541p435441M068554
1362.5F02948785J2610018P367194l973007n244196K902746m882693l4877539n4986477
1378.8E21864831n7164311m7738969j2385816L6526472L5610109j6299396l4812898
1393.1D25600022R466082O3600510Q1696660O5158903L8913012K4822891J7349898
1407.3G26607978J3317645J2179375J1181116R548306Q413017P212222M083693Q12113
$$ plain form
1423.7 793355465 791354835 786869109 780584216 776215196 777029514 781607032 784776986 783166409
1440 783166409 775882185 760213256 736982882 716771781 708850324 703528166 694396555 698742867
1456.3 698742867 729677081 756411374 770054042 779251695 787860274 797173321 807740867 818750620
1472.6 818750620 826817811 831483185 834035695 835085511 834814847 832889140 828175664 818666637
1488.9 818666637 803017437 783369243 759525478 739924312 750229836 784304738 813811302
1503.2 813811302 831247211 840948939 844013691 844485998 845175564 846489906 847729862 848469138 848924875
1521.6 848924875 848816454 848076880 847038925 846576214 846696734 846027076 844661713 844150186 844067693
1539.9 844067693 842687726 840520859 838493168 836754620 834811687 832692921 830926895 829350710
$$ packed form
1423.7G93355465k000630m485726o284893m369020Q14318M577518L169954j610577
1440G83166409p284224j5668929k3230374k0211101p921457n322158r131611M346312
1456.3F98742867L0934214K6734293J3642668R197653Q608579R313047J0567546J1009753
1472.6H18750620Q067191M665374K552510J049816k70664j925707m713476r509027
1488.9H18666637j5649200j9648194k3843765j9601166J0305524L4074902K9506564
1503.2H13811302J7435909R701728L064752M72307O89566J314342J239956P39276M55737
1521.6H48924875j08421p39574j037955m62711J20520o69658j365363n11527q2493
1539.9H44067693j379967k166867k027691j738548j942933k118766j766026j576185
$$ plain form
1556.2 829350710 825140357 816517830 808638871 799620867 787324250 771954596 755590320 744979739
1572.6 744979739 742730498 749991536 759875596 760669112 747962296 727706909 710955620 699246228
1588.9 699246228 688591421 678966761 671192467 663359106 652234614 636589110 619642317 606370449
1605.2 606370449 599442780 599834263 604872823 608277917 606064022 601779044 606029928 624829113
1621.5 624829113 658821166 695137620 723713458 744381666 757703781 767470539 776150227 781542003
1637.8 781542003 784589708 787507653 790719867 794340551 797712624 800126612 802421927 803753495
1654.1 803753495 803697705 804033637 804883659 805664659 805933654 806023121 805350363 802942574 799659729 795635939
1674.5 795635939 790436983 785347581 780901790 775795937 767402470 757816195 748305619 736992717
$$ packed form
1556.2H29350710m210353q622527p878959r018004j2296617j5369654j6364276j0610581
1572.6G44979739k249241P261038R884060P93516j2706816k0255387j6751289j1709392
1588.9F99246228j0654807r624660p774294p833361j1124492j5645504j6946793j3271868
1605.2F06370449o927669L91483N038560L405094k213895m284978M250884J8799185
1621.5F24829113L3992053L6316454K8575838K0668208J3322115R766758Q679688N391776
1637.8G81542003L047705K917945L212214L620684L372073K413988K295315J331568
1654.1H03753495n5790L35932Q50022P81000K68995Q9467o72758k407789l282845m023790
1674.5G95635939n198956n089402m445791n105853q393467r586275r510576j1312902
$$ plain form
1690.9 736992717 725060761 711222589 696779370 683734298 667139113 649103582 628825665
1705.1 628825665 603695512 576092184 545561373 512002945 475252569 433017790 392096192
1719.4 392096192 356313348 317376018 274487436 233175099 194779411 159602031 124719046
1733.7 124719046 101610810 98810457 108988404 128239065 154908463 188431308 230418816
1748 230418816 283431023 337582350 378039420 406152248 424257398 429561615 422270417 406153262
1764.3 406153262 384706527 358865768 332279474 309831947 302416831 313685566 335222244
1778.6 335222244 355843067 365908533 365144521 361106336 362944543 381179333 422648877 473193854
1794.9 473193854 519953132 563618779 602888405 634807110 659865141 680673003 698419631
$$ packed form
1690.9G36992717j1931956j3838172j4443219j3045072j6595185j8035531k0277917
1705.1F28825665k5130153k7603328l0530811l3558428l6750376m2234779m0921598
1719.4C92096192l5782844l8937330m2888582m1312337l8395688l5177380l4882985
1733.7A24719046k3108236k800353J0177947J9250661K6669398L3522845M1987508
1748B30418816N3012207N4151327M0457070K8112828J8105150N304217p291198j6117155
1764.3D06153262k1446735k5840759k6586294k2447527p415116J1268735K1536678
1778.6C35222244K0620823J0065466p64012m038185J838207J8234790M1469544N0544977
1794.9D73193854M6759278M3665647L9269626L1918705K5058031K0807862J7746628
$$ plain form
1809.2 698419631 713312984 725099623 734462380 742790163 750435174 757164180 763035595 768467903
1825.5 768467903 773514211 778515279 783023179 786834657 790659785 794656694 798554957 802387178
1841.8 802387178 806324303 809594333 811879158 813759983 815629303 817327797 818707407 819889307
1858.1 819889307 821011066 821889639 822507083 823462427 824963331 826327980 827107012 827741265 828301549
1876.5 828301549 828488052 828231215 827961564 828126669 828869700 830259323 832103670 833988070 835472286
1894.8 835472286 836518347 837560713 838838279 839895964 840428650 840764821 841218054 841764987 842386067
1913.2 842386067 843159795 843748868 843838274 843761086 843877316 843989789 844007432 844296992 845068216 845881402
1933.6 845881402 846237302 846365035 846619070 846605241 845562994 843977213 843418062 844642341 846677899
$$ packed form
1809.2F98419631J4893353J1786639R362757Q327783P645011O729006N871415N432308
1825.5G68467903N046308N001068M507900L811478L825128L996909L898263L832221
1841.8H02387178L937125L270030K284825J880825J869320J698494J379610J181900
1858.1H19889307J121759Q78573O17444R55344J500904J364649P79032O34253N60284
1876.5H28301549J86503k56837k69651J65105P43031J389623J844347J884400J484216
1894.8H35472286J046061J042366J277566J057685N32686L36171M53233N46933O21080
1913.2H42386067P73728N89073Q9406p7188J16230J12473J7643K89560P71224Q13186
1933.6H45881402L55900J27733K54035j3829j042247j585781n59151J224279K035558
$$ plain form
1951.9 846677899 848240137 848909020 848704636 848075151 847665310 847548366 847427189 847725272 849066317
1970.3 849066317 850902021 852135479 852718592 853506923 854709208 855674326 856086254 856409132 856904864
1988.7 856904864 857281744 857439578 857757151 858290732 858594179 858651698 858910322 859343886 859482944 859370708
2009 859370708 859418988 859541237 859373093 859048486 858933270 858835340 858351767 857711971 857383847 857173026
2029.4 857173026 856749594 856496871 856832564 857353270 857577384 857729733 858063281 858233750 857969820 857690215
2049.8 857690215 857742548 857808113 857676566 857735574 858156502 858496845 858580470 858781636 859163165 859244406
2070.2 859244406 858921349 858682930 858625829 858316839 857786179 857534409 857547820 857415318 857270539 857583284
2090.6 857583284 858155191 858407617 858435929 858724058 859104753 859088659 858887196 858938217 858985901 858630598
$$ packed form
1951.9H46677899J562238O68883k04384o29485m09841j16944j21177K98083J341045
1970.3H49066317J835704J233458N83113P88331J202285R65118M11928L22878M95732
1988.7H56904864L76880J57834L17573N33581L03447N7519K58624M33564J39058j12236
2009H59370708M8280J22249j68144l24607j15216r7930m83573o39796l28124k10821
2029.4H57173026m23432k52723L35693N20706K24114J52349L33548J70469k63930k79605
2049.8H57690215N2333O5565j31547N9008M20928L40343Q3625K01166L81529Q1241
2070.2H59244406l23057k38419n7101l08990n30660k51770J3411j32502j44779L12745
2090.6H57583284N71907K52426K8312K88129L80695j6094k01463N1021M7684l55303
$$ plain form
2111 858630598 858159661 857935607 857657969 857005179 856339872 856062770 855909765 855645001 855639935 856133401
2131.4 856133401 856687844 857024491 857506037 858266652 858842969 859091640 859481692 860119998 860558212 860705733
2151.8 860705733 861004651 861480474 861658096 861565828 861685753 861949623 861880660 861582518 861535668 861683190
2172.2 861683190 861602962 861400843 861439407 861502051 861207128 860804737 860690475 860674322 860472322 860277474
2192.6 860277474 860328794 860370696 860135674 859893203 859924018 859956920 859716654 859451056 859351397 859128177
2213 859128177 858622313 858198047 857992768 857629776 857051611 856669247 856540382 856277108 855821788 855544031
2233.4 855544031 855519593 855428219 855245411 855248928 855366945 855248034 854972899 854898095 854985356 854961812 854846299
2255.8 854846299 854810596 854674697 854179561 853511751 852991283 852563620 852080762 851748645 851773977 851926267
$$ packed form
2111H58630598m70937k24054k77638o52790o65307k77102j53005k64764n066M93466
2131.4H56133401N54443L36647M81546P60615N76317K48671L90052O38306M38214J47521
2151.8H60705733K98918M75823J77622r2268J19925K63870o8963k98142m6850J47522
2172.2H61683190q0228k02119L8564O2644k94923m02391j14262j6153k02000j94848
2192.6H60277474N1320M1902k35022k42471L0815L2902k40266k65598r9659k23220
2213H59128177n05864m24266k05279l62992n78165l82364j28865k63274m55320k77757
2233.4H55544031k4438r1374j82808L517J18017j18911k75135p4804Q7261k3544j15513
2255.8H54846299l5703j35899m95136o67810n20468m27663m82858l32117K5332J52290
$$ plain form
2276.2 851926267 851980865 852111518 852422178 852626979 852509916 852337480 852340877 852314889 852146864 852043867
2296.6 852043867 852029741 851779222 851123929 850261450 849426091 848623931 847776830 847003341 846425474 845918834
2317 845918834 845509708 845480204 845842183 846266747 846542478 846823394 847213387 847403407 847157419 846643507
2337.4 846643507 846113265 845825076 846226811 847571135 849004090 849363446 848442316 846867800 845418215
2355.8 845418215 844327092 843578160 843221068 843264818 843652904 844318151 845093369 845703423 846104383 846580803
2376.2 846580803 847323060 848211646 849041104 849747479 850317121 850734711 851131380 851691604 852366626 852964640
2396.6 852964640 853442490 853857219 854169488 854308128 854328573 854300201 854199171 853972971 853638411 853267729
2417 853267729 852913141 852664530 852594733 852647364 852717757 852762520 852766573 852714181 852582514 852353454 852062047
$$ packed form
2276.2H51926267N4598J30653L10660K04801j17063j72436L397k5988j68025j02997
2296.6H52043867j4126k50519o55293q62479q35359q02160q47101p73489n77867n06640
2317H45918834m09126k9504L61979M24564K75731K80916L89993J90020k45988n13912
2337.4H46643507n30242k88189M01735J344324J432955L59356r21130j574516j449585
2355.8H45418215j091123p48932l57092M3750L88086O65247P75218O10054M00960M76420
2376.2H46580803P42257Q88586Q29458P06375N69642M17590L96669N60224O75022N98014
2396.6H52964640M77850M14729L12269J38640K0445k8372j01030k26200l34560l70682
2417H53267729l54588k48611o9797N2631P0393M4763M053n2392j31667k29060k91407
$$ plain form
2439.4 852062047 851789951 851627946 851597250 851602256 851537943 851386666 851174891 850954950 850775182 850650012
2459.8 850650012 850594938 850611269 850638211 850594103 850460052 850253165 850037277 849903166 849863172 849852324 849814713
2482.2 849814713 849758446 849681377 849540651 849346757 849167407 849023044 848890960 848765433 848669946 848590434
2502.6 848590434 848456144 848271012 848119259 848038137 847994924 847962141 847918153 847814083 847633600 847478807
2523 847478807 847462118 847555816 847685158 847842395 847997665 848029256 847922683 847825229 847787440 847723484 847640157
2545.5 847640157 847670913 847830176 847962081 847996831 848011792 848017812 847935498 847774565 847631335 847514808 847356677
2567.9 847356677 847174764 847039819 846906245 846688986 846472681 846393347 846430302 846496463 846591592 846714914
2588.3 846714914 846737206 846581757 846407712 846396685 846493781 846565187 846629322 846733272 846816301 846830964 846862435
$$ packed form
2439.4H52062047k72096j62005l0696N006o4313j51277k11775k19941j79768j25170
2459.8H50650012n5074J6331K6942m4108j34051k06887k15888j34111l9994j0848l7611
2482.2H49814713n6267p7069j40726j93894j79350j44363j32084j25527r5487p9512
2502.6H48590434j34290j85132j51753q1122m3213l2783m3988j04070j80483j54793
2523H47478807j6689R3698J29342J57237J55270L1591j06573r7454l7789o3956q3327
2545.5H47640157L0756J59263J31905L4750J4961O020q2314j60933j43230j16527j58131
2567.9H47356677j81913j34945j33574k17259k16305p9334L6955O6161R5129J23322
2588.3H46714914K2292j55449j74045j1027R7096P1406O4135J03950Q3029J4663L1471
$$ plain form
2610.7 846862435 846982956 847088099 847101808 847116470 847147226 847058892 846805394 846509576 846239507 845911622
2631.1 845911622 845557451 845361710 845295429 845134556 844860196 844682038 844677925 844718933 844808996 845076501
2651.5 845076501 845437348 845693052 845838428 846008122 846188128 846261680 846272051 846301913 846253216 846037865
2671.9 846037865 845795870 845691383 845639706 845496655 845380366 845471323 845659554 845752835 845805109 845895410
2692.3 845895410 845915258 845824540 845759273 845774770 845743358 845593929 845417321 845243812 845008254 844806552
2712.7 844806552 844825625 844990551 845056951 844975293 844875097 844744265 844431341 843975008 843567908 843233287
2733.1 843233287 842841327 842328668 841739416 841222107 840928614 840814531 840717256 840477884 840004325 839487195
2753.5 839487195 839278936 839444935 839796603 840239406 840713561 841038048 841130912 841088474 840901911 840475202
$$ packed form
2610.7H46862435J20521J05143J3709J4662L0756q8334k53498k95818k70069l27885
2631.1H45911622l54171j95741o6281j60873k74360j78158m113M1008R0063K67505
2651.5H45076501L60847K55704J45376J69694J80006P3552J0371K9862m8697k15351
2671.9H46037865k41995j04487n1677j43051j16289R0957J88231R3281N2274R0301
2692.3H45895410J9848r0718o5267J5497l1412j49429j76608j73509k35558k01702
2712.7H44806552J9073J64926O6400q1658j00196j30832l12924m56333m07100l34621
2733.1H43233287l91960n12659n89252n17309k93493j14083r7275k39372m73559n17130
2753.5H39487195k08259J65999L51668M42803M74155L24487R2864m2438j86563m26709
$$ plain form
2773.9 840475202 839944065 839578271 839438319 839380383 839314520 839225173 839054942 838782072 838488281 838236332
2794.3 838236332 837933302 837483764 836965144 836491048 836025238 835483849 834959507 834559262 834193945 833829045
2814.7 833829045 833559752 833388865 833204627 832925022 832623363 832343996 831915140 831207395 830304146 829264879
2835.1 829264879 827991128 826274216 823940814 820813119 816301823 809349477 798427165 780187905
2851.4 780187905 747260749 692221224 624569833 580811918 593522012 650734544 712350667
2865.7 712350667 754957199 779310644 792910874 800787032 805362284 808068812 809879303 811203539
2882 811203539 812050521 812220275 811591268 810225248 807911575 803820848 795983195 781240463 759611845
2900.3 759611845 740376711 735507548 744954109 758864582 771119297 781360865 789832115 796082139
$$ packed form
2773.9H40475202n31137l65794j39952n7936o5863q9347j70231k72870k93791k51949
2794.3H38236332l03030m49538n18620m74096m65810n41389n24342m00245l65317l64900
2814.7H33829045k69293j70887j84238k79605l01659k79367m28856p07745r03249j039267
2835.1H29264879j273751j716912k333402l127695m511296o952346j0922312j8239260
2851.4G80187905l2927156n5039525o7651391m3757915J2710094N7212532O1616123
2865.7G12350667M2606532K4353445J3600230P876158M575252K706528J810491J324236
2882H11203539Q46982J69754o29007j366020k313673m090727p837653j4742732k1628618
2900.3G59611845j9235134m869163R446561J3910473J2254715J0241568Q471250O250024
$$ plain form
2916.6 796082139 800077200 802431703 803826749 804693043 805328012 805813849 805782378 804860175 802986860
2935 802986860 800015390 795406461 788476229 778997302 768128812 759004772 755357623 758280754
2951.3 758280754 764981210 772344530 779832304 787675202 795056283 800863802 804837465 807507694
2967.6 807507694 809388697 810642600 811279416 811305821 810708165 809301317 806799293 803235054 799000204
2986 799000204 794339836 788525462 778667867 759880960 731354892 704895318 696831703 708260655
3002.3 708260655 727640748 747095942 763444364 774472594 780100226 782138467 782436430 781666160
3018.6 781666160 780803025 782614052 788052857 793868959 796903551 796774447 794161201 790029645 786089540
3037 786089540 784271657 785516620 789182603 793211937 795616090 795947731 794435859 790764749 785441220
$$ packed form
2916.6G96082139L995061K354503J395046Q66294O34969M85837l1471r22203j873315
2935H02986860k971470m608929o930232r478927j0868490r124040l647149K923131
2951.3G58280754O700456P363320P487774P842898P381081N807519L973663K670229
2967.6H07507694J881003J253903O36816K6405n97656j406848k502024l564239m234850
2986G99000204m660368n814374r857595j8786907k8526068k6459574q063615J1428952
3002.3G08260655J9380093J9455194J6348422J1028230N627632K038241K97963p70270
3018.6G81666160q63135J811027N438805N816102L034592j29104k613246m131556l940105
3037G86089540j817883J244963L665983M029334K404153L31641j511872l671110n323529
$$ plain form
3055.3 785441220 781381965 781085908 783410668 785925806 787717879 788939297 790264964 792348862
3071.7 792348862 795076132 798236191 802020252 805957437 808974743 810791910 811955869 812928200
3088 812928200 813567519 813538492 813059449 812644541 812550485 812716961 812967420 813332260 813937366 814579368
3108.4 814579368 814881444 814947546 815151930 815466881 815726399 815790713 815579414 815380991 815461874 815659761
3128.8 815659761 815688133 815503895 815301955 815218151 815078139 814663231 814125538 813687146 813271582 812860727
3149.2 812860727 812580228 812294483 811825275 811288357 810829937 810397327 809881091 809332192 808873177 808515847
3169.6 808515847 808201075 807903647 807645917 807380140 807016432 806550562 805976331 805238783 804378629 803494453
3189.9 803494453 802630007 801809847 801068008 800426304 799820304 799148202 798422813 797709227 796993196 796255708
$$ packed form
3055.3G85441220m059255k96057K324760K515138J792073J221418J325667K083898
3071.7G92348862K727270L160059L784061L937185L017306J817167J163959R72331
3088H12928200O39319k9027m79043m14908r4056J66476K50459L64840O05106O42002
3108.4H14579368L02076O6102K04384L14951K59518O4314k11299j98423Q0883J97887
3128.8H15659761K8372j84238k01940q3804j40012m14908n37693m38392m15564m10855
3149.2H12860727k80499k85745m69208n36918m58420m32610n16236n48899m59015l57330
3169.6H08515847l14772k97428k57730k65777l63708m65870n74231p37548q60154q84176
3189.9H03494453q64446q20160p41839o41704o06000o72102p25389p13586p16031p37488
$$ plain form
3210.3 796255708 795555353 794960737 794461429 794007659 793574750 793078125 792432487 791660488 790825248 790013313
3230.7 790013313 789236784 788361907 787339687 786295116 785334349 784478605 783750355 783112705 782431066
3249.1 782431066 781694472 781042635 780478060 779856384 779179931 778543770 777935684 777361572 776980340 776824057
3269.5 776824057 776538312 775914252 775154889 774392009 773632526 772930026 772307932 771709979 771132827 770650268
3289.9 770650268 770119905 769281447 768160880 766946554 765844882 765055478 764522374 763855815 762699842
3308.2 762699842 761130273 759521604 758097231 756748140 755326092 753861308 752452374 751059473
3324.6 751059473 749432206 747551084 745707154 743979812 742305696 740688920 738941312 736891747
3340.9 736891747 734656870 732351184 730112016 728066087 725937366 723484635 720967710 718572438
$$ packed form
3210.3G96255708p00355n94616m99308m53770m32909m96625o45638p71999q35240q11935
3230.7G90013313p76529q74877j022220j044571r60767q55744p28250o37650o81639
3249.1G82431066p36594o51837n64575o21676o76453o36161o08086n74112l81232j56283
3269.5G76824057k85745o24060p59363p62880p59483p02500o22094n97953n77152m82559
3289.9G70650268n30363q38458j120567j214326j101672p89404n33104o66559j155973
3308.2G62699842j569569j608669j424373j349091j422048j464784j408934j392901
3324.6G51059473j627267j881122j843930j727342j674116j616776j747608k049565
3340.9G36891747k234877k305686k239168k045929k128721k452731k516925k395272
$$ plain form
3357.2 718572438 716196954 713736892 711256981 708939373 706683815 704200566 701453388 698716223
3373.5 698716223 696266413 694112122 692069829 689994454 687912941 685960829 684241652 682731986
3389.8 682731986 681212127 679548800 677964807 676691771 675629795 674452424 673073292 671783090
3406.1 671783090 670725226 669754684 668767631 667783320 666859090 666055858 665315390 664541900 663826466
3424.5 663826466 663270175 662803888 662345350 661905944 661468804 660994291 660545945 660179913 659769237 659220040
3444.9 659220040 658666790 658306658 658240795 658411384 658690453 658966243 659208834 659458637 659674525 659843504
3465.3 659843504 660237491 661260605 663011253 665187061 667364001 669303894 671104848 672873199
3481.6 672873199 674356520 675451159 676378429 677191675 677772999 678093433 678324401 678707123 679342747
$$ packed form
3357.2G18572438k375484k460062k479911k317608k255558k483249k747178k737165
3373.5F98716223k449810k154291k042293k075375k081513j952112j719177j509666
3389.8F82731986j519859j663327j583993j273036j061976j177371j379132j290202
3406.1F71783090j057864r70542r87053r84311r24230q03232p40468p73490p15434
3424.5F63826466n56291m66287m58538m39406m37140m74513m48346l66032m10676n49197
3444.9F59220040n53250l60132o5863J70589K79069K75790K42591K49803K15888J68979
3465.3F59843504L93987J023114J750648K175808K176940J939893J800954J768351
3481.6F72873199J483321J094639R27270Q13246N81324L20434K30968L82722O35624
$$ plain form
3500 679342747 680203080 681311488 682642937 684111178 685717404 687542915 689600646 691728771 693888962
3518.3 693888962 696173072 698520720 700735211 702752471 704666018 706451595 708058298 709598184
3534.6 709598184 711140096 712628305 714154840 715893567 717864215 719836533 721569300 723192751
3551 723192751 724869370 726458132 727975249 729649901 731526315 733549237 735718608 737834334 739530623
3569.3 739530623 741041780 742807329 744877517 747063041 749164104 751161397 753274500 755668163
3585.6 755668163 757979870 759726405 761322141 763223648 765173316 766983688 768828809 770658910
3601.9 770658910 772415996 774316728 776382208 778304100 780038953 781691968 783253431 784762263
3618.3 784762263 786072850 787172735 788419187 789929271 791524887 792708278 793456197 794245899 795177579
$$ packed form
3500F79342747Q60333J108408J331449J468241J606226J825511K057731K128125K160191
3518.3F93888962K284110K347648K214491K017260J913547J785577J606703J539886
3534.6G09598184J541912J488209J526535J738727J970648J972318J732767J623451
3551G23192751J676619J588762J517117J674652J876414K022922K169371K115726J696289
3569.3G39530623J511157J765549K070188K185524K101063J997293K113103K393663
3585.6G55668163K311707J746535J595736J901507J949668J810372J845121J830101
3601.9G70658910J757086J900732K065480J921892J734853J653015J561463J508832
3618.3G84762263J310587J099885J246452J510084J595616J183391P47919P89702R31680
$$ plain form
3636.6 795177579 796215892 797315061 798374891 799516201 800894201 802123606 802527130 802488863 802790046
3655 802790046 803540111 804202378 804558337 804877281 805375159 806000888 806630731 807121873 807371616 807299435
3675.4 807299435 806928158 806677341 806725740 807052135 807729542 808770061 809523880 809471488 809311390 809443951
3695.8 809443951 809655190 809825540 810021996 810227811 810441673 810744822 811041772 810986817 810519516 810037017
3716.2 810037017 809864223 810050011 810318351 810411036 810344398 810234249 810291171 810753047 811460376 811917841
3736.5 811917841 811988831 811878324 811764896 811719656 811676443 811639726 811621487 811447442 811207056 811093390
3756.9 811093390 811015666 810809314 810648203 810692847 810691357 810452163 810091496 809806526 809805214 810094059 810325623
3779.4 810325623 810283482 810198128 810131848 809992850 809897959 809893906 809902370 809977829 810130417 810225070 810161293
$$ packed form
3636.6G95177579J038313J099169J059830J141310J378000J229405M03524l8267L01183
3655H02790046P50065O62267L55959L18944M97878O25729O29843M91142K49743p2181
3675.4H07299435l71277k50817M8399L26395O77407J040519P53819n2392j60098J32561
3695.8H09443951K11239J70350J96456K05815K13862L03149K96950n4955m67301m82499
3716.2H10037017j72794J85788K68340R2685o6638j10149N6922M61876P07329M57465
3736.5H11917841P0990j10507j13428m5240m3213l6717j8239j74045k40386j13666
3756.9H11093390p7724k06352j61111M4644j490k39194l60667k84970j312K88845K31564
3779.4H10325623m2141q5354o6280j38998r4891m053Q464P5459J52588R4653o3777
$$ plain form
3801.8 810161293 809897006 809642196 809489369 809275627 809120238 809237361 809523344 809683979 809647858 809363186
3822.2 809363186 808921695 808611095 808521330 808588386 808756948 808987916 809114695 808986664 808723390 808417141
3842.6 808417141 808132827 808005393 808058381 808178782 808158517 807837725 807383835 807054877 807016075 807128191
3863 807128191 807089686 806918621 806737244 806465983 806106925 805837631 805770576 805889964 806016386 806043267
3883.4 806043267 806001723 805776477 805481970 805310965 805213153 805200100 805325806 805482805 805513620 805338919
3903.8 805338919 804980159 804605305 804375708 804254413 804147363 804105520 804071844 803875625 803600371 803414941
3924.2 803414941 803265750 803065300 802865863 802645326 802330613 802005470 801795363 801719248 801674962 801598668
3944.6 801598668 801584780 801650107 801686704 801636875 801530004 801486135 801515281 801516652 801532507 801633000 801768541
$$ packed form
3801.8H10161293k64287k54810j52827k13742j55389J17123K85983J60635l6121k84672
3822.2H09363186m41491l10600q9765O7056J68562K30968J26779j28031k63274l06249
3842.6H08417141k84314j27434N2988J20401k0265l20792m53890l28958l8802J12116
3863H07128191l8505j71065j81377k71261l59058k69294o7055J19388J26422K6881
3883.4H06043267m1544k25246k94507j71005r7812j3053J25706J56999L0815j74701
3903.8H05338919l58760l74854k29597j21295j07050m1843l3676j96219k75254j85430
3924.2H03414941j49191k00450j99437k20537l14713l25143k10107p6115m4286p6294
3944.6H01598668j3888O5327L6597m9829j06871m3869K9146J371J5855J00493J35541
$$ plain form
3967 801768541 801867843 801937342 802009761 802047491 801980853 801861942 801828742 801811457 801637709 801346064 801059186
3989.5 801059186 800767243 800392151 800013900 799769580
3997.6 799769580
$$ packed form
3967H01768541R9302O9499P2419L7730o6638j18911l3200j7285j73748k91645k86878
3989.5H01059186k91943l75092l78251k44320
3997.6G99769580
##END=$$ End of the data block
