##TITLE=CP HOMO $$ Begin of the data block
##JCAMP-DX=5.00 $$ ACD/SpecManager v 10.08
##SPECTROMETER/DATA SYSTEM=Alpha
##DATE=03 Dec 2014 11:51:08
##DATA TYPE=INFRARED SPECTRUM
##DATA CLASS=XYDATA
##ORIGIN=
##OWNER=
##NPOINTS=1765
##FIRSTX=399.76428223
##LASTX=3997.64306641
##MAXX=3997.64306641
##MINX=399.76428223
##MAXY=1.00058889
##MINY=0.54137838
##XFACTOR=1.0000000000
##YFACTOR=0.000000010000000
##FIRSTY=1.00000000
##DELTAX=2.03961372
##XUNITS=1/CM
##YUNITS=ARBITRARY UNITS
##XYDATA=(X++(Y..Y))
399.8A00000000o6483J25372n8889j64682k2107O765k38401l01617j23674j08015k77615
422.2I8770654j92886k0796j32317k57277l5340J68884l0017k09790m3971L4344j82122
444.6I7869366k45040p5394j46771m71288n89370n07224l63046K7323N69898P89416
465I6857870M60130P5459Q0091J58650o2156j94264j2928K1786k27708k66463l7676
487.5I6852791n7602l25071l44646j85591l05230n80156o27285n75960q08149j146329
507.9I1896772j217401j179772j117784n67544O30719J532799J399302R35698Q36080
526.2I3148869Q07005O11258N72151O98703O01334K81048J73473K87735K20258J3971
546.6I7415805L7438J77794Q7685r4498l6889J04284J3984j27900l9750P2950l8898
$$ plain form
399.8 100000000 99933517 100058889 100000000 99835318 99813211 99819976 99581575 99279958 99156284 99048269 98770654
422.2 98770654 98577768 98556972 98424655 98167378 98132038 98300922 98270905 98061115 98017144 98051488 97869366
444.6 97869366 97624326 97548932 97402161 96930873 96341503 95834279 95471233 95498556 96068454 96857870
465 96857870 97318000 97393459 97473550 97632200 97570044 97375780 97362852 97384638 97156930 96890467 96852791
487.5 96852791 96795189 96470118 96125472 95939881 95634651 95054495 94427210 93851250 93043101 91896772
507.9 91896772 90679371 89499599 88381815 87814271 88444990 89977789 91377091 92312789 93148869
526.2 93148869 93955874 94567132 95139283 95837986 96439320 96720368 96893841 97181576 97401834 97415805
546.6 97415805 97453243 97631037 97718722 97624224 97587335 97691619 97705603 97577703 97537953 97610903 97572005
569.1I7572005j57494p9435l7133j87302k68883j59025j26463k73281l26091k09552
589.4I5747346j86915k98959k62808m9013L6388m6759j6284J27041P5257j37472j74112
611.9I4813710r0986k10309m12697l33571p5996N0843J31505L76380N70470M57180
632.3I5276529K75868L43269M63885L59666K41214L45320M13364K34514J27161K78026
652.7I8358816L22264J01543J1086J61350J47796r0802k07746m9299r4521l92401m52775
675.1I7815311j52439J32668K49976L92646M77731K56109l8189j9198J03855j6332
695.5I9202138j54370J460J71936L1751j29336j4442P5281j03069k02483j4305Q0699
717.9I8945260q8698j32930P0554J29831m2242n2696J65772J91081k2197m5073J39922
$$ plain form
569.1 97572005 97414511 97335076 97297943 97110641 96841758 96682733 96556270 96282989 95956898 95747346
589.4 95747346 95560431 95261472 94998664 94949651 94986039 94939280 94922996 95050037 95125294 94987822 94813710
611.9 94813710 94722724 94512415 94099718 93766147 93690151 93740994 93872499 94248879 94819349 95276529
632.3 95276529 95552397 95895666 96359551 96719217 96960431 97305751 97719115 97953629 98080790 98358816
652.7 98358816 98681080 98782623 98793709 98955059 99102855 99012053 98804307 98755008 98660487 98268086 97815311
675.1 97815311 97662872 97795540 98045516 98438162 98915893 99172002 99133813 99114615 99218470 99202138
695.5 99202138 99047768 99049228 99221164 99252915 99123579 99109137 99184418 99081349 98878866 98864561 98945260
717.9 98945260 98856562 98723632 98794186 98924017 98881775 98829079 98994851 99185932 99163735 99118662 99258584
740.4I9258584J26600n5969k0694J58244J03229p6687r239J62184P9650q1062J7130
762.8I9661970J65117M0227j35481o7038J9080j08010j57147P3909K35379R6971k0754
785.3I9804223Q9532J33186m2039j15293M1813Q8578m0621q4739M6551K4199j76692
807.7I9768698k39521j65385k68155n36597p01499r19092j620030k250588j232505
826I1835326J123738K258152J512074M68994j08129k10983K56861Q03059P85881L59702
846.4I9084675J9420o1584p6127j88446k48015j26410J7679M5818Q2773J86831J50615
868.9I8887229r4003k86507k77543k43485l25805m24117m86159o79833j089686j580316
889.3I3399775j999551k053815j225478L62480J573134J617854R06933J79100k78950
$$ plain form
740.4 99258584 99385184 99329215 99308521 99466765 99569994 99493307 99484068 99646252 99725902 99644840 99661970
762.8 99661970 99827087 99867314 99731833 99664795 99683875 99575865 99418718 99492627 99728006 99824977 99804223
785.3 99804223 99893755 100026941 99984902 99869609 99911422 100000000 99959379 99874640 99921191 99945390 99768698
807.7 99768698 99529177 99363792 99095637 98559040 97857541 96938449 95318419 93067831 91835326
826 91835326 92959064 95217216 96729290 97198284 97090155 96879172 97136033 97939092 98724973 99084675
846.4 99084675 99104095 99042511 98966384 98777938 98529923 98403513 98421192 98467010 98549783 98736614 98887229
868.9 98887229 98793226 98506719 98229176 97985691 97659886 97235769 96749610 96069777 94980091 93399775
889.3 93399775 91400224 89346409 88120931 88483411 90056545 91674399 92581332 92760432 92481482
907.6I2481482l49557J25152Q05640J018524O28281O896n36907r91267j353747j201516
928I0632981l06791N00041L91978r2458K3061O02656P57539K46734m45348j006305
948.4I1304088j362062j260573o33299o8706j22726n41061q09366r19455j102710j354295
968.8H3129835j635444k143103k897519l180373k026575M07815K764821M069733M339832
987.2H2829022L855342K925527K000499J357937Q98874M90123K18576J23846K2227
1005.5I4721973j70368k90650k85691l33953m81987n61982n53644o33907q28338r85271
1025.9H9596182j119947j396263j776159k070009k321178k747065l211117l158432
1042.2G1796012k347809j392245j102478j453680j756864j527787p53837K88599J227141
$$ plain form
907.6 92481482 92131925 92257077 93062717 94081241 94709522 94716418 94179511 93188244 91834497 90632981
928 90632981 90326190 90826231 91218209 91125751 91148812 91751468 92509007 92755741 92310393 91304088
948.4 91304088 89942026 88681453 88048154 87979448 87856722 87315661 86506295 85586840 84484130 83129835
968.8 83129835 81494391 79351288 76453769 73273396 71246821 71654636 74419457 78489190 82829022
987.2 82829022 86684364 89609891 91610390 92968327 93867201 94357324 94575900 94699746 94721973
1005.5 94721973 94551605 94260955 93975264 93641311 93159324 92597342 92043698 91409791 90581453 89596182
1025.9 89596182 88476235 87079972 85303813 83233804 80912626 78165561 74954444 71796012
1042.2 71796012 69448203 68055958 66953480 65499800 63742936 62215149 61461312 61749911 62977052
1060.6F2977052J847392K234650K559364K763694K651864K189023J514864P86006J72067
1079G9695976j33980j15650j7780o7080k72750o19883j151317j706666j908618j484776
1099.4G2217476m47422Q69870J945496K444887K345896J796710J018066J58715p53814
1117.7H1595880j625943k248276k520418k520132k286535j758504r52983K9319J058543
1136.1F8770951J857185K133507J930493J609922J489639J571268J622557J485896
1152.4H2471418J159144O37007o4594p83247j340288j727724k001124k125967k069896
1170.7G4154729j902545j690155j408535j038927o38795k71505P3868M17274O96749
1189.1F8392158Q50361R24105R89526J036632J033706J011985R94474R07397O77222
$$ plain form
1060.6 62977052 64824444 67059094 69618458 72382152 75034016 77223039 78737903 79523909 79695976
1079 79695976 79561996 79446346 79428566 79361486 79088736 78468853 77317536 75610870 73702252 72217476
1099.4 72217476 71770054 72639924 74585420 77030307 79376203 81172913 82190979 82349694 81595880
1117.7 81595880 79969937 77721661 75201243 72681111 70394576 68636072 67683089 67712408 68770951
1136.1 68770951 70628136 72761643 74692136 76302058 77791697 79362965 80985522 82471418
1152.4 82471418 83630562 84267569 84202975 83419728 82079440 80351716 78350592 76224625 74154729
1170.7 74154729 72252184 70562029 69153494 68114567 67475772 67204267 67278135 67695409 68392158
1189.1 68392158 69242519 70166624 71156150 72192782 73226488 74238473 75232947 76140344 76817566
1207.5G6817566L38543l7808m17113p65592j043814j198936j209670j157403j037920
1225.8G0287853o23691K10882J239466K106029K503204K254105J513797O56659r4510
1244.2H0053794p18063j188594j465416j627022j796466j943993j917595j596648r98097
1262.5F6801900m08864k32691n43570r79770j171344j057667p69120l66897J33533
1280.9F1405510N74124O36041K21121j54155l1692L17442N64647P41124Q29697P26974
1301.3F5830833M91065K96890K50846L31778N16581Q11470J145518J435202J636386
1319.6G2746569J702517J673007J577598J417947J246923J077795Q69709O09774L23790
1338H3245629j3041m31747p80415p74664l61431L1001K3872k78825m84872k81650K20275
$$ plain form
1207.5 76817566 77156109 77118301 76701188 75935596 74891782 73692846 72483176 71325773 70287853
1225.8 70287853 69664162 69875044 71114510 73220539 75723743 77977848 79491645 80148304 80053794
1244.2 80053794 79335731 78147137 76681721 75054699 73258233 71314240 69396645 67799997 66801900
1262.5 66801900 66393036 66160345 65616775 64637005 63465661 62407994 61638874 61271977 61405510
1280.9 61405510 61979634 62615675 62836796 62682641 62650949 62968391 63533038 64274162 65103859 65830833
1301.3 65830833 66321898 66618788 66869634 67201412 67717993 68529463 69674981 71110183 72746569
1319.6 72746569 74449086 76122093 77699691 79117638 80364561 81442356 82312065 82921839 83245629
1338 83245629 83232588 82800841 82020426 81245762 80884331 80915332 80939204 80660379 80175507 79893857 80114132
1360.4H0114132N98651M63146l5470m96656o94692q61269j685441k782619k717960
1378.8G1901822j201451N56624J443124J703095J629675J334166J229263J269537J044649
1397.1H0910504N00840r5874j87832L97586R14550R11308P63237O17689M45318L34168
1417.5H5511494L76182L70670L31652L16924K89136L18569L02833J59377L8606j53798
1437.9H7861645n87314r74023r60196p38066q57490j073975q74746m37062j29098J46895
1458.3H1376570N02050Q67832J404399J676124J378119J165354J237816J125598Q25810
1476.7I1559672O03372M40198L59995L05783K48176K49088L27945K96491J81067J46043
1497.1I4717830J97101J83815N6779o9427O4361K85482K05446Q2975M3410Q6850Q9312
$$ plain form
1360.4 80114132 80712783 81175929 81140459 80643803 79949111 79087842 77402401 74619782 71901822
1378.8 71901822 70700371 71256995 72700119 74403214 76032889 77367055 78596318 79865855 80910504
1397.1 80910504 81411344 81315470 81127638 81525224 82439774 83351082 84114319 84732008 85177326 85511494
1417.5 85511494 85887676 86258346 86589998 86906922 87196058 87514627 87817460 87976837 88015443 87861645
1437.9 87861645 87274331 86300308 85340112 84602046 83744556 82670581 81795835 81358773 81229675 81376570
1458.3 81376570 81878620 82746452 84150851 85826975 87205094 88370448 89608264 90733862 91559672
1476.7 91559672 92163044 92603242 92963237 93269020 93517196 93766284 94094229 94390720 94571787 94717830
1497.1 94717830 94914931 95098746 95155525 95086098 95150459 95435941 95641387 95724362 95767772 95854622 95943934
1519.5I5943934J08969J94478K02960J76459J20765Q4335J30689J06579k4509k2006
1539.9I7022653J64330K02959J66697J11764O0380K0885k0796p9477n8126J88452J96707
1562.4I7976428Q6373J6666l1877R90Q106q3184j10412l6174m3046j13285j67954j91844
1586.8I7310787k04688k32887k65640k74539k76238l09199l56823l65418l59226l85588
1607.2I4280541m20475m24022m36806n18954n32901l49063k63894k79879k72179k83962
1627.6I0498406k65670j73479m0669K12980L59112K57235J75339J36692J99431L22139
1648I1681516K22504K12032M95350L90113J86217J16312J07765R6059K1619k2495k575
1670.5I3504417n3865j69742k83962m65572p66111j398873k090931r96226L60984N99122
$$ plain form
1519.5 95943934 96052903 96247381 96450341 96626800 96747565 96831900 96962589 97069168 97044659 97022653
1539.9 97022653 97186983 97389942 97556639 97668403 97728783 97749668 97728872 97649395 97591269 97779721 97976428
1562.4 97976428 98062801 98079467 98047590 98048580 98056686 97973502 97863090 97826916 97783870 97670585 97502631 97310787
1586.8 97310787 97106099 96873212 96607572 96333033 96056795 95747596 95390773 95025355 94666129 94280541
1607.2 94280541 93860066 93436044 92999238 92480284 91947383 91598320 91334426 91054547 90782368 90498406
1627.6 90498406 90232736 90059257 90018588 90231568 90590680 90847915 91023254 91159946 91359377 91681516
1648 91681516 91904020 92116052 92611402 93001515 93187732 93304044 93411809 93507868 93529487 93506992 93504417
1670.5 93504417 93450552 93280810 92996848 92531276 91765165 90366292 88275361 87279135 87640119 88239241
1690.9H8239241K8407p64340j239252j235598j421720j562154k016324k639991k837265
1709.2G4551004l054446l379291l874081m480583l590548j680815l53402M64821P73173
1727.6E5375832P14779N85348O22832N54753K69502K30152K80338K76405L39168N52350
1748E9801459J045460J526236J680744J956362K172714K007133J929194J627457J255578
1766.3G5002337J108020J003623J031679R19265O49559N21684N01603M53919M02677
1784.7H1594366L70538L19398L09717L86459L99691L43918L20173L29447L53682L48061
1805.1H5075450L38358L57306M31573M81242M73541M83745N09137M89992M43173M20212
1825.5H9503729L71367L62521L75450L30693L06719L09539K65390K00629K16192K54804
$$ plain form
1690.9 88239241 88267648 87503308 86264056 85028458 83606738 82044584 80028260 77388269 74551004
1709.2 74551004 71496558 68117267 64243186 59762603 56172055 54491240 54137838 54602659 55375832
1727.6 55375832 56090611 56675959 57298791 57853544 58123046 58353198 58633536 58909941 59249109 59801459
1748 59801459 60846919 62373155 64053899 66010261 68182975 70190108 72119302 73746759 75002337
1766.3 75002337 76110357 77113980 78145659 79064924 79714483 80236167 80737770 81191689 81594366
1784.7 81594366 81964904 82284302 82594019 82980478 83380169 83724087 84044260 84373707 84727389 85075450
1805.1 85075450 85413808 85771114 86202687 86683929 87157470 87641215 88150352 88640344 89083517 89503729
1825.5 89503729 89875096 90237617 90613067 90943760 91250479 91560018 91825408 92026037 92242229 92497033
1845.9I2497033K22051J87451J76471J57797J38283J30600J35201J26827Q7410M5198
1866.3I3904322O0332J20253J18160Q3417O3735N6225N0264N2274N9932N5671N6493
1888.7I4681078Q0449R2184Q3166Q4109Q1700P3224O1899M7946L6318L8975N2524M7081
1913.2I5460653K4939J9824L4875K3389Q178R435k777k4689l2711j6266J4270M0054
1937.7I5559174N6356Q9926J28126J23852R9403Q6617O8844M2885L3885M4394M8035
1960.1I6381497L2783K0611K6065L7206L6585L8379N2303N6571M7338M5735N2994M5336
1984.6I6873403K6792K0981K9814L7616L2878K4379K2596J7619J1629J6188J9068R996
2009I7142959j353j657K795K772N108J3196J8728J3572O306J0270J7786J5003R137
$$ plain form
1845.9 92497033 92719084 92906535 93083006 93240803 93379086 93509686 93644887 93771714 93859124 93904322
1866.3 93904322 93964654 94084907 94203067 94286484 94350219 94406444 94456708 94508982 94568914 94624585 94681078
1888.7 94681078 94761527 94853711 94936877 95020986 95102686 95175910 95237809 95285755 95322073 95361048 95413572 95460653
1913.2 95460653 95485592 95505416 95540291 95563680 95571858 95581293 95578516 95553827 95521116 95504850 95519120 95559174
1937.7 95559174 95615530 95705456 95833582 95957434 96056837 96143454 96212298 96255183 96289068 96333462 96381497
1960.1 96381497 96414280 96434891 96460956 96498162 96534747 96573126 96625429 96682000 96729338 96775073 96828067 96873403
1984.6 96873403 96900195 96921176 96950990 96988606 97021484 97045863 97068459 97086078 97097707 97113895 97132963 97142959
2009 97142959 97141606 97139949 97142744 97145516 97150624 97163820 97182548 97196120 97202426 97212696 97230482 97245485 97254622
2035.6I7254622J2088J5265P379J7M393Q768Q398J3125K3854K8861K4229K2876K9898
2062.1I7453773L6180TL6216L9685L7437K5690J4734J0240J091j4216j7416l410Q494
2088.6I7664678Q756R865J7917K1326J8776K6542M2510M6444L7104L5673M3875L9995
2113.1I8013461K2810J4735J9204J7232J2326K4700M4901M6080L5465L7002M4805L9262
2137.5I8371983K7054K5672K6983J7869J0521J7106K0117J1426J0198K3741L0982K3318
2162I8616970K0569K6465K3865J3560J0872J1814L642j0008j3727o854m47L355Q327
2188.5I8708403J4669J5884J4908K1028L0178L0816K6541K6983K8509K4522J6552R817
2213I8968810J603p283j1367j3983j7614j9770j7989j1563k480P957J4574J7231K5225
$$ plain form
2035.6 97254622 97266710 97281975 97289354 97289371 97293764 97302532 97310930 97324055 97347909 97376770 97400999 97423875 97453773
2062.1 97453773 97489953 97526133 97562349 97602034 97639471 97665161 97679895 97690135 97691226 97677010 97659594 97656184 97664678
2088.6 97664678 97673434 97683299 97701216 97722542 97741318 97767860 97810370 97856814 97893918 97929591 97973466 98013461
2113.1 98013461 98036271 98051006 98070210 98087442 98099768 98124468 98169369 98215449 98250914 98287916 98332721 98371983
2137.5 98371983 98399037 98424709 98451692 98469561 98480082 98497188 98517305 98528731 98538929 98562670 98593652 98616970
2162 98616970 98637539 98664004 98687869 98701429 98712301 98724115 98727757 98717749 98704022 98697168 98696721 98700076 98708403
2188.5 98708403 98723072 98738956 98753864 98774892 98805070 98835886 98862427 98889410 98917919 98942441 98958993 98968810
2213 98968810 98970413 98963130 98951763 98937780 98920166 98900396 98882407 98870844 98868364 98876321 98890895 98908126 98933351
2239.5I8933351L5965L8177L3850L2729K9343J7703P498P856J3911J0723K444K629
2264I9166179L892l559j1944r734k473l767j949J5127K7210K2912K0212K5743K5827
2290.5I9273676J8269J3965J3894M232j5349k4271j9574k1755l0739k2655o706j2243
2315I9170744l2562m4435m1115l3146k7341j6105n251r412j8251j2266n19K617J1712
2341.5I8944670M1449O9952M7207j3775o0814p7004p4374n5826k0754J1581L4785O0642
2366I8907739P9477Q2642Q5741Q8018Q0848P0345O4069N6935M3785K9427J9038J1778
2390.4I9619842M577k259n293n930q858q797q76O806R269R888J0008P904L355k354
2419I9637282j0008j8298j7536p069J526N650J1891J8639K0802K1118K1213J6975R746
$$ plain form
2239.5 98933351 98969316 99007493 99041343 99074072 99103415 99121118 99128616 99136472 99150383 99161106 99163550 99166179
2264 99166179 99170071 99166512 99154568 99144834 99142361 99138594 99136645 99151772 99178982 99201894 99222106 99247849 99273676
2290.5 99273676 99291945 99305910 99319804 99324036 99308687 99284416 99264842 99243087 99212348 99189693 99182987 99170744
2315 99170744 99138182 99093747 99052632 99019486 98992145 98976040 98970789 98961377 98943126 98930860 98930341 98932958 98944670
2341.5 98944670 98986119 99056071 99103278 99089503 99028689 98951685 98877311 98821485 98800731 98812312 98847097 98907739
2366 98907739 98987216 99069858 99155599 99243617 99324465 99394810 99458879 99515814 99559599 99589026 99608064 99619842
2390.4 99619842 99624419 99622160 99616867 99610937 99602079 99593282 99592406 99599212 99608481 99618369 99628377 99636281 99639636 99637282
2419 99637282 99627274 99608976 99591440 99584371 99585897 99591547 99603438 99622077 99642879 99663997 99685210 99702185 99711931
2445.5I9711931O902J0270J7637K1946K0194J8466J3953N454p75p087j6993k6053k9308
2472I9746537k7680k5565j7494l707k98p868j0425o359l708j764O97K873J556j252
2500.6I9645543K730O145j395o604k80m23j0246j3065p326m107o425m613J746L254
2529.1I9604934P230J8877K5076K0373J2517J0913R078m983j8352j8072j8793k4695
2553.6I9624103j7339J455J2374J6719K9820M5729M6128L4588K8521K7096K1321J4591
2578.1I9885106J3620J6361J1373N209J2142J9240J3918P450Q977O604l684q517l088
2604.6I9984711l039j0390j1312l601j227r186j6635j7321j7292k0921k1553j5443
2629.1I9836791j2595j2934m596O521M149o169q929q291j5629k5886k5666j9294j9443
$$ plain form
2445.5 99711931 99718833 99729103 99746740 99768686 99788880 99807346 99821299 99826753 99825978 99818891 99801898 99775845 99746537
2472 99746537 99718857 99693292 99675798 99672091 99671793 99663925 99653500 99647141 99643433 99641669 99642366 99645239 99646795 99645543
2500.6 99645543 99648273 99654418 99653023 99646419 99646139 99645716 99635470 99622405 99615079 99610972 99604547 99599934 99601680 99604934
2529.1 99604934 99612164 99631041 99656117 99676490 99689007 99699920 99708998 99704015 99685663 99667591 99648798 99624103
2553.6 99624103 99606764 99608219 99620593 99637312 99667132 99712861 99758989 99793577 99822098 99849194 99870515 99885106
2578.1 99885106 99898726 99915087 99926460 99931669 99943811 99963051 99976969 99984419 99993396 100000000 99996316 99987799 99984711
2604.6 99984711 99981672 99971282 99959970 99956369 99955142 99945956 99929321 99912000 99894708 99873787 99852234 99836791
2629.1 99836791 99824196 99811262 99806666 99813187 99817336 99811167 99802238 99793947 99778318 99752432 99726766 99707472 99688029
2655.6I9688029j8257m768J2040K0862K3484K4098K0796J2171J216p975j0740j2833
2680.1I9748123j9688k0611j2058o890r144p975P45O694M172K635M816J85q750j0932
2708.6I9671322q982j1492j7572j6659r489j1426j6165o014N883K014l331M094J1540
2735.1I9593723L105j1122r680l6j359m184J0157L2228M4537N1695N6255M8703K9599
2761.6I9843621J7125J5860J0038k068o837j210k813j6284j9813j3483j9657l7754
2786.1I9766725m7952m5770l9107k4575L6J1844p171l3772m3744m7475n1695m8387
2810.6I9388957l4803k4772l2788m3059l9565l5560m1819m7320m3643l8016l3599k2894
2835.1I8951119j2767l0035p3165j05005j17642j36429j63281j63948j29474r5814
$$ plain form
2655.6 99688029 99669772 99665004 99677044 99697906 99721390 99745488 99766284 99778455 99779671 99771696 99760956 99748123
2680.1 99748123 99728435 99707824 99695766 99688876 99679732 99671757 99672502 99679196 99683368 99686003 99690819 99691004 99682254 99671322
2708.6 99671322 99662340 99650848 99633276 99616617 99607128 99595702 99579537 99573523 99579406 99581420 99578089 99582183 99593723
2735.1 99593723 99596828 99585706 99576026 99575990 99574631 99570447 99580604 99612832 99657369 99709064 99765319 99814022 99843621
2761.6 99843621 99860746 99876606 99886644 99884576 99877739 99876529 99873716 99857432 99837619 99824136 99804479 99766725
2786.1 99766725 99718773 99673003 99633896 99609321 99609357 99621201 99614030 99580258 99536514 99489039 99437344 99388957
2810.6 99388957 99354154 99329382 99296594 99253535 99213970 99178410 99136591 99089271 99045628 99007612 98974013 98951119
2835.1 98951119 98938352 98908317 98835152 98730147 98612505 98476076 98312795 98148847 98019373 97923559
2855.5I7923559p9793q7189j37163k29680l56931n06627o11455n73724l75289j06704
2875.9I4859004J10829K17837K44427K37483K09105J58077Q9419J6087n2970j12236
2896.3I5977062j48225j48415j24652j02400q9699q5587j01238j52886k43014l57789
2916.6I4423157m91446o66577r32473j295113j564205j533121j287794q99285k48236
2935H5504907N36585J098591J300949J248694J066398Q27956N87190L74311J73503
2953.4I2719084j8096j90276l79252o29407r24778j137871j127064r91166r67371r61995
2973.8H5391808o34754l1668M04352M51994K95698J64354J11759R3156M3100l2544
2994.2H6257255K1428L35586P79903J037139R42373O70719N20539O07521Q00043Q95101
$$ plain form
2855.5 97923559 97843766 97756577 97619414 97389734 97032803 96526176 95914721 95340997 94965708 94859004
2875.9 94859004 94969833 95187670 95432097 95669580 95878685 96036762 96126181 96142268 96089298 95977062
2896.3 95977062 95828837 95680422 95555770 95453370 95363671 95278084 95176846 95023960 94780946 94423157
2916.6 94423157 93931711 93265134 92332661 91037548 89473343 87940222 86652428 85753143 85504907
2935 85504907 86041492 87140083 88441032 89689726 90756124 91584080 92171270 92545581 92719084
2953.4 92719084 92700988 92510712 92131460 91502053 90577275 89439404 88312340 87321174 86353803 85391808
2973.8 85391808 84757054 84725386 85129738 85581732 85877430 86041784 86153543 86246699 86289799 86257255
2994.2 86257255 86278683 86614269 87394172 88431311 89373684 90044403 90564942 91172463 91972506 92867607
3014.5I2867607Q34250O89751N37014M21417L37100K58869K04784J80173J58780J23001
3034.9I6612746Q7708Q4883Q9031O9285M3636L2348L9357L8898K2316J4400R561J287
3059.4I7145456R543K8491L4916J6052j4758k5547j1384J2630K2280p75k9975l7706
3083.9I7149223l7801l3939k8735l9405m3702j9640O294O229j2052j7238J073J0890
3108.4I6941197q339j2123J5443J9396j0926m8876p4106o6477m1694k9826l9297n0050
3132.8I6594322m1598k3830k3705n4383q2213p7313n6726l6585k7782n0509q8531j03789
3157.3I5927358r6727q4966p7421q1402r3990r6667q9896r5200j05119r8014q5819
3179.8I4922137r2166j06472j06895j01018j08516j21004j20538j16980j18459j16360
$$ plain form
3014.5 92867607 93701857 94391608 94928622 95350039 95687139 95946008 96150792 96330965 96489745 96612746
3034.9 96612746 96700454 96785337 96874368 96943653 96987289 97019637 97058994 97097892 97120208 97134608 97144169 97145456
3059.4 97145456 97154999 97183490 97218406 97234458 97219700 97194153 97182769 97195399 97217679 97216904 97186929 97149223
3083.9 97149223 97111422 97077483 97048748 97009343 96965641 96946001 96952295 96958524 96946472 96929234 96930307 96941197
3108.4 96941197 96932858 96920735 96936178 96955574 96944648 96895772 96821666 96755189 96713495 96683669 96644372 96594322
3132.8 96594322 96552724 96528894 96505189 96450806 96368593 96291280 96234554 96197969 96170187 96119678 96031147 95927358
3157.3 95927358 95830631 95745665 95668244 95586842 95492852 95396185 95306289 95211089 95105970 95007956 94922137
3179.8 94922137 94829971 94723499 94616604 94515586 94407070 94286066 94165528 94048548 93930089 93813729
3200.1I3813729j09178j07795j17504j23692j16425j08541j12801j21755j23936j26481
3220.5I2645621j32698j31583j26558j22273j09566r9265j20044j49745j46430j27077
3240.9I1380382j12236j00398j05256j23572j26249j11669j01417j04970j09857j06121
3261.3I0278637j01459r1600p0971n9468q2606j16175j27590j28812j23340j12980
3281.7H9263636j13768j25586j27411j10394j07664j39499j71804j84989j86885j70272
3302.1H7825364j48720j61481k11399k54566k58714k41589k40547k53773k59101k55448
3322.5H5540026k59667k90430l23522l27766l20321l12543l00580l13878l51423l71284
3342.9H2368612l78769l78275l62760l76999m18622m26751m07845l98296m02248m03810
$$ plain form
3200.1 93813729 93704551 93596756 93479252 93355560 93239135 93130594 93017793 92896038 92772102 92645621
3220.5 92645621 92512923 92381340 92254782 92132509 92022943 91923678 91803634 91653889 91507459 91380382
3240.9 91380382 91268146 91167748 91062492 90938920 90812671 90701002 90599585 90494615 90384758 90278637
3261.3 90278637 90177178 90085578 90014607 89955139 89872533 89756358 89628768 89499956 89376616 89263636
3281.7 89263636 89149868 89024282 88896871 88786477 88678813 88539314 88367510 88182521 87995636 87825364
3302.1 87825364 87676644 87515163 87303764 87049198 86790484 86548895 86308348 86054575 85795474 85540026
3322.5 85540026 85280359 84989929 84666407 84338641 84018320 83705777 83405197 83091319 82739896 82368612
3342.9 82368612 81989843 81611568 81248808 80871809 80453187 80026436 79618591 79220295 78818047 78414237
3363.3G8414237l86369l71515l91520m26292m24767l88544l60036l50756l45540l29500
3383.7G4639398l01123k67350k39516k38395k58702k59089k26915k03937k26557k57516
3404.1G2160298k41024k04318j92047j93739j96778j96898j87779j83195j89107k05875
3424.5G0169538k47234l17436m11010m65214l75688j36710J14787K42627K42650K01959
3444.9F9018269J84190J80358J73670J72180J79326J89400K00963K08771K10679K15315
3465.3G0933121K26975K35510K31087K26140K24584K22910K24060K28494K29299K26486
3485.7G3208666K25377K20674K10893K09278K21712K22057K13366K26689K40874K22778
3506.1G5422364K11603K28053K35605K24025K14475K14767K14047K23332K35629K37477
$$ plain form
3363.3 78414237 78027868 77656353 77264833 76838541 76413774 76025230 75665194 75314438 74968898 74639398
3383.7 74639398 74338275 74070925 73831409 73593014 73334312 73075223 72848308 72644371 72417814 72160298
3404.1 72160298 71919274 71714956 71522909 71329170 71132392 70935494 70747715 70564520 70375413 70169538
3424.5 70169538 69922304 69604868 69193858 68728644 68352956 68216246 68331033 68573660 68816310 69018269
3444.9 69018269 69202459 69382817 69556487 69728667 69907993 70097393 70298356 70507127 70717806 70933121
3465.3 70933121 71160096 71395606 71626693 71852833 72077417 72300327 72524387 72752881 72982180 73208666
3485.7 73208666 73434043 73654717 73865610 74074888 74296600 74518657 74732023 74958712 75199586 75422364
3506.1 75422364 75633967 75862020 76097625 76321650 76536125 76750892 76964939 77188271 77423900 77661377
3526.5G7661377K49130K63065K58773K60979K73621K65831K50876K53224K77693K99793
3546.9H0314362K90817K83468L05706L13795L00646L04716L05069K69395K71136L91727
3567.3H3350837M59665L91907L51447L71229L94291M02367L89749L47954L43108M30799
3587.7H7233353M67515L96973L78787M12554M17095M10950M04769L60054L21144L57944
3608.1I1161138L86149L63451L48520L22259L50409M19331L54236K20657J66702K80905
3628.5I4373757L90577L12269K65288K55567K27785J97810J51151P8386N3549J98001
3648.8I6504140L35300K33823J59156K07001K12074J44100Q6242L9845L046K6089O3479
3671.3I8014295L5322Q4716J77961J59812J18113P0167J9675K9409J05238J45566J25009
$$ plain form
3526.5 77661377 77910507 78173572 78432345 78693324 78966945 79232776 79483652 79736876 80014569 80314362
3546.9 80314362 80605179 80888647 81194353 81508148 81808794 82113510 82418579 82687974 82959110 83350837
3567.3 83350837 83810502 84202409 84553856 84925085 85319376 85721743 86111492 86459446 86802554 87233353
3587.7 87233353 87700868 88097841 88476628 88889182 89306277 89717227 90121996 90482050 90803194 91161138
3608.1 91161138 91547287 91910738 92259258 92581517 92931926 93351257 93705493 93926150 94092852 94373757
3628.5 94373757 94764334 95076603 95341891 95597458 95825243 96023053 96174204 96252590 96306139 96504140
3648.8 96504140 96839440 97073263 97232419 97439420 97651494 97795594 97881836 97921681 97924727 97950816 98014295
3671.3 98014295 98049617 98134333 98312294 98472106 98590219 98660386 98680061 98709470 98814708 98960274 99085283
3693.7I9085283Q6713M8244L3260N7131O0504M614m8817l2085P2283J20485O0659m738
3718.2I9543536k8169j4782J3113L2472J0503m1038o9636j3447J02764R4998k5350
3740.6I9604964q8006l0804M185l1645K7991J24383Q2028J3590J7809M4209K8372M941
3765.1I9802017J294L0219O6894M7064m917j8901J1134J6791J73J1307K4187J2738
3789.6A00000000j4836m8315o3878o5190n1814M530L3533L1918O8081N2410k8234p4012
3814.1I9844193n3906l9858j9854N0920O0159J7202j9568m5270m5866l7932l8314j2266
3838.5I9659640M1437P4899O8539Q399q6159j54674p7516J15037J09428K1857l0601
3861I9750286l7449j1134j6112j3494L6168O4075N0706K098l0703j1348J0895K8408
$$ plain form
3693.7 99085283 99171996 99220240 99253500 99310631 99371135 99375749 99326932 99294847 99367130 99487615 99548274 99543536
3718.2 99543536 99515367 99500585 99513698 99546170 99556673 99515635 99445999 99432552 99535316 99630314 99604964
3740.6 99604964 99516958 99486154 99490339 99458694 99486685 99611068 99693096 99706686 99724495 99768704 99797076 99802017
3765.1 99802017 99803311 99833530 99900424 99947488 99942571 99923670 99934804 99951595 99951768 99963075 99987262 100000000
3789.6 100000000 99985164 99936849 99872971 99807781 99755967 99760497 99794030 99825948 99894029 99946439 99918205 99844193
3814.1 99844193 99790287 99750429 99730575 99781495 99841654 99858856 99839288 99794018 99748152 99710220 99671906 99659640
3838.5 99659640 99701077 99775976 99844515 99852914 99766755 99612081 99534565 99649602 99759030 99780887 99750286
3861 99750286 99712837 99701703 99685591 99672097 99708265 99772340 99823046 99825144 99794441 99783093 99793988 99822396
3885.4I9822396J9503j6105l380K2221j5909o4194o5774k3007M5234R2548P8153L9411
3909.9I9931097L016k9135k9432O991K5773J0395L749J0616k116r042K3198M0007J3929
3936.4I9999046j2046k3204j6248J371K789M047K1482K2763L791n353k437l350r400
3962.9I9983251j7196k2447k0266j6862j2529J514J1760O688Q529K0588J7756M190
3987.4I9964976J932J0663J4937J3834J1706
3997.6A00018048
$$ plain form
3885.4 99822396 99841899 99825794 99822414 99844635 99828726 99764532 99698758 99675751 99720985 99813533 99891686 99931097
3909.9 99931097 99934113 99904978 99875546 99882537 99908310 99918705 99922454 99933070 99930954 99921912 99945110 99985117 99999046
3936.4 99999046 99987000 99963796 99947548 99948919 99951708 99955755 99977237 100000000 100003791 99998438 99996001 99992651 99983251
3962.9 99983251 99966055 99943608 99923342 99906480 99893951 99895465 99907225 99913913 99922442 99943030 99960786 99964976
3987.4 99964976 99966908 99977571 99992508 100006342 100018048
3997.6 100018048
##END=$$ End of the data block
