##TITLE=CP $$ Begin of the data block
##JCAMP-DX=5.00 $$ ACD/SpecManager v 10.08
##SPECTROMETER/DATA SYSTEM=Alpha
##DATE=03 Dec 2014 11:51:16
##DATA TYPE=INFRARED SPECTRUM
##DATA CLASS=XYDATA
##ORIGIN=
##OWNER=
##NPOINTS=1765
##FIRSTX=399.76428223
##LASTX=3997.64306641
##MAXX=3997.64306641
##MINX=399.76428223
##MAXY=1.00058687
##MINY=0.43532178
##XFACTOR=1.0000000000
##YFACTOR=0.000000010000000
##FIRSTY=1.00000000
##DELTAX=2.03961372
##XUNITS=1/CM
##YUNITS=ARBITRARY UNITS
##XYDATA=(X++(Y..Y))
399.8A00000000k3305j72055n5385J63311Q7434j59085j54960O1762M2087k85244k72727
422.2I9231833j14810k27368l50392j28013K18725K11311l0548l7872Q1050m6003k65962
444.6I8541951k07609o2221k00880n17362o42127o23572m53168P8076O41108Q58724
465I7412920O30862K29239Q6009J44744J0604k16007k02561k2441k8467k27815k63846
487.5I7553241j20502j54919m02486m94260l87007m33492p56604r95088r97543j169670
507.9I1641670j574802j788020j432276m82839P53707J696932J924455J589668J044357
526.2I3372852P10886Q14170R51850P47615M55171M10402M46320K87717Q7202J10656
546.6I8394841K14410J10793p2628l4368J33383J09410n4943m6987Q9282N1707j21301
$$ y = [100000000, 99976695, 99804640, 99749255, 99912566, 100000000, 99840915, 99685955, 99747717, 99789804, 99504560, 99231833, 99117023, 98889655, 98539263, 98411250, 98629975, 98841286, 98810738, 98772866, 98853916, 98807913, 98541951, 98334342, 98272121, 98071241, 97553879, 96911752, 96288180, 95835012, 95913088, 96554196, 97412920, 98043782, 98273021, 98359030, 98503774, 98514378, 98298371, 98095810, 98073369, 98044902, 97817087, 97553241, 97432739, 97277820, 96875334, 96381074, 95994067, 95560575, 94803971, 93808883, 92811340, 91641670, 90066868, 88278848, 86846572, 86363733, 87117440, 88814372, 90738827, 92328495, 93372852, 94083738, 94897908, 95849758, 96597373, 97052544, 97462946, 97909266, 98196983, 98284185, 98394841, 98609251, 98720044, 98647416, 98613048, 98746431, 98855841, 98800898, 98753911, 98843193, 98894900, 98773599]
569.1I8773599j28568Q560j8257k11859k57957j48797j61952l24940l69788k33531
589.4I6926510j86151l08597l17830j11151L6967k0075o2626N9503J26320m4590k41751
611.9I5856529k42519k27165l83467m89515l07345K2155K23094L14397M59260N67621
632.3I5793045M60982K79111K94280M35102M20206K61432K30682L50565L44330J66941
652.7I9036676J12670K24132K09623K0534n6422J0705o8170l09044k92003k49189l34346
675.1I8305166l49611p1812L97092O04963L91227J12063O8802R3329l6425j45954k7066
697.5I9341774J45715J20527m11K6023J19567M2439j30177j25331J8555J1492j26451
720I9443722j12522M0931P0369l9590n0699Q1920J15151k6936j01334J5891J12039
$$ y = [98773599, 98645031, 98653591, 98635334, 98423475, 98165518, 98016721, 97854769, 97529829, 97160041, 96926510, 96740359, 96431762, 96113932, 96002781, 96039748, 96019673, 95957047, 96016550, 96142870, 96098280, 95856529, 95614010, 95386845, 95003378, 94513863, 94206518, 94228673, 94451767, 94766164, 95225424, 95793045, 96254027, 96533138, 96827418, 97262520, 97682726, 97944158, 98174840, 98525405, 98869735, 99036676, 99149346, 99373478, 99583101, 99603635, 99547213, 99557918, 99489748, 99180704, 98888701, 98639512, 98305166, 97955555, 97883743, 98280835, 98885798, 99277025, 99389088, 99457890, 99551219, 99514794, 99368840, 99341774, 99487489, 99608016, 99607605, 99633628, 99753195, 99795634, 99665457, 99540126, 99558681, 99570173, 99443722, 99331200, 99372131, 99442500, 99402910, 99352211, 99434131, 99549282, 99522346, 99421012, 99436903, 99548942]
742.4I9548942L2979m2605M1932J26516M2940n7275J1302J15907O8402k8366R018J11103
766.9I9980795P7892n4705o1769M5085M8214n6773o5625L8505M8381m2599q6862J7738
791.4I9888277P0202k4795q5765k063N6661l6508j36119j08099r5588k46442m32181
813.8I8847580n07021o16616j065147j966399k582019j365442J257337K535754J770139
832.2I6308166N77801k11483l39258L53760J046473R37974M11385P7182o944o4879
852.6I9090177j96052k48396j25921K3150O0618O8337J27733J24055o1309k92087l44521
875I8225784k70372k99049m56983n95915p56431j144909j779312k392084k438992j335865
895.4H6755872N70667J930445K009213J249963K86216m64118n47212J93417J015967
$$ y = [99548942, 99581921, 99539316, 99581248, 99707764, 99750704, 99693429, 99704731, 99820638, 99889040, 99860674, 99869692, 99980795, 100058687, 100003982, 99942213, 99987298, 100035512, 99978739, 99913114, 99951619, 100000000, 99957401, 99870539, 99888277, 99958479, 99933684, 99847919, 99845856, 99902517, 99866009, 99729890, 99621791, 99526203, 99279761, 98847580, 98340559, 97723943, 96658796, 94692397, 92110378, 90744936, 92002273, 94538027, 96308166, 96885967, 96674484, 96335226, 96688986, 97735459, 98673433, 99084818, 99162000, 99155056, 99090177, 98894125, 98645729, 98519808, 98542958, 98603576, 98671913, 98799646, 98923701, 98862392, 98570305, 98225784, 97955412, 97656363, 97199380, 96603465, 95847034, 94702125, 92922813, 90530729, 88091737, 86755872, 87326539, 89256984, 91266197, 92516160, 92802376, 92338258, 91791046, 91984463, 93000430]
913.7I3000430J122665O75524Q7314n89406j283348j672458j321370l05986M29183
932.1I0142548K69532j32358N8246O69759R39185N39726k91658j152193j587272j276558
952.5H8178957m58634J33329R7323k83617o76650j032507j331890j617789k135897
970.9H0872625l082597m190099m468453k760148O64574L901493N518383N560243M645956
989.2H6661977L399187K332956J594626J027066N67788L07846K06852P8451j12849
1007.6I6063900k24996k33852k89774m40622n55891n91999o79880q79860j089186j267272
1028H9810568j536900j959157k400261k806580l357136l983927m028588k981323j523853
1046.3F5232843r99474j647443k342832k106184r69124M83650J765383K677857L226185
$$ y = [93000430, 94123095, 94798619, 94885933, 94296527, 93013179, 91340721, 90019351, 89713365, 90142548, 90412080, 90279722, 90337968, 91007727, 91946912, 92486638, 92194980, 91042787, 89455515, 88178957, 87720323, 87853652, 87950975, 87667358, 86990708, 85958201, 84626311, 83008522, 80872625, 77790028, 73599929, 69131476, 66371328, 67035902, 70937395, 76455778, 82016021, 86661977, 90061164, 92394120, 93988746, 95015812, 95583600, 95891446, 96098298, 96176749, 96063900, 95838904, 95605052, 95315278, 94874656, 94318765, 93726766, 93046886, 92167026, 91077840, 89810568, 88273668, 86314511, 83914250, 81107670, 77750534, 73766607, 69738019, 66756696, 65232843, 64233369, 62585926, 60243094, 58136910, 57167786, 57651436, 59416819, 62094676, 65320861]
1064.7F5320861L512264L593832L398585K802366J855380Q78632K04002j13958k22563
1083H1229401k49958k89727m91750r94438j720470k364194k592624k103889p09962
1101.4F9712389J212406K729183L255504K968753K258032J308012J85174r95165k058917
1119.8H0575371k867359l352767l482092l240937k633190j648921k67827J338815K622724
1138.1F7043817L064877K760470K257454J970118J932723J937306J783502J402658
1154.4H4152925Q11720O9398p05266j374674j880700k239066k443868k464145k316904
1172.8G1609420k057589j714462j290929q06546l18015J12623M64869P43681R33701
1191.1F7676753J026672J063788J098084J129324J116335J032484Q61179N67282J15275
$$ y = [65320861, 68833125, 72426957, 75825542, 78627908, 80483288, 81361920, 81565922, 81451964, 81229401, 80979443, 80689716, 80197966, 79203528, 77483058, 75118864, 72526240, 70422351, 69712389, 70924795, 73653978, 76909482, 79878235, 82136267, 83444279, 83629453, 82634288, 80575371, 77708012, 74355245, 70873153, 67632216, 64999026, 63350105, 63082278, 64421093, 67043817, 70108694, 72869164, 75126618, 77096736, 79029459, 80966765, 82750267, 84152925, 84964645, 85034043, 84328777, 82954103, 81073403, 78834337, 76390469, 73926324, 71609420, 69551831, 67837369, 66546440, 65739894, 65421879, 65534502, 65999371, 66743052, 67676753, 68703425, 69767213, 70865297, 71994621, 73110956, 74143440, 75004619, 75571901, 75687176]
1209.5G5687176m49210r76217j371145j682348j888370j873064j703626j453310q36772
1227.9F3453114L86965J899165L106523L559857L132570K117455R55892j01710r61768
1246.2G7548063j568926j952833k244663k533054k748317k749002k384376j577824
1262.5E9789068p03425m30691q87001j476180j661456j428157r72467l45743M02224
1280.9E2286172J000386J041878M63271l0470J31553N75102R01109J160746J304603
1299.2E8834350J197529R26739O88457N95290O58888Q62306J160949J470745J740366
1317.6F8135619J917589J944405J881927J776844J625407J449800J259964J055390
1333.9H1046945Q20637M96763L939n77425r81474r25506l79973J23054J03849l20244
$$ y = [75687176, 75237966, 74261749, 72890604, 71208256, 69319886, 67446822, 65743196, 64289886, 63453114, 63840079, 65739244, 68845767, 72405624, 75538194, 77655649, 78611541, 78509831, 77548063, 75979137, 74026304, 71781641, 69248587, 66500270, 63751268, 61366892, 59789068, 59085643, 58654952, 57767951, 56291771, 54630315, 53202158, 52229691, 51883948, 52286172, 53286558, 54328436, 54791707, 54761237, 54892790, 55467892, 56369001, 57529747, 58834350, 60031879, 60958618, 61647075, 62242365, 62901253, 63763559, 64924508, 66395253, 68135619, 70053208, 71997613, 73879540, 75656384, 77281791, 78731591, 79991555, 81046945, 81867582, 82364345, 82368284, 81790859, 80809385, 79883879, 79503906, 79626960, 79730809, 79410565]
1354.3G9410565o26510l37518L67922P98935N15097j14471o55424q51608j035863k242815
1374.7G5228310l828544l672778j429111J131028K342772K477372K105790J632709
1391G5987548J494032J487833J135755L88789l24756l06219M50814J062894J085156
1409.4H2461846R18245P58302O35529N35321M21357L32678L48645L64566L68840L86822
1429.8H7532151L53694K70939Q2385l57354q38333j154900j066035p70622r38821j239216
1450.2H1873888r61590l36164Q046L5549M15563J018703J667035J856923J504385J353133
1470.6H8435471J396626J074612O40303M64958M28742M13484L78305L69840L41094
1488.9I3943435K25407J56569K00349K33645J68436J31405J89602L10701K73270o14
$$ y = [79410565, 78784055, 78446537, 78814459, 79613394, 80128491, 80014020, 79358596, 78506988, 77471125, 75228310, 71399766, 67726988, 66297877, 67428905, 69771677, 72249049, 74354839, 75987548, 77481580, 78969413, 80105168, 80493957, 80169201, 79862982, 80313796, 81376690, 82461846, 83380091, 84138393, 84773922, 85309243, 85730600, 86063278, 86411923, 86776489, 87145329, 87532151, 87885845, 88156784, 88239169, 87881815, 87043482, 85888582, 84822547, 84051925, 83113104, 81873888, 80912298, 80576134, 80584180, 80619729, 81035292, 82053995, 83721030, 85577953, 87082338, 88435471, 89832097, 90906709, 91547012, 92011970, 92440712, 92854196, 93232501, 93602341, 93943435, 94168842, 94325411, 94525760, 94759405, 94927841, 95059246, 95248848, 95559549, 95832819, 95832205]
1509.3I5832205l3421P3696J81228K08753J74499J36458Q4961P1364N7996P5608J62626
1531.8I7025973J86580J43623K13015K95842J01638p5871o6858K8324J04838J08535
1552.2I8065639J23149J95014K04837q9037j47128j1319P6354Q7201j633k3901M3857
1574.6I8523033j3602j40202j26302q6606q7845j19537j38015j27792j25975j65724
1595I7391433k09594k03443j89686k15977k46000k44904k59191k82454k55221k57355
1615.4I5027608l54326l04574j75857j70726k01052k22302k33799r7120J42741K55972
1635.8I3666565O9040j1271Q3655K06477K74581J89185J35100K39610J41192p6706
1656.2I4917428j2797P6306N0777l8379j121M7517o6137j99401l11417m70245n79196
$$ y = [95832205, 95798784, 95872480, 96053708, 96262461, 96436960, 96573418, 96658379, 96729743, 96787739, 96863347, 97025973, 97212553, 97356176, 97569191, 97865033, 97966671, 97890800, 97823942, 97852266, 97957104, 98065639, 98188788, 98383802, 98588639, 98499602, 98352474, 98341155, 98417509, 98504710, 98503077, 98479176, 98523033, 98509431, 98369229, 98242927, 98156321, 98068476, 97948939, 97810924, 97683132, 97557157, 97391433, 97181839, 96978396, 96788710, 96572733, 96326733, 96081829, 95822638, 95540184, 95284963, 95027608, 94673282, 94368708, 94192851, 94022125, 93821073, 93598771, 93364972, 93267852, 93410593, 93666565, 93735605, 93724334, 93807989, 94014466, 94289047, 94478232, 94613332, 94852942, 94994134, 94917428, 94904631, 94980937, 95031714, 94993335, 94992214, 95039731, 94973594, 94774193, 94462776, 93992531, 93413335]
1678.6I3413335p55560j494032k651287j418417L98648P31611J20461p68096j397728
1697H6178935j587838k086521k183133k711230l657192l908450m075104m413456n090892
1715.3E6465119o018609m732099j979795k02438Q37713J307744J345667J198620J092774
1733.7D9314696R07498O04809N11097M82488M66561N49573P52771J201725J736736
1752E6527954K057362K437025K670026K481198K354020J986367J611501J503110J386457
1770.4G5015020J273203J030988Q15111P74419P64031O82836O17320N87779N70476
1788.8H2131183N51832M82869L87836L59165L46631K90722K59643K80071L20667L43328
1809.2H5753947L60638L67457L69304L69180L74579L98427L99703L55530K99060K74653
$$ y = [93413335, 92657775, 91163743, 88512456, 87094039, 87492687, 88224298, 88344759, 87576663, 86178935, 84591097, 82504576, 80321443, 77610213, 73953021, 70044571, 65969467, 61556011, 56465119, 50446510, 45714411, 43734616, 43532178, 44369891, 45677635, 47023302, 48221922, 49314696, 50222194, 50827003, 51338100, 51820588, 52287149, 52836722, 53589493, 54791218, 56527954, 58585316, 61022341, 63692367, 66173565, 68527585, 70513952, 72125453, 73628563, 75015020, 76288223, 77319211, 78134322, 78908741, 79672772, 80355608, 80972928, 81560707, 82131183, 82683015, 83165884, 83553720, 83912885, 84259516, 84550238, 84809881, 85089952, 85410619, 85753947, 86114585, 86482042, 86851346, 87220526, 87595105, 87993532, 88393235, 88748765, 89047825, 89322478]
1829.6H9322478K26950K00784K25378K57426K71940K63769K28727J72138J48260J36459
1850I1454309J34772J54090J74439J57827J25128J23799J54019J65867J09339M2623
1870.3I2796212M5050O5368N3763N1773O8134P3379O7234Q3381J12164J01155P5651
1892.8I3593264P1221Q2672Q6307P3773O3634P9173R1207O2740K6601L7909P6979P1568
1917.3I4417048L4332K6077K0325j4156l8993l4369j3482j359O431M7761J13714J44166
1941.7I4707495J12534Q7136R6124R3687O9570N5379O0087O0731M6790L6562N2148
1964.2I5478243O0391L1579J1843L2675N6881N8293N1719N6082O4308N9187N0044N2721
1988.7I6063966N6326L6979J4859J7929K8533K6369J7703J6892K4271K5159J5503J3351
$$ y = [89322478, 89549428, 89750212, 89975590, 90233016, 90504956, 90768725, 90997452, 91169590, 91317850, 91454309, 91589081, 91743171, 91917610, 92075437, 92200565, 92324364, 92478383, 92644250, 92753589, 92796212, 92841262, 92906630, 92960393, 93012166, 93080300, 93153679, 93220913, 93304294, 93416458, 93517613, 93593264, 93664485, 93747157, 93833464, 93907237, 93970871, 94050044, 94141251, 94203991, 94230592, 94268501, 94345480, 94417048, 94451380, 94477457, 94497782, 94483626, 94444633, 94410264, 94396782, 94395423, 94401854, 94449615, 94563329, 94707495, 94820029, 94907165, 95003289, 95096976, 95166546, 95221925, 95282012, 95342743, 95389533, 95426095, 95478243, 95538634, 95570213, 95582056, 95614731, 95671612, 95729905, 95781624, 95837706, 95902014, 95961201, 96011245, 96063966, 96120292, 96157271, 96172130, 96190059, 96218592, 96244961, 96262664, 96279556, 96303827, 96328986, 96344489, 96357840]
2013.1I6357840K1553K1953J0335N603J3655J6958R388O902J6373K6286K7925K2053
2037.6I6556824J6582J2249N567M65K766J2344J9234J8788J9306K8026L9363M4137
2062.1I6775651M0978L4851L6842M2176L7026L0041K8032J9640K485j2141j4985n144
2086.6I7015452N502J1200J5294J5366J3221J7184K9486M0454M2289L8898L9661M2409
2111I7326416L9369L0708K1130J5962J4704J3304J7148L2759M6712TM3530M5299M0555
2137.5I7734308L0256K4461K2209K2465K0254J2344O461J1420J8865K0683K0999K5051
2162I7969776L0232K4426J3047J3495J7345Q714l481r304q899q250q338r30J1802J7833
2190.6I8067468J5784J6838K4796L2371K9933K5094K8747L1460K3913J3536J0944Q487
$$ y = [96357840, 96379393, 96401346, 96411681, 96417284, 96430939, 96447897, 96457285, 96464187, 96480560, 96506846, 96534771, 96556824, 96573406, 96585655, 96591222, 96591687, 96594453, 96606797, 96626031, 96644819, 96664125, 96692151, 96731514, 96775651, 96816629, 96851480, 96888322, 96930498, 96967524, 96997565, 97025597, 97045237, 97047722, 97035581, 97020596, 97015452, 97020954, 97032154, 97047448, 97062814, 97076035, 97093219, 97122705, 97163159, 97205448, 97244346, 97284007, 97326416, 97365785, 97396493, 97417623, 97433585, 97448289, 97461593, 97478741, 97511500, 97558212, 97604924, 97648454, 97693753, 97734308, 97764564, 97789025, 97811234, 97833699, 97853953, 97866297, 97872758, 97884178, 97903043, 97923726, 97944725, 97969776, 98000008, 98024434, 98037481, 98050976, 98068321, 98077035, 98073554, 98064250, 98055351, 98047101, 98038763, 98037833, 98049635, 98067468, 98083252, 98100090, 98124886, 98157257, 98187190, 98212284, 98241031, 98272491, 98296404, 98309940, 98320884, 98329371]
2215I8329371j484j3155j8447j8102j7917j5945q785j2Q946J6302K0844K9641L9322
2241.6I8350579M2796L9881L3283K7818K3663J8638J5068J4931J2440P045N460M035
2266I8595637j109n245q511q983j609R632J7858K1529K5523K7185K1535J8216K2590
2292.5I8734248K1696J1182J293k676q100k2102l1078k1064o479o676j4221j5426j9384
2319.1I8621213l6180m4918k8306j2141j4031j4532j407J1349N371o873L350K6160
2343.5I8509055N2965O6477L4750k1428o4767q1163o9440k9266J0288L2008N0586P0560
2368I8560625Q0991P6342O8533P2360P4351O1947M7678M2814L7020J8609J085O85O336
2394.5I9149376K21q637m977K038k02m703K253J6999K1065J0210K295M393j467j8513
$$ y = [98329371, 98327887, 98314732, 98296285, 98278183, 98260266, 98244321, 98235536, 98235524, 98244470, 98260772, 98281616, 98311257, 98350579, 98393375, 98433256, 98466539, 98494357, 98518020, 98536658, 98551726, 98566657, 98579097, 98586142, 98591602, 98595637, 98594528, 98589283, 98580772, 98571789, 98570180, 98579812, 98597670, 98619199, 98644722, 98671907, 98693442, 98711658, 98734248, 98755944, 98767126, 98768419, 98765743, 98757643, 98735541, 98704463, 98683399, 98676920, 98670244, 98656023, 98640597, 98621213, 98585033, 98540115, 98511809, 98499668, 98485637, 98471105, 98469698, 98481047, 98486418, 98479545, 98482895, 98509055, 98562020, 98628497, 98663247, 98641819, 98577052, 98495889, 98426449, 98397183, 98407471, 98439479, 98490065, 98560625, 98641616, 98717958, 98786491, 98858851, 98933202, 98995149, 99042827, 99085641, 99122661, 99141270, 99142355, 99143040, 99149376, 99149597, 99140960, 99135983, 99138021, 99137819, 99133116, 99135369, 99152368, 99173433, 99183643, 99185938, 99190331, 99188864, 99170351]
2423.1I9170351k1970m846J0610J1432J1682K1553K9886K5541J5914J6588K2095J7512
2447.6I9326348R257J3786K6381K7735J6891J0568J1266M571r495j7005j6731k0075
2472I9383497k7191k5231j1510J43j526q934o765J877L934K056L571O735M470m17J919
2502.6I9326628Q572O848j776l296L624O771n25p921n657L64k03k402L910J4675K0176
2533.2I9369788J7846J8847K3889J6040J538k939o479j6105k3901k3687j1230M131
2557.7I9367738J1074J8436L3301M4584M3881L6288L3366L4857K7001J4132J4454K3079
2582.2I9702191K0540J0955J0956J9502K1345J0502J997N734P951K80o008n036l571
2608.7I9797338n710o819l862n388j5223k0898j5992j0472j4037j9485j3548l010q17
$$ y = [99170351, 99148381, 99143535, 99154145, 99165577, 99177259, 99198812, 99228698, 99254239, 99270153, 99286741, 99308836, 99326348, 99335605, 99349391, 99375772, 99403507, 99420398, 99430966, 99442232, 99446803, 99437308, 99420303, 99403572, 99383497, 99356306, 99331075, 99319565, 99319708, 99318182, 99309248, 99302483, 99304360, 99308294, 99310350, 99313921, 99320656, 99325126, 99324709, 99326628, 99335200, 99342048, 99340272, 99336976, 99340600, 99347371, 99346846, 99338925, 99333268, 99333632, 99333429, 99331027, 99334937, 99349612, 99369788, 99387634, 99406481, 99430370, 99446410, 99447948, 99445009, 99438530, 99422425, 99398524, 99374837, 99363607, 99367738, 99378812, 99397248, 99430549, 99475133, 99519014, 99555302, 99588668, 99623525, 99650526, 99664658, 99679112, 99702191, 99722731, 99733686, 99744642, 99764144, 99785489, 99795991, 99797988, 99803722, 99811673, 99811953, 99805945, 99800909, 99797338, 99791628, 99784809, 99780947, 99775559, 99760336, 99739438, 99723446, 99712974, 99698937, 99679452, 99665904, 99662894, 99662077]
2635.2I9662077k729O85P814N901p868j9300k1380k2596k8074k5892p528R888J0729
2661.7I9561727R430K1266K9004J8162O908J0574J2272l373k1065k3049j3029q721
2686.2I9600106j1199k581J2141J3155L380n61N442P642k301p564J693K956j2356j9896
2714.7I9590057j1265m369r680j2964j335Q583J121n949M286J5497P158r387r740O68
2743.3I9562681K020o26J0765L6568N6481N8949N5241N1606M0949K0539L803M816J0044
2769.8I9913836L743m196l893m863j6123k6542k2632j8120l2652n0324l8796m310J5003
2796.3I9710131N614j2558k0719k8801m4453m6217k9517j8918k6113l2264k2328j4686
2820.8I9419171k6834l7867k8998j9777k3639k2179j073J8734p09m5383o4385o5941
$$ y = [99662077, 99659348, 99660033, 99667847, 99673748, 99665880, 99646580, 99625200, 99602604, 99574530, 99548638, 99541110, 99550998, 99561727, 99571157, 99592423, 99621427, 99639589, 99646497, 99657071, 99669343, 99665970, 99644905, 99621856, 99608827, 99600106, 99588907, 99586326, 99598467, 99611622, 99615002, 99614441, 99619883, 99627525, 99625224, 99617660, 99619353, 99622309, 99609953, 99590057, 99578792, 99574423, 99564743, 99551779, 99550444, 99559027, 99560148, 99554199, 99558485, 99573982, 99581140, 99571753, 99562013, 99562681, 99564701, 99564075, 99574840, 99611408, 99667889, 99726838, 99782079, 99833685, 99874634, 99895173, 99898976, 99903792, 99913836, 99917579, 99913383, 99909490, 99904627, 99888504, 99861962, 99839330, 99821210, 99788558, 99738234, 99699438, 99695128, 99710131, 99715745, 99703187, 99682468, 99653667, 99609214, 99562997, 99533480, 99514562, 99488449, 99456185, 99433857, 99419171, 99392337, 99354470, 99325472, 99305695, 99282056, 99259877, 99258804, 99277538, 99276829, 99231446, 99167061, 99101120]
2845.3I9101120q4990j13583j18190r4932q0490q6743r9134j35839k28071l71880n32239
2867.7I7155029o36471n91033l79724r6589J40625K62183K75576K46614K17134J74237
2888.1I6767581R8478J3656m5222r0957j32346j37067j01131o2478m5734m5193n1868
2910.5I6167719q6599j78600l16536m71324o73717j011431j484210j837778j822286
2928.9H8285238j545740j082927k91103O53160J303321J498318J395827J167053Q91376
2947.2I2274523O21402L96144J98359J538j96374m19176p04014j045221j309049j325846
2967.6H8492286j194626j182300j179474p68197P802N85449O59257M44031K34282J15055
2988H6213565L9762o6954j88732j28364K56413P80588J068860R58306O60515N02491
$$ y = [99101120, 99016130, 98902547, 98784357, 98689425, 98608935, 98522192, 98423058, 98287219, 98059148, 97687268, 97155029, 96518558, 95927525, 95547801, 95451212, 95591837, 95854020, 96129596, 96376210, 96593344, 96767581, 96866059, 96879715, 96834493, 96743536, 96611190, 96474123, 96372992, 96310514, 96264780, 96219587, 96167719, 96081120, 95902520, 95585984, 95114660, 94440943, 93429512, 91945302, 90107524, 88285238, 86739498, 85656571, 85365468, 86018628, 87321949, 88820267, 90216094, 91383147, 92274523, 92895925, 93292069, 93490428, 93491966, 93295592, 92876416, 92172402, 91127181, 89818132, 88492286, 87297660, 86115360, 84935886, 84167689, 84175491, 84760940, 85420197, 85864228, 86098510, 86213565, 86253327, 86186373, 85997641, 85869277, 86125690, 86906278, 87975138, 88933444, 89593959, 90096450]
3008.4I0096450O08939Q29756R40824Q77952P27552N80776M67056L71879K89083K40815
3028.8I6031082K15709J82557J37025J02508J06478J13815Q5491M7749L4082M9043
3049.2I7105539O0314M7886L4851K4652J4776K5124N0068N8651K8264j7190k5940P087
3073.7I7414082M3857M4114O878j7065j3911j8591k4241k1208l0261l4571r965K2292
3098.2I7361410K6196J550o128K2948M0847J4943Q88L2711M8733J7351l5328p0745
3122.6I7455376n7572k1547p587k1178l1972j7720M589k223m0716o0278m9108l5483
3147.1I7114581j1569P450k4789p5674q0264n8907n6118o4445o2376n3364n5098o2508
3171.6I6516919n7727n1862o1738p4780p2903o0981n7650o6805p4988p2969p0899p9829
$$ y = [90096450, 90705389, 91535145, 92475969, 93353921, 94081473, 94662249, 95129305, 95501184, 95790267, 96031082, 96246791, 96429348, 96566373, 96668881, 96775359, 96889174, 96974665, 97022414, 97056496, 97105539, 97165853, 97213739, 97248590, 97273242, 97288018, 97313142, 97363210, 97421861, 97450125, 97432935, 97406995, 97414082, 97457939, 97502053, 97508931, 97491866, 97477955, 97459364, 97435123, 97413915, 97383654, 97349083, 97339118, 97361410, 97387606, 97389156, 97383028, 97405976, 97446823, 97461766, 97462654, 97495365, 97544098, 97561449, 97526121, 97455376, 97397804, 97376257, 97368670, 97347492, 97315520, 97297800, 97302389, 97300166, 97259450, 97199172, 97150064, 97114581, 97103012, 97110462, 97085673, 97009999, 96929735, 96870828, 96814710, 96750265, 96687889, 96634525, 96579427, 96516919, 96459192, 96407330, 96345592, 96270812, 96197909, 96136928, 96079278, 96012473, 95937485, 95864516, 95793617, 95713788]
3196.1I5713788q6361p9030p0607p1222p2557p0291o8820p3063q1671p9238p4643q9502
3220.5I4796783r9767q7571p5751p3630o3646n4264q0251j11902j06406q7160o9815
3243I3886620n6678p0566r8378r4604o6376n5379o9838q0538p6032p4804o8748m0793
3267.5I3033886j6093l6496p7886r7149j02079r8759r0492q2785p7009p3355o1542
3289.9I2220241n8305q6570j25587j47975j39206j02574p5924r8253j55341j96404
3310.3I1034102k04694j93161j78617j73837j80477j82151j73468j93792k37459k49035
3330.7H9067411k31379k13367k03329k24626k63554k80189k88374k83783k59602k69509
3351.1H6549699l13073l27575l04586k82031k89268l07637k93315k70766k92789l34949
$$ y = [95713788, 95627427, 95548397, 95477790, 95406568, 95334011, 95263720, 95194900, 95121837, 95040166, 94960928, 94886285, 94796783, 94697016, 94609445, 94533694, 94460064, 94396418, 94342154, 94261903, 94150001, 94043595, 93956435, 93886620, 93829942, 93759376, 93660998, 93566394, 93500018, 93444639, 93374801, 93294263, 93218231, 93143427, 93074679, 93033886, 93017793, 92981297, 92903411, 92806262, 92704183, 92605424, 92514932, 92432147, 92355138, 92281783, 92220241, 92161936, 92075366, 91949779, 91801804, 91662598, 91560024, 91484100, 91385847, 91230506, 91034102, 90829408, 90636247, 90457630, 90283793, 90103316, 89921165, 89747697, 89553905, 89316446, 89067411, 88836032, 88622665, 88419336, 88194710, 87931156, 87650967, 87362593, 87078810, 86819208, 86549699, 86236626, 85909051, 85604465, 85322434, 85033166, 84725529, 84432214, 84161448, 83868659, 83533710]
3371.5H3533710l37392l03542k77603k67297k59632k47353k27130j97059j62822j59675
3391.9H1094205j90597j99473j67966j44875j70863k04545j89376j53202j40571j45460
3412.3G9387277j52021j49995j36406j39659j68222j96398k37483l26246m53460n30296
3432.7G6897091m32742j51432J42569K84207K83181K30676J80084J49834J49190J61654
3453.1G7894312J65248J63585J68985J77783J78355J75428J82748J95843J98877J91057
3473.4G9692221J83719J89144J96450J86253J68949J67066J71477J69349J70457J74010
3493.8H1469095J74302J74212J77932J84387J81782J65784J60939J64342J62160J65046
3514.2H3179981J68460J70380J80930J98811J96183J75047J63489J63365J71566J87391
$$ y = [83533710, 83196318, 82892776, 82615173, 82347876, 82088244, 81840891, 81613761, 81416702, 81253880, 81094205, 80903608, 80704135, 80536169, 80391294, 80220431, 80015886, 79826510, 79673308, 79532737, 79387277, 79235256, 79085261, 78948855, 78809196, 78640974, 78444576, 78207093, 77880847, 77427387, 76897091, 76464349, 76312917, 76455486, 76739693, 77022874, 77253550, 77433634, 77583468, 77732658, 77894312, 78059560, 78223145, 78392130, 78569913, 78748268, 78923696, 79106444, 79302287, 79501164, 79692221, 79875940, 80065084, 80261534, 80447787, 80616736, 80783802, 80955279, 81124628, 81295085, 81469095, 81643397, 81817609, 81995541, 82179928, 82361710, 82527494, 82688433, 82852775, 83014935, 83179981, 83348441, 83518821, 83699751, 83898562, 84094745, 84269792, 84433281, 84596646, 84768212, 84955603]
3534.6H4955603J94615J92022K13963K45071K39193J99795J75202J84381J96623J97930
3555H6994398K15244K47532K67106K77162K82687K59644K09063J97798K29692K61343
3575.4H9441669K76023K90066L08824L27599L39186L07381K50697K48677K84803K99585
3595.8I2374510K91246K75153K56776K63888K89023L01051K82890K62934K55137K40308
3616.2I5092916K28036K05314J78969J98203K28525K19792J62422J15353J11008J25074
3636.6I6865612J44595J57637J69563K04521K41721J98090N7083l177L1293P7116Q1915
3659I8225969N8997N7602R9522J42711J33824R5159P2247K5296l6931l5411Q988P2170
3683.5I8920143J32316J57076Q5878j9389k3520J6952M7362O0552M2415K1743M8673
$$ y = [84955603, 85150218, 85342240, 85556203, 85801274, 86040467, 86240262, 86415464, 86599845, 86796468, 86994398, 87209642, 87457174, 87724280, 88001442, 88284129, 88543773, 88752836, 88950634, 89180326, 89441669, 89717692, 90007758, 90316582, 90644181, 90983367, 91290748, 91541445, 91790122, 92074925, 92374510, 92665756, 92940909, 93197685, 93461573, 93750596, 94051647, 94334537, 94597471, 94852608, 95092916, 95320952, 95526266, 95705235, 95903438, 96131963, 96351755, 96514177, 96629530, 96740538, 96865612, 97010207, 97167844, 97337407, 97541928, 97783649, 97981739, 98038822, 98035645, 98066938, 98144054, 98225969, 98284966, 98342568, 98442090, 98584801, 98718625, 98813784, 98886031, 98911327, 98874396, 98838985, 98847973, 98920143, 99052459, 99209535, 99295413, 99276024, 99252504, 99269456, 99316818, 99377370, 99419785, 99441528, 99490201]
3706I9490201R4051P9268r447m3744n073L2002M0734K4569L916n651J7894P3135J23250
3732.5I9915105Q4895k4629m3094K772J0937P332L5393J9503n1302q2082l9297n496
3756.9I9830037p802j4895k653J5986J9962Q46k0510j9246J1707M6110K9730j9961
3781.4I9869311l1048j8412j4085k765K4229M5753N4705N0532K0248j6445l2049m5777
3805.9I9904197m8720j5021K6131M3452M9829N8252J1647o3646o1912k5367r430l707
3830.4I9865705K2882O1417M9996j2976n0574m4072k6220N406N5510P3558j9545j07318
3854.8I9873769m4417J2696L9780L4267J1891J2415Q214r459k5595k3287P558L1209
3879.3I9929041L2794J8573o020j8394j4722j9950k2406K671L3074L8582J0473l0184
$$ y = [99490201, 99584252, 99663520, 99654073, 99610329, 99605256, 99637258, 99677992, 99702561, 99706477, 99700826, 99718720, 99791855, 99915105, 100000000, 99975371, 99932277, 99935049, 99945986, 99953318, 99988711, 100008214, 99956912, 99874830, 99835533, 99830037, 99822235, 99807340, 99804687, 99820673, 99840635, 99841481, 99820971, 99801725, 99813432, 99859542, 99889272, 99869311, 99838263, 99819851, 99805766, 99803001, 99827230, 99872983, 99927688, 99978220, 99998468, 99982023, 99949974, 99904197, 99855477, 99840456, 99866587, 99910039, 99959868, 100018120, 100029767, 99966121, 99904209, 99878842, 99869412, 99865705, 99888587, 99950004, 100000000, 99987024, 99936450, 99892378, 99866158, 99871564, 99927074, 100000632, 99981087, 99873769, 99829352, 99842048, 99881828, 99916095, 99927986, 99940401, 99948615, 99939156, 99913561, 99890274, 99897832, 99929041, 99961835, 99980408, 99974388, 99955994, 99941272, 99921322, 99898916, 99901587, 99934661, 99973243, 99983716, 99953532]
3903.8I9953532m9478m0435j4818J8918L9161L3509J2780K831O401L183o37Q648J3387
3930.3I9986982k658k0766j7464O848K4027J6701O330J550n436j0461n370j008l534
3956.8I9975741k533o974j7136j7643j5569j5813j2285j0413j0484m971N489J9646
3981.3I9887055K4283J1695M941J1182J6236J7804J6796J3489
3997.6A00003481
$$ y = [99953532, 99904054, 99863619, 99848801, 99867719, 99906880, 99940389, 99953169, 99956000, 99962401, 99965584, 99964947, 99973595, 99986982, 99984324, 99963558, 99946094, 99952942, 99976969, 99993670, 100000000, 100001550, 99996114, 99985653, 99980283, 99979275, 99975741, 99973208, 99966234, 99949098, 99931455, 99915886, 99900073, 99887788, 99877375, 99866891, 99861920, 99867409, 99887055, 99911338, 99923033, 99927974, 99939156, 99955392, 99973196, 99989992, 100003481]
##END=$$ End of the data block
