##TITLE=CN10 $$ Begin of the data block
##JCAMP-DX=5.00 $$ ACD/SpecManager v 10.08
##DATE=14 Dec 2016 11:32:34
##DATA TYPE=INFRARED SPECTRUM
##DATA CLASS=XYDATA
##ORIGIN=Marcelo Quint
##OWNER=
##NPOINTS=1765
##FIRSTX=399.77209473
##LASTX=3997.72216797
##MAXX=3997.72216797
##MINX=399.77209473
##MAXY=0.84525478
##MINY=0.22566836
##XFACTOR=1.0000000000
##YFACTOR=1.000000000000000e-9
##FIRSTY=0.84091467
##DELTAX=2.03965425
##XUNITS=1/CM
##YUNITS=ARBITRARY UNITS
##XYDATA=(X++(Y..Y))
$$ plain form
399.8 840914667 843718231 843830168 843367100 842501640 841281354 840778112 839868248 839016140 839027047 840412378
420.2 840412378 842618465 843710542 844474852 844742060 844141722 843975782 843596220 843246102 843000472
438.5 843000472 841986716 840509593 838158190 837050736 838240981 838895738 837643266 833845317 830620348
456.9 830620348 832732558 837452948 840907097 842059612 841885626 841347754 839526355 837197363 834054947
475.2 834054947 831409037 833280325 837287009 839876652 840948343 840974152 840948641 840329230 838995218
493.6 838995218 836244106 831772387 829893053 832156420 834874570 835289478 833248436 830149531 825180411
512 825180411 815572619 797237396 768151641 743455410 740768552 747807443 743743241 741931796
528.3 741931796 764261127 797952235 820833504 831370175 835773587 837690890 838938117 839402616
$$ packed form
399.8H40914667K803564J11937m63068q65460j220286n03242r09864q52108J0907J385331
420.2H40412378K206087J092077P64310K67208o00338j65940l79562l50118k45630
438.5H43000472j013756j477123k351403j107454J190245O54757j252472l797949l224969
456.9H30620348K112210M720390L454149J152515j73986n37872j821399k328992l142416
475.2H34054947k645910J871288M006684K589643J071691K5809k5511o19411j334012
493.6H38995218k751112m471719j879334K263367K718150M14908k041042l098905m969120
512H25180411r607792j8335223k9085755k4696231k686858P038891m064202j811445
528.3G41931796K2329331L3691108K2881269J0536671M403412J917303J247227M64499
$$ plain form
544.6 839402616 839752793 840036631 839915395 840026021 839888334 839677036 839654326 839369595 839184523 838833451
565 838833451 838497937 838541865 838353455 838187754 837916374 837455750 837378025 837303638 837445021 837685108 837514818
587.4 837514818 837385118 837191284 837143064 837379634 837352395 837378860 837380648 837221026 837141335 836600602 835865736
609.9 835865736 835117936 834087074 833236158 832668126 832661748 833071947 833176315 833203375 832956195 831835687
630.3 831835687 830231130 829410136 830287457 831154525 830578685 829149663 826621115 822522521 815575659
648.6 815575659 802054107 775846362 735409737 703983665 717096686 767765224 813058496
662.9 813058496 834066212 841045499 843690634 844528377 844674528 844547749 844032586 843584538 843106210
681.2 843106210 842405558 841576040 840221107 838201761 834733725 827952862 814124823 790262520
$$ packed form
544.6H39402616L50177K83838j21236J10626j37687k11298k2710k84731j85072l51072
565H38833451l35514M3928j88410j65701k71380m60624p7725p4387J41383K40087j70290
587.4H37514818j29700j93834m8220K36570k7239K6465J788j59622p9691n40733p34866
609.9H35865736p47800j030862q50916n68032o378M10199J04368K7060k47180j120508
630.3H31835687j604557q20994Q77321Q67068n75840j429022k528548m098594o946862
648.6H15575659j3521552k6207745m0436625l1426072J3113021N0668538M5293272
662.9H13058496K1007716O979287K645135Q37743J46151j26779n15163m48048m78328
681.2H43106210p00652q29518j354933k019346l468036o780863j3828039k3862303
$$ plain form
697.6 790262520 773371935 785706103 812554538 826861680 826861680 819226861 801856995 769385159
713.9 769385159 733671308 725443542 753873825 791558504 815454185 826945603 832147539 832975209
730.2 832975209 828931272 820430696 814251900 815988660 820578873 820690453 811126590 781883597
746.5 781883597 717501819 635688305 616954267 694492519 786446929 830297172 841965675
760.8 841965675 844639003 845254779 845234573 845215082 845178366 844694018 844106197 843328357 842439055 841631889
781.2 841631889 840575695 839368820 837880373 835629702 832016408 824461758 812526286 803792119
797.5 803792119 806007922 814316452 818729222 818089485 815653086 811914444 807069361 802474618 799080670
815.9 799080670 796114683 790803969 780386627 759812057 716569483 635031223 527897477 463873595
$$ packed form
697.6G90262520j6890585J2334168K6848435J4307142%p634819j7369866l2471836
713.9G69385159l5713851q227766K8430283L7684679K3895681J1491418N201936Q27670
730.2H32975209m043937q500576o178796J736760M590213J11580r563863k9242993
746.5G81883597o4381778q1813514j8734038P7538252R1954410M3850243J1668503
760.8H41965675K673328O15776k0206j9491l6716m84348n87821p77840q89302q07166
781.2H41631889j056194j206875j488447k250671l613294p554650j1935472q734167
797.5H03792119K215803Q308530M412770o39737k436399l738642m845083m594743l393948
815.9G99080670k965987n310714j0417342k0574570m3242574q1538260j07133746o4023882
$$ plain form
832.2 463873595 503171325 609895349 704381049 759536266 789525330 806719661 815949500
846.5 815949500 820054054 820387840 816757262 812637687 813742578 819795907 825528264 828152120 828810692
864.8 828810692 828724504 827984154 827101886 826114058 825006604 824078441 822745204 821049988 818933129
883.2 818933129 815853357 812524140 810555398 811083972 812918007 813845754 813789070 813234389 812354863
901.5 812354863 811570585 810514688 809262574 807863832 805969357 804264367 803027570 801964760 800957620
919.9 800957620 799602747 798073053 796370864 794144452 791741014 788947821 785678625 782352328
936.2 782352328 779574454 778235674 777219892 774780929 770988703 766126931 760892451 756442726
952.5 756442726 753047228 750305891 746693671 740998626 733544350 724733949 714902937 703808784
$$ packed form
832.2D63873595L9297730J06724024R4485700N5155217K9989064J7194331R229839
846.5H15949500M104554L33786l630578m119575J104891O053329N732357K623856O58572
864.8H28810692q6188p40350q82268r87828j107454r28163j333237j695216k116859
883.2H18933129l079772l329217j968742N28574J834035R27747n6684n54681q79526
901.5H12354863p84278j055897j252114j398742j894475j704990j236797j062810j007140
919.9H00957620j354873j529694j702189k226412k403438k793193l269196l326297
936.2G82352328k777874j338780j015782k438963l792226m861772n234480m449725
952.5G56442726l395498k741337l612220n695045p454276q810401r831012j1094153
$$ plain form
968.8 703808784 690621495 675199807 657826066 638662577 617557347 594212651 568545818
983.1 568545818 542391002 524912477 532122910 570640862 625678420 677074254 716303885 740397990
999.4 740397990 744843185 732420385 720704675 721207380 726622403 727782011 718738616 695928395
1015.8 695928395 665830314 645316303 642425656 643947363 640150547 636838436 631846666 612421870
1032.1 612421870 584408879 580018878 615902066 662591934 681941569 666889012 630272269
1046.3 630272269 588210762 556123137 539889872 535546124 541344106 558148384 581848085 606681526
1062.7 606681526 631067991 656869054 686146557 716096699 739835501 754108429 759574473
1076.9 759574473 758045137 752616644 746605039 743600607 746515870 754994333 765637994 774716854
$$ packed form
968.8G03808784j3187289j5421688j7373741j9163489k1105230k3344696k5666833
983.1E68545818k6154816j7478525P210433L8517952N5037558N1395834L9229631K4094105
999.4G40397990M445195j2422800j1715710N02705N415023J159608r043395k2810221
1015.8F95928395l0098081k0514011k890647J521707l796816l312111m991770j9424796
1032.1F12421870k8012991m390001L5883188M6689868J9349635j5052557l6616743
1046.3F30272269m2061507l2087625j6233265m343748N797982J6804278K3699701K4833441
1062.7F06681526K4386465K5801063K9277503K9950142K3738802J4272928N466044
1076.9G59574473j529336n428493o011605l004432K915263Q478463J0643661R078860
$$ plain form
1093.3 774716854 781035960 785283208 787381649 787215173 785013914 782012641 780868411 781931460
1109.6 781931460 782494843 779209256 770393610 759945750 754067540 751102507 743466854 732332051
1125.9 732332051 732299507 750864685 774475694 788930058 793652594 792980015 789451063 783260822
1142.2 783260822 774384916 763783038 754283011 750168085 750749648 749619603 742714167 730323434
1158.5 730323434 712687850 687676966 654271841 618672311 596112847 599085212 616633356
1172.8 616633356 619574487 595000029 561406612 549294233 578957558 644503057 714861929
1187.1 714861929 764144242 790322065 802649319 808028698 809646368 809360504 807811677 805650055
1203.4 805650055 803661585 801340997 797949135 792907476 787275970 783917904 782828152 781359494
$$ packed form
1093.3G74716854O319106M247248K098441j66476k201259l001273j144230J063049
1109.6G81931460N63383l285587q815646j0447860n878210k965033p635653j1134803
1125.9G32332051l2544J8565178K3611009J4454364M722536o72579l528952o190241
1142.2G83260822q875906j0601878r500027m114926N81563j130045o905436j2390733
1158.5G30323434j7635584k5010884l3405125l5599530k2559464K972365J7548144
1172.8F16633356K941131k4574458l3593417j2112379K9663325O5545499P0358872
1187.1G14861929M9282313K6177823J2327254N379379J617670k85864j548827k161622
1203.4H05650055j988470k320588l391862n041659n631506l358066j089752j468658
$$ plain form
1219.7 781359494 777973890 772545099 765572131 757019997 746578097 734017670 718979478 701893032
1236 701893032 682660937 661351919 638671935 611826777 576747179 534352839 488237709 436385125
1252.4 436385125 378995359 334898621 326490462 351638943 392116189 446912140 525753677
1266.6 525753677 613304496 677713335 706549168 718469203 735993087 757110953 770406783
1280.9 770406783 773962259 768078625 749621511 719601929 686117947 651507199 617726564 606692314
1297.2 606692314 637780249 691104174 724347532 712174952 668055236 638181567 654144108
1311.5 654144108 701909781 749136925 779814899 795887768 803954542 808302164 810440242 811394036
1327.8 811394036 812144876 812911093 813652217 813718438 812875211 811960280 811607659 812214971 813186467 813379765
$$ packed form
1219.7G81359494l385604n428791o972968q552134j0441900j2560427j5038192j7086446
1236G01893032j9232095k1309018k2679984k6845158l5079598m2394340m6115130n1852584
1252.4D36385125n7389766m4096738q408159K5148481M0477246N4795951P8841537
1266.6E25753677Q7550819O4408839K8835833J1920035J7523884K1117866J3295830
1280.9G70406783L555476n883634j8457114l0019582l3483982l4610748l3780635j1034250
1297.2F06692314L1087935N3323925L3243358j2172580m4119716k9873669J5962541
1311.5F54144108M7765673M7227144L0677974J6072869Q066774M347622K138078R53794
1327.8H11394036P50840P66217P41124O6221q43227r14931l52621O07312R71496J93298
$$ plain form
1348.2 813379765 812712073 811349809 809569716 807472050 804515719 800742209 796710372 793188334
1364.5 793188334 790208399 786547184 781360447 773486793 763412118 755167902 749049246 741081953
1380.9 741081953 729845166 716439068 696152508 664143026 636928856 639873564 673390627
1395.1 673390627 705799758 719247639 717993081 703740954 673967302 635208249 602039218
1409.4 602039218 586223006 592634201 619075298 661332786 707766712 737791896 751287699
1423.7 751287699 756533802 756892085 755750239 754026473 748674512 736111701 715152979 686940968
1440 686940968 651687920 622485459 620152354 643925369 666721582 672849059 672433674 679614127
1456.3 679614127 692512214 696004093 686664939 659255385 615121424 576675653 561171889 560782671
$$ packed form
1348.2H13379765o67692j362264j780093k097666k956331l773510m031837l522038
1364.5G93188334k979935l661215n186737p873654j0074675q244216o118656p967293
1380.9G41081953j1236787j3406098k0286560l2009482k7214170K944708L3517063
1395.1F73390627L2409131J3447881j254558j4252127k9773652l8759053l3169031
1409.4F02039218j5816212O411195K6441097M2257488M6433926L0025184J3495803
1423.7G51287699N246103L58283j141846j723766n351961j2562811k0958722k8212011
1440F86940968l5253048k9202461k333105K3773015K2796213O127477m15385P180453
1456.3F79614127J2898087L491879r339154k7409554m4133961l8445771j5503764l89218
$$ plain form
1472.6 560782671 552930295 557409942 601139903 663495958 708108187 725082815 723694801 708867550
1489 708867550 681760252 644721627 590228975 509411514 433767527 407761514 421798825 432803690
1505.3 432803690 439335793 491657943 574973881 650644362 701940298 733764291 752369463
1519.6 752369463 763972938 771402419 775297940 777494371 778237402 777927935 779025614 782073438
1535.9 782073438 785494447 789797366 793920696 796084046 796577871 796492815 796941817 797675669 797452927
1554.2 797452927 795334935 791059613 786851227 782346070 774388194 761735022 742693365 722395778
1570.5 722395778 713485122 716280162 722163379 719399512 707308710 696673274 699454665 716156840
1586.9 716156840 736686707 750148237 752040863 743755341 727744579 704199731 672868490 634279609
$$ packed form
1472.6E60782671p852376M479647M3729961O2356055M4612229J6974628j388014j4827251
1489G08867550k7107298l7038625n4492652q0817461p5643987k6006013J4037311J1004865
1505.3D32803690O532103N2322150Q3315938P5670481N1295936L1823993J8605172
1519.6G52369463J1603475P429481L895521K196431P43031l09467J097679L047824
1535.9G82073438L421009M302919M123330K163350M93825q5056M49002P33852k22742
1554.2G97452927k117992m275322m208386m505157p957876j2653172j9041657k0297587
1570.5G22395778q910656K795040N883217k763867j2090802j0635436K781391J6702175
1586.9G16156840K0529867J3461530J892626q285522j6010762k3544848l1331241l8588881
$$ plain form
1603.2 634279609 586310208 524154902 451187432 387723207 357857704 376560420 441819936
1617.5 441819936 511498153 566122591 611137748 643589199 667201102 686988354 701881230
1631.7 701881230 713073373 723910213 732746482 738610148 743231297 747088969 751711965 757736623
1648.1 757736623 762135148 765921116 772115290 777149856 779711246 780880213 781544864 781923711 781586289
1666.4 781586289 781020761 781152725 781508029 781445622 781465769 781565607 780971348 780010462 780709028 782580912
1686.8 782580912 783980310 784989893 785216570 784885406 784587383 784525573 785368621 786090851 786048055 786017597
1707.2 786017597 786069036 785981536 785467863 784746647 784883261 785963595 786683142 786552608 785990834 785212338
1727.6 785212338 784001172 782421887 781214893 780925393 780466437 779393733 778406262 777580202 776415169
$$ packed form
1603.2F34279609m7969401o2155306p2967470o3464225k9865503J8702716O5259516
1617.5D41819936O9678217N4624438M5015157L2451451K3611903J9787252J4892876
1631.7G01881230J1192143J0836840Q836269N863666M621149L857672M622996O024658
1648.1G57736623M398525L785968O194174N034566K561390J168967O64651L78847l37422
1666.4G81586289n65528J31964L55304o2407K0147R9838n94259r60886O98566J871884
1686.8G82580912J399398J009583K26677l31164k98023o1810Q43048P22230m2796l0458
1707.2G86017597N1439q7500n13673p21216J36614J080334P19547j30534n61774p78496
1727.6G85212338j211166j579285j206994k89500m58956j072704r87471q26060j165033
$$ plain form
1746 776415169 775060833 773982406 773453891 773118496 772558570 771920085 771240175 771005750 771821082 772814929
1766.4 772814929 773218751 773045003 772750139 772764981 772436917 771359801 770163774 769176066 768278539
1784.7 768278539 767509699 766376317 764861405 763812423 763223350 762502015 761402547 760229170 759249330
1803.1 759249330 758050799 756573200 754995227 753438234 752126634 750767767 749280155 747886777
1819.4 747886777 746299624 744568884 743040919 741667807 740486503 739488125 738235533 736505926
1835.7 736505926 734458029 732317328 729812682 726902187 724314094 721834362 719095528 716227472
1852 716227472 713262439 710471392 707920671 705535829 703328073 700965822 698252678 695420563 692771852
1870.4 692771852 690278709 687503517 684470832 681423903 678256214 675110996 672118068 669178128
$$ packed form
1746G76415169j354336j078427n28515l35395n59926o38485o79910k34425Q15332R93847
1766.4G72814929M03822j73748k94864J4842l28064j077116j196027r87708q97527
1784.7G68278539p68840j133382j514912j048982n89073p21335j099468j173377r79840
1803.1G59249330j198531j477599j577973j556993j311600j358867j487612j393378
1819.4G47886777j587153j730740j527965j373112j181304r98378j252592j729607
1835.7G36505926k047897k140701k504646k910495k588093k479732k738834k868056
1852G16227472k965033k791047k550721k384842k207756k362251k713144k832115k648711
1870.4F92771852k493143k775192l032685l046929l167689l145218k992928k939940
$$ plain form
1886.7 669178128 666581213 664981365 664561212 664902210 665453434 666033387 666548729 666858494 667047441
1905 667047441 667165101 667601585 668678761 670047283 671425283 672893286 674476862 676061749 677610695
1923.4 677610695 679121554 680395424 681282520 681995511 682594597 683058858 683505476 683905959 684673846
1941.8 684673846 686281502 688357115 690561593 692769825 695027530 697602689 700412810 703289568
1958.1 703289568 705994248 708245039 710121691 711737514 713205159 714509487 715389192 715862095 715934873
1976.4 715934873 715539813 714947283 714317799 713774323 713485301 713355064 713399291 713588119 713696539 713721633
1996.8 713721633 713683248 713616312 713474452 713029087 712457359 712104261 712130785 712581336 713263452 714059234
2017.2 714059234 714761376 715114892 715202093 715277851 715884149 717124104 718407929 719633341 720924199
$$ packed form
1886.7F69178128k596915j599848m20153L40998N51224N79953N15342L09765J88947
1905F67047441J17660M36484J077176J368522J378000J468003J583576J584887J548946
1923.4F77610695J510859J273870Q87096P12991N99086M64261M46618M00483P67887
1941.8F84673846J607656K075613K204478K208232K257705K575159K810121K876758
1958.1G03289568K704680K250791J876652J615823J467645J304328Q79705M72903P2778
1976.4G15934873l95060n92530o29484n43476k89022j30237M4227J88828J08420K5094
1996.8G13721633l8385o6936j41860m45365n71728l53098K6524M50551O82116P95782
2017.2G14059234P02142L53516Q7201P5758O06298J239955J283825J225412J290858
$$ plain form
2035.6 720924199 722184002 723504424 724861801 726099014 727104545 727631807 727698803 727502406 727161050
2053.9 727161050 726848364 726479411 725977063 725417852 724790275 724346876 724315584 724687099 725403488 726096094
2074.3 726096094 726471841 726470828 726029217 725424170 724978566 724808693 724989593 725369513 725850284 726401031
2094.7 726401031 726855636 727163434 727221727 727025270 726794004 726557374 726313651 726014793 725522161 724898577
2115.1 724898577 724120021 723197699 722311318 721483648 720836818 720430970 720113754 719832540 719476879 719046950
2135.5 719046950 718734860 718645155 718891203 719415545 720075309 720895648 721716583 722426534 723068237 723542631
2155.9 723542631 723868728 724016488 723889172 723593891 723123908 722522616 722015858 721614540 721211910 720700622
2176.3 720700622 720104814 719560802 718984902 718362331 717765868 717157006 716598332 716105103 715654016 715239644
$$ packed form
2035.6G20924199J259803J320422J357377J237213J005531N27262O6996j96397l41356
2053.9G27161050l12686l68953n02348n59211o27577m43399l1292L71515P16389O92606
2074.3G26096094L75747j013m41611o05047m45604j69873J80900L79920M80771N50747
2094.7G26401031M54605L07798N8293j96457k31266k36630k43723k98858m92632o23584
2115.1G24898577p78556r22322q86381q27670o46830m05848l17216k81214l55661m29929
2135.5G19046950l12090q9705K46048N24342O59764Q20339Q20935P09951O41703M74394
2155.9G23542631L26097J47760j27316k95281m69983o01292n06758m01318m02630n11288
2176.3G20700622n95808n44012n75900o22571n96463o08862n58674m93229m51087m14372
$$ plain form
2196.7 715239644 714747727 714204431 713633001 712984324 712326407 711591959 710753620 709931135 709156871 708509743
2217.1 708509743 707975507 707445979 706922472 706335843 705685019 705037177 704374254 703742385 703063667 702267528
2237.5 702267528 701483011 700741887 700047612 699385464 698687732 698001981 697301030 696546078 695766032 694882154
2257.9 694882154 693910599 692875981 691753626 690660477 689659595 688748956 687867880 686866879 685779870
2276.3 685779870 684667528 683455050 682114422 680641294 679124534 677639842 676129878 674598813
2292.6 674598813 672984183 671221256 669403493 667568088 665765762 664092839 662573934 661225080
2308.9 661225080 659962177 658686340 657359183 655930281 654507995 653184295 651853383 650431275
2325.2 650431275 648863494 647230208 645713687 644258499 642786562 641433299 640458226 640067816 640285850
$$ packed form
2196.7G15239644m91917n43296n71430o48677o57917p34448q38339q22485p74264o47128
2217.1G08509743n34236n29528n23507n86629o50824o47842o62923o31869o78718p96139
2237.5G02267528p84517p41124o94275o62148o97732o85751p00951p54952p80046q83878
2257.9F94882154r71555j034618j122355j093149j000882r10639q81076j001001j087009
2276.3F85779870j112342j212478j340628j473128j516760j484692j509964j531065
2292.6F74598813j614630j762927j817763j835405j802326j672923j518905j348854
2308.9F61225080j262903j275837j327157j428902j422286j323700j330912j422108
2325.2F50431275j567781j633286j516521j455188j471937j353263r75073l90410K18034
$$ plain form
2343.6 640285850 640926600 641369104 641342700 641268730 641374826 641301095 640730917 639628649 638118982 636329710
2364 636329710 634372294 632378101 630408764 628590703 627013445 625596702 624263287 622927427 621517539
2382.3 621517539 620076120 618587255 616972148 615180314 613175809 611072838 609030902 607133627
2398.6 607133627 605451226 603985965 602761567 601769149 600857556 599935174 598976016 598001003 597095132
2417 597095132 596223712 595273733 594163299 592880487 591541350 590220332 588908434 587613583 586284399
2435.3 586284399 584879458 583445668 582035720 580669880 579310358 577980876 576785743 575754344
2451.7 575754344 574868321 574071825 573312640 572615862 571967363 571329296 570716321 570210040 569953084 569960475
2472.1 569960475 570082724 570169687 570177078 570329547 571078360 572836161 575784981 579675794 583909988
$$ packed form
2343.6F40285850O40750M42504k6404p3970J06096p3731n70178j102268j509667j789272
2364F36329710j957416j994193j969337j818061j577258j416743j333415j335860j409888
2382.3F21517539j441419j488865j615107j791834k004505k102971k041936j897275
2398.6F07133627j682401j465261j224398r92418r11593r22382r59158r75013r05871
2417E97095132q71420r49979j110434j282812j339137j321018j311898j294851j329184
2435.3E86284399j404941j433790j409948j365840j359522j329482j195133j031399
2451.7E75754344q86023p96496p59185o96778o48499o38067o12975n06281k56956P391
2472.1E69960475J22249Q6963P391J52469P48813J757801K948820L890813M234194
$$ plain form
2490.4 583909988 587867856 591028392 592924058 593147516 591675162 589155972 586452246 584064186
2506.7 584064186 582063854 580287874 578610241 576951861 575267017 573646069 572194815 570988238
2523 570988238 570035994 569168746 568172693 566958725 565560579 564049840 562478483 560958743 559590220
2541.4 559590220 558400452 557515144 557116270 557320476 558149934 559459984 560946226 562190175 562862396
2559.8 562862396 563038468 563063323 563190639 563443959 563732266 564131558 564811468 565788686 567002058 568381429
2580.1 568381429 569813669 571141064 572177410 572781682 572829843 572223485 571029305 569462836 567784607
2598.5 567784607 566186845 564791858 563733518 563039601 562682569 562721193 563166797 563961327 565026879
2616.9 565026879 566259623 567614794 569063127 570532680 571967363 573373079 574823976 576296628
$$ packed form
2490.4E83909988L957868L160536J895666K23458j472354k519190k703726k388060
2506.7E84064186k000332j775980j677633j658380j684844j620948j451254j206577
2523E70988238r52244q67248r96053j213968j398146j510739j571357j519740j368523
2541.4E59590220j189768q85308l98874K04206Q29458J310050J486242J243949O72221
2559.8E62862396J76072K4855J27316K53320K88307L99292O79910R77218J213372J379371
2580.1E68381429J432240J327395J036346O04272M8161o06358j194180j566469j678229
2598.5E67784607j597762j394987j058340o93917l57032L8624M45604P94530J065552
2616.9E65026879J232744J355171J448333J469553J434683J405716J450897J472652
$$ plain form
2633.2 576296628 577617705 578711212 579688489 580801964 582378030 584654510 587703168 591323912
2649.5 591323912 595093668 598696828 601991296 604913950 607397437 609267771 610335231 610399783 609182596
2667.8 609182596 606424809 602052152 596500456 590734959 585710943 581966102 579554617 578329146
2684.2 578329146 578154325 578776956 579866767 581092477 582181573 583041847 583659172 584059954 584426701
2702.5 584426701 584943235 585624874 586389005 587203979 588105142 589031100 589880705 590672493 591490328 592419505
2722.9 592419505 593504250 594671190 595865905 597154915 598520577 599866748 601187944 602629960
2739.2 602629960 604402065 606538594 608830750 610955834 612692297 614043832 615093291 615778565
2755.6 615778565 615858436 615144074 613675594 611805439 610337734 610075414 611123621 613081932 615533233
$$ packed form
2633.2E76296628J321077J093507R77277J113475J576066K276480L048658L620744
2649.5E91323912L769756L603160L294468K922654K483487J870334J067460O4552j217187
2667.8F09182596k757787m372657n551696n765497n024016l744841k411485j225471
2684.2E78329146j74821O22631J089811J225710J089096Q60274O17325M00782L66747
2702.5E84426701N16534O81639P64131Q14974R01163R25958Q49605P91788Q17835R29177
2722.9E92419505J084745J166940J194715J289010J365662J346171J321196J442016
2739.2F02629960J772105K136529K292156K125084J736463J351535J049459O85274
2755.6F15778565P9871p14362j468480j870155j467705k62320J048207J958311K451301
$$ plain form
2773.9 615533233 618132591 620604157 622716844 624273658 625171423 625527740 625734925 626163185 626962364
2792.3 626962364 628166139 629637778 631032407 631987333 632353246 632182240 631510735 630309165 628497183
2810.6 628497183 625939071 622580111 618454516 613605320 608161092 602322459 596287847 590162575
2826.9 590162575 583738327 576443315 567643344 556971431 544064403 527927697 506820142 478320867
2843.3 478320867 440844059 398370564 363335520 351562649 370336235 410147965 452214926
2857.5 452214926 483111650 499211073 502802908 498512655 491176188 484964103 483538985 488774061
2873.8 488774061 498796433 509434998 517226279 520386457 518964112 514373660 508295536 501967132
2890.2 501967132 495331734 487086803 475898683 461184442 443837672 425817996 406346649 380235672
$$ packed form
2773.9F15533233K599358K471566K112687J556814Q97765L56317K07185M28260P99179
2792.3F26962364J203775J471639J394629R54926L65913j71006o71505j201570j811982
2810.6F28497183k558112l358960m125595m849196n444228n838633o034612o125272
2826.9E90162575o424248p295012q799971j0671913j2907028j6136706k1107555k8499275
2843.3D78320867l7476808m2473495l5035044j1772871J8773586L9811730M2066961
2857.5D52214926L0896724J6099423L591835m290253p336467o212085j425118N235076
2873.8D88774061J0022372J0638565P791281L160178j422345m590452o078124o328404
2890.2E01967132o635398q244931j1188120j4714241j7346770j8019676j9471347k6110977
$$ plain form
2906.5 380235672 343024045 296594173 251762003 225668356 229336306 257231802 294029534
2920.8 294029534 328039020 354438692 370592237 372608244 358972013 340880871 340637147 368383646
2937.1 368383646 411274344 452160209 484458148 508610725 526053369 537756741 544465721
2951.3 544465721 546221197 541249096 527136087 507270932 494316995 497537255 510857046 524467647
2967.7 524467647 537976265 554405332 572197378 587357402 597829103 603945553 607070327 608900785
2984 608900785 610944152 613858938 617381275 620833993 623748660 626178265 628515184 631004214 633408070
3002.3 633408070 635400355 637106240 638855875 640605986 641992807 642952979 643946469 645443499 647554994
3020.7 647554994 650059819 652522683 654641390 656384945 657721937 658458650 658409297 657902181 657789528
$$ packed form
2906.5C80235672l7211627m6429872m4832170k6093647L667950K7895496L6797732
2920.8B94029534L4009486K6399672J6153545K016007j3636231j8091142k43724K7746499
2937.1C68383646M2890698M0885865L2297939K4152577J7442644J1703372O708980
2951.3E44465721J755476m972101j4113009j9865155j2953937L220260J3319791J3610601
2967.7E24467647J3508618J6429067J7792046J5160024J0471701O116450L124774J830458
2984F08900785K043367K914786L522337L452718K914667K429605K336919K489030K403856
3002.3F33408070J992285J705885J749635J750111J386821R60172R93490J497030K111495
3020.7F47554994K504825K462864K118707J743555J336992P36713m9353n07116j12653
$$ plain form
3039 657789528 658421278 659344137 660146773 660845816 661564231 662078798 661997497 661105931 659116685 655576468
3059.4 655576468 650102258 643230617 637614071 636454582 639944971 645419836 650772154 655693114
3075.8 655693114 660021842 662942529 663889050 662919641 660697043 658636153 658064663 659164906 661262929
3094.1 661262929 663699508 666152894 668440700 670400560 672029436 673476219 674749196 675684512
3110.4 675684512 676454127 677361429 678220630 678787649 679066539 679167151 679332376 679658949 679964781 680003285
3130.8 680003285 679693758 679133952 678331614 677170932 675674856 674208641 673272252 673007429 673124969
3149.2 673124969 673231006 672997892 672497809 672268629 672589242 673226595 673856616 674339175 674715519 675029933
3169.6 675029933 675319016 675571680 675634563 675458133 675124347 674713671 674363792 674109280 673869729 673589706
$$ packed form
3039F57789528O31750R22859Q02636O99043P18415N14567q1301q91566j989246l540217
3059.4F55576468n474210o871641n616546j159489L490389N474865N352318M920960
3075.8F55693114M328728K920687R46521r69409k222598k060890n71490J100243K098023
3094.1F61262929K436579K453386K287806J959860J628876J446783J272977R35316
3110.4F75684512P69615R07302Q59201N67019K78890J00612J65225L26573L05832L8504
3130.8F80003285l09527n59806q02338j160682j496076j466215r36389k64823J17540
3149.2F73124969J06037k33114n00083k29180L20613O37353O30021M82559L76344L14414
3169.6F75029933K89083K52664O2883j76430l33786m10676l49879k54512k39551k80023
$$ plain form
3190 673589706 673239827 672899663 672694862 672628760 672604382 672521055 672348261 672095954 671746492 671261847
3210.4 671261847 670635343 669954896 669295073 668714762 668349028 668206811 668173254 668212414 668236911 668126762
3230.8 668126762 667931259 667691290 667380750 667009115 666574121 666128635 665723622 665286720 664768994 664228261
3251.2 664228261 663744271 663295865 662799776 662291169 661804855 661348283 660983741 660746694 660597563 660308957
3271.6 660308957 659755290 659132123 658557415 658046544 657620370 657199204 656745434 656319022 655995488 655719817
3292 655719817 655279756 654590487 653749645 652954042 652419686 652071416 651555181 650692105 649588346 648466110
3312.3 648466110 647458255 646495461 645538688 644602060 643706262 642843485 641826689 640596926 639325500
3330.7 639325500 638107896 637021720 636063099 634938300 633535802 632091522 630700171 629393339
$$ packed form
3190F73589706l49879l40164k04801o6102k4378q3327j72794k52307l49462m84645
3210.4F71261847o26504o80447o59823n80311l65734j42217l3557L9160K4497j10149
3230.8F68126762j95503k39969l10540l71635m34994m45486m05013m36902n17726n40733
3251.2F64228261m83990m48406m96089n08607m86314m56572l64542k37047j49131k88606
3271.6F60308957n53667o23167n74708n10871m26174m21166m53770m26412l23534k75671
3292F55719817m40061o89269q40842p95603n34356l48270n16235q63076j103759j122236
3312.3F48466110j007855r62794r56773r36628q95798q62777j016796j229763j271426
3330.7F39325500j217604j086176r58621j124799j402498j444280j391351j306832
$$ plain form
3347 629393339 628199279 626846015 625163496 623447895 621937871 620510280 618971348 617390811 616014838
3365.4 616014838 614769042 613260508 611368656 609453201 607828021 606450915 605131388 603745580
3381.7 603745580 602375448 601143241 600116730 599315464 598476708 597345293 596193075 595432997 594856918
3400 594856918 593884528 592593253 591548085 590835452 590220690 589577794 588821828 587993264 587283313 586757600
3420.4 586757600 586300611 585886776 585626721 585482478 585306168 585170209 585170209 585084200 584732533 584400892 584363341
3442.9 584363341 584545374 584850013 585148275 585376441 585652828 586028993 586493731 586973906 587362230 587822914
3463.3 587822914 588597655 589503169 590091527 590280414 590473831 590954781 591597974 592193544 592652023 593076766
3483.7 593076766 593641937 594289362 594893575 595460117 596043169 596722066 597363412 597860754 598489523 599211574
$$ packed form
3347F29393339j194060j353264j682519j715601j510024j427591j538932j580537j375973
3365.4F16014838j245796j508534j891852j915455j625180j377106j319527j385808
3381.7F03745580j370132j232207j026511q01266q38756j131415j152218p60078n76079
3400E94856918r72390j291275j045168p12633o14762o42896p55966q28564p09951n25713
3420.4E86757600m56989m13835k60055j44243j76310j35959%q6009l51667l31641l7551
3442.9E84363341J82033L04639K98262K28166K76387L76165M64738M80175L88324M60684
3463.3E87822914P74741R05514N88358J88887J93417M80950O43193N95570M58479M24743
3483.7E93076766N65171O47425O04213N66542N83052O78897O41346M97342O28769P22051
$$ plain form
3504.1 599211574 599742234 600329459 601219654 602203548 603009820 603648663 604281902 605028927 605991185 606954992
3524.5 606954992 607719421 608567059 609556198 610458791 611396968 612447023 613321662 613956153 614646018
3542.8 614646018 615618646 616665900 617443800 618190825 619168699 620071888 620750666 621414602 621989429
3561.2 621989429 622161448 622580051 624277472 626242876 627271652 627952099 628852725 629906476 631018102
3579.5 631018102 631981194 632516086 633202612 634935856 636637688 637347996 638110697 639377594 640629828
3597.9 640629828 641850412 642983079 643549740 643894613 644972086 646496892 647797644 648810148 649411142
3616.2 649411142 650682330 652924657 654085934 653496742 652747571 654438198 657299399 658311605 658690870
3634.6 658690870 659226894 659637928 659893632 659501910 658172369 657271087 658940256 661550343 661913157
$$ packed form
3504.1E99211574N30660N87225Q90195R83894Q06272O38843O33239P47025R62258R63807
3524.5F06954992P64429Q47638R89139R02593R38177J050055Q74639O34491O89865
3542.8F14646018R72628J047254P77900P47025R77874R03189O78778O63936N74827
3561.2F21989429J72019M18603J697421J965404J028776O80447R00626J053751J111626
3579.5F31018102R63092N34892O86526J733244J701832P10308P62701J266897J252234
3597.9F40629828J220584J132667N66661L44873J077473J524806J300752J012504O00994
3616.2F49411142J271188K242327J161277n89192p49171J690627K861201J012206L79265
3634.6F58690870N36024M11034K55704l91722j329541r01282J669169K610087L62814
$$ plain form
3653 661913157 661647618 662626088 663420260 663276136 662749112 661618412 660229385 660186648 660590708 659952819
3673.3 659952819 660817385 662659228 663007677 662700057 661874056 660562396 660378814 662042379 663415551
3691.7 663415551 663651526 663488686 663143158 663001418 663646817 664100289 663334489 662231386 662385941
3710.1 662385941 664102316 665000439 664319217 663345695 662719667 662459552 662522256 662614048 661806703 660246968
3730.5 660246968 659359455 660119534 661781192 661924481 659876764 658521295 659941494 660420716 659599304
3748.8 659599304 660935581 662722707 662477255 661745787 662054121 662523150 662170172 661797464 661765814
3767.2 661765814 662244797 662996471 662886798 662058532 661561310 661868572 662096739 661842525 661761105 661750972
3787.6 661750972 661465108 660754085 659760058 659072697 658374190 658021808 658915401 659114003 659015119 659967840
$$ packed form
3653F61913157k65539R78470P94172j44124n27024j130700j389027m2737M04060o37889
3673.3F59952819Q64566J841843L48449l07620q26001j311660j83582J663565J373172
3691.7F63415551K35975j62840l45528j41740O45399M53472p65800j103103J54555
3710.1F62385941J716375Q98123o81222r73522o26028k60115O2704R1792q07345j559735
3730.5F60246968q87513P60079J661658J43289k047717j355469J420199M79222q21412
3748.8F59599304J336277J787126k45452p31468L08334M69029l52978l72708l1650
3767.2F61765814M78983P51674j09673q28266m97222L07262K28167k54214q1420j0133
3787.6F61750972k85864p11023r94027o87361o98507l52382Q93593J98602r8884R52721
$$ plain form
3808 659967840 659851968 658185840 656974733 657161772 656922638 656909823 658183753 658350289 657733440 657287598
3828.4 657287598 656794131 656249642 655451179 655242205 656204343 656919301 657071829 656992137 655938148 653556347
3848.7 653556347 651321590 652755916 656349659 656428993 654687405 653491676 653308094 653389692 652786195
3867.1 652786195 652780473 653687954 654031575 653793335 652922928 652295947 652282238 652095139 652480721 652553976
3887.5 652553976 651818931 651927054 652058423 650912046 649593711 649178326 649624288 650674462 651515305
3905.9 651515305 651434600 650981426 650515199 649918020 649674654 650019109 650192857 649930596 649804413 649760842
3926.3 649760842 649388134 649171710 649499595 649724722 649439454 648917019 648504376 648451447 648424208 648211241
3946.6 648211241 648211360 648312151 648166656 647887766 647653639 647505343 647479951 647503972 647408664 647202849 646961689
$$ packed form
3808F59967840j15872j666128j211107J87039k39134j2815J273930J66536o16849m45842
3828.4F57287598m93467n44489p98463k08974R62138P14958J52528p9692j053989k381801
3848.7F53556347k234757J434326L593743P9334j741588j195729j83582Q1598o03497
3867.1F52786195n722R07481L43621k38240q70407o26981j3709j87099L85582P3255
3887.5F52553976p35045J08123J31369j146377j318335m15385M45962J050174Q40843
3905.9F51515305q0705m53174m66227n97179k43366L44455J73748k62261j26183m3571
3926.3F49760842l72708k16424L27885K25127k85268n22435m12643n2929k7239k12967
3946.6F48211241J19J00791j45495k78890k34127j48296k5392K4021r5308k05815k41160
$$ plain form
3969.1 646961689 646704197 646498501 646376371 646220684 646010816 645897031 645853877 645710886 645479083 645262599
3989.5 645262599 645083368 644944608 644844532 644724429
3997.6 644724429
$$ packed form
3969.1F46961689k57492k05696j22130j55687k09868j13785m3154j42991k31803k16484
3989.5F45262599j79231j38760j00076j20103
3997.6F44724429
##END=$$ End of the data block
