##TITLE=$$ Begin of the data block
##JCAMP-DX=5.00 $$ ACD/SpecManager v 10.08
##SPECTROMETER/DATA SYSTEM=16PC
##DATE=Fri Sep 13 14:23:24 2013
##DATA TYPE=INFRARED SPECTRUM
##DATA CLASS=XYDATA
##ORIGIN=
##OWNER=
##NPOINTS=3601
##FIRSTX=400.00000000
##LASTX=4000.00000000
##MAXX=4000.00000000
##MINX=400.00000000
##MAXY=39.56340027
##MINY=12.09602833
##XFACTOR=1.0000000000
##YFACTOR=0.000000100000000
##FIRSTY=20.55155563
##DELTAX=1.00000000
##XUNITS=1/CM
##YUNITS=TRANSMITTANCE
##XYDATA=(X++(Y..Y))
400B05515556N5250168M4853897L0416031J6788292P629776L932762M038773M999924
$$ 205515556 260765724 305619621 336035652 352823944 360453720 364386482 368425255 373425179
408C73425179M399604J578331k332992n416069o269646m811211k183609M8371Q32214
$$ 373425179 377824783 379403114 377070122 371654053 365384407 360573196 358389587 358437958 359270172
417C59270172J30654j227723k165374k015534q52241O37359J602478J511917M20990
$$ 359270172 359400826 358173103 356007729 353992195 353139954 353777313 355379791 356891708 357312698
426C57312698j090507k241440k455177j643029k31361J076431J675721J376953M89692
$$ 357312698 356222191 353980751 351525574 349882545 349651184 350727615 352403336 353780289 354269981
435C54269981l73191o59218j96495P18422J510582J670417J036415j48201j415901
$$ 354269981 353896790 353237572 353041077 353759499 355270081 356940498 357976913 357828712 356412811
444C56412811k356415k809066k867241k728996k533875k304115k013626j690140j446571
$$ 356412811 354056396 351247330 348380089 345651093 343117218 340813103 338799477 337109337 335662766
453C35662766j397439j529922j647911j457024p53746M11721J715888K714463L073196
$$ 335662766 334265327 332735405 331087494 329630470 328876724 329288445 331004333 333718796 336791992
462C36791992K735214J927300J018753L34358L7804J32065N38177J170349J949959
$$ 336791992 339527206 341454506 342473259 342807617 342845421 342977486 343515663 344686012 346635971
471C46635971K772942L484039L908615L934708L586235L026848K475166K082825J849022
$$ 346635971 349408913 352892952 356801567 360736275 364322510 367349358 369824524 371907349 373756371
480C73756371J626434J204872M18701p87620k354279m138031n933495p471427q417435
$$ 373756371 375382805 376587677 377006378 376218758 373864479 369726448 363792953 356321526 347904091
489C47904091q420067p228279m838944j589126J883964M831658O659241P141952O487923
$$ 347904091 339484024 332255745 327416801 325827675 327711639 332543297 339202538 346344490 352832413
498C52832413N215873L915635L009986K626763K618904K699738K605285K209664J554069
$$ 352832413 358048286 361963921 364973907 367600670 370219574 372919312 375524597 377734261 379288330
507C79288330P99904J43776k65045l77732k57568m8370Q6250L3951k17018n75104q95462
$$ 379288330 380088234 380232010 379966965 379589233 379331665 379283295 379369545 379403496 379186478 378611374 377715912
518C77715912j057701j028214q69560o90575n67436m90417l72010j12609L17611Q35495
$$ 377715912 376658211 375629997 374760437 374069862 373502426 373012009 372639999 372527390 372845001 373680496
528C73680496J272850J458206J306725Q65059K90298k22015n16586n29290k92396Q9836
$$ 373680496 374953346 376411552 377718277 378583336 378873634 378651619 378135033 377605743 377313347 377403183
538C77403183M79202P35894P50732M74815n3672p01790j270066j558494j447487r55620
$$ 377403183 377882385 378618279 379369011 379843826 379790154 379088364 377818298 376259804 374812317 373856697
548C73856697k41852M58260R31549J076126R30100O31179L26691R1171j03035l40957
$$ 373856697 373614845 374073105 375004654 376080780 377010880 377642059 377968750 378059921 377956886 377615929
558C77615929o80008j075974j380272j418113j105805n37109K9487K88391N1575o34270
$$ 377615929 376935921 375859947 374479675 373061562 371955757 371418648 371448135 371736526 371788101 371153831
568C71153831j496162k171974k401772k163505j670304j232566j070137j187210j383935
$$ 371153831 369657669 367485695 365083923 362920418 361250114 360017548 358947411 357760201 356376266
577C56376266j392211j043244l66402M36402J111832J491737J559105J420440J213303
$$ 356376266 354984055 353940811 353574409 354010811 355122643 356614380 358173485 359593925 360807228
586C60807228J023407Q55255O65283M17290J17340j93672m72221p03545r04274j105499
$$ 360807228 361830635 362685890 363351173 363768463 363885803 363692131 363219910 362516365 361612091 360506592
596C60506592j331444j593170j892052k221985k553787k813950k875976k592087j857948
$$ 360506592 359175148 357581978 355689926 353467941 350914154 348100204 345224228 342632141 340774193
605C40774193o84204P72514K243919L442879M166184M357681M101982L561172K897759
$$ 340774193 340089989 340862503 343106422 346549301 350715485 355073166 359175148 362736320 365634079
614C65634079K227325J615944J104546P25708M93660L76320K85034J06392k27928o74744
$$ 365634079 367861404 369477348 370581894 371307602 371801262 372177582 372462616 372569008 372341080 371666336
624C71666336j070061j198082r09843k26631O43501J389046J740684J595650J052399
$$ 371666336 370596275 369398193 368488350 368261719 368905220 370294266 372034950 373630600 374682999
633C74682999L45382k78816o63948p81250o95572n03425k87438j05896l43K823r1896
$$ 374682999 375028381 374749565 374085617 373304367 372608795 372105370 371817932 371712036 371711693 371714516 371622620
644C71622620k36359l51372l72467k92740j74064j03417j27601k19613l08074l51258
$$ 371622620 371386261 371034889 370662422 370369682 370195618 370092201 369964600 369744987 369436913 369085655
654C69085655l88069n09605p55043j011620j019173n18379N30625J811065K724877
$$ 369085655 368697586 368187981 367432938 366421318 365402145 364883766 365414391 367225456 369950333
663C69950333K683258J462745n95131k690620l949013l869438k582474p63588P37687
$$ 369950333 372633591 374096336 373501205 370810585 366861572 362992134 360409660 359646072 360383759
672C60383759J334114R48257l9520j076126j752968j968269j873475j688499j532135
$$ 360383759 361717873 362666130 362626610 361550484 359797516 357829247 355955772 354267273 352735138
681C52735138j376953j123162p10792j73569L93982R12399J365433J783295K180061
$$ 352735138 351358185 350235023 349524231 349350662 349744644 350657043 352022476 353805771 355985832
690C55985832K508736K672233K586289K243843J729622J173820O78864K72407q4381
$$ 355985832 358494568 361166801 363753090 365996933 367726555 368900375 369579239 369851646 369767265
699C69767265m44832q23326j177177j432762j529389j448936j213036q59680m22668
$$ 369767265 369322433 368499107 367321930 365889168 364359779 362910843 361697807 360838127 360415459
708C60415459O7176N64003R91288J249046J248589R57985M33921j83258p08275r75875
$$ 360415459 360482635 361046638 362037926 363286972 364535561 365493546 365927467 365744209 365035934 364060059
718C64060059r00498n11665N3291N96275R33648R64889P12738L08190p0191k79465
$$ 364060059 363159561 362647896 362701187 363297462 364231110 365195999 365908737 366216927 366146736 365867271
728C65867271k74391j22185L9559P7934o9389l66440p04346r58366j047478r67789
$$ 365867271 365592880 365470695 365510254 365588188 365518799 365152359 364448013 363489647 362442169 361474380
738C61474380p88154o17027n59807o84662j003876j473541k005920k491112k825852
$$ 361474380 360686226 360069199 359509392 358824730 357820854 356347313 354341393 351850281 349024429
747C49024429k941894k827034k527847k133332j742401j430397j229744j131134j101837
$$ 349024429 346082535 343255501 340727654 338594322 336851921 335421524 334191780 333060646 331958809
756C31958809j109352j137390j187363j271973j406898j608696j893349k270202k725564
$$ 331958809 330849457 329712067 328524704 327252731 325845833 324237137 322343788 320073586 317348022
765C17348022l204669l608227l818264l753529l428764k983475k650795k669601l172989
$$ 317348022 314143353 310535126 306716862 302963333 299534569 296551094 293900299 291230698 288057709
774B88057709m110279n241814o213951o682148o424160n403385l763180j771603K52953
$$ 288057709 283947430 278705616 272491665 265809517 259385357 253981972 250218792 248447189 248700142
783B48700142K011471L277988L939247M017945L667488L128757K652245K410793K442417
$$ 248700142 250711613 253989601 257928848 261946793 265614281 268743038 271395283 273806076 276248493
792B76248493K653370K878628K969971K861499K585106K233372J903229J655483J509857
$$ 276248493 278901863 281780491 284750462 287611961 290197067 292430439 294333668 295989151 297499008
801B97499008J464157J516342J666089J898956K170238K407494K537174K519474K369576
$$ 297499008 298963165 300479507 302145596 304044552 306214790 308622284 311159458 313678932 316048508
810C16048508K151966J949367J827851J813278J890297K016449K141380K220726K225609
$$ 316048508 318200474 320149841 321977692 323790970 325681267 327697716 329839096 332059822 334285431
819C34285431K146759J998138J814537J642189J521149J468277J467438J474800J435318
$$ 334285431 336432190 338430328 340244865 341887054 343408203 344876480 346343918 347818718 349254036
828C49254036J303520J060600P20215L25165o4316l86390n94979o72416o32439n09758
$$ 349254036 350557556 351618156 352338371 352663536 352599220 352212830 351617851 350945435 350312996 349803238
838C49803238l41034j44157Q7509L73382P20635J103096J458854J712037J807632J740723
$$ 349803238 349462204 349318047 349405556 349778938 350499573 351602669 353061523 354773560 356581192 358321915
848C58321915J561546J355324J206550J163178J216469J300049J306114J116790O46630
$$ 358321915 359883461 361238785 362445335 363608513 364824982 366125031 367431145 368547935 369194565
857C69194565j12877j061287j991158k637214k765846k272416j241188P0229J320152
$$ 369194565 369081688 368020401 366029243 363392029 360626183 358353767 357112579 357182808 358502960
866C58502960K212677K603989K538299K197724J798515J490898J309967J196480J064644
$$ 358502960 360715637 363319626 365857925 368055649 369854164 371345062 372655029 373851509 374916153
875C74916153Q70132O41289M59557M06761N14183P43675J006966J211319J302299J282006
$$ 374916153 375786285 376427574 376887131 377293892 377808075 378551750 379558716 380770035 382072334 383354340
885C83354340J194648J093598J009559R38569Q54415P34444N80330M20723K94685K27166
$$ 383354340 384548988 385642586 386652145 387590714 388445129 389179573 389759903 390180626 390475311 390702477
895C90702477K14805K29225K37541K23618J96190J78909J89057K22053K51312K46277
$$ 390702477 390917282 391146507 391384048 391607666 391803856 391982765 392171822 392393875 392645187 392891464
905C92891464J94321J12572M0931K0600P1068J80053L10059M15954M61693M31442L29171
$$ 392891464 393085785 393198357 393239288 393259888 393330956 393511009 393821068 394237022 394698715 395130157 395459328
916C95459328J74675l8j56327k55470k70309j97297o2027Q7624J99165K38457J99890
$$ 395459328 395634003 395633965 395477638 395222168 394951859 394754562 394692535 394780159 394979324 395217781 395417671
927C95417671J04790j3924j30615k34146l25089m03938m63295m90188m76037m28199
$$ 395417671 395522461 395508537 395377922 395143776 394818687 394414749 393951454 393461266 392985229 392557030
937C92557030l71704l39127l55301m25567n35279o61011p84568r00345j012612j122779
$$ 392557030 392185326 391846199 391490898 391065331 390530052 389869041 389084473 388184128 387171516 386048737
947C86048737j219254j274071j250915j121025q76274n36576j44996K43263N75943
$$ 386048737 384829483 383555412 382304497 381183472 380307198 379770622 379625626 379868889 380444832
956C80444832Q15887R48754R84344R52568Q93936Q46405Q33054Q54263Q86994Q94355
$$ 380444832 381260719 382209473 383193817 384146385 385040321 385886726 386719780 387574043 388461037 389355392
966C89355392Q40531P05948M97017K44560n531k08130l32566l71017l36876k59399
$$ 389355392 390195923 390901871 391398888 391643448 391637917 391429787 391097221 390726204 390389328 390129929
976C90129929j72844j07193q1826j02081j59492k35329l08571l63617l98064m25033
$$ 390129929 389957085 389849892 389768066 389665985 389506493 389271164 388962593 388598976 388200912 387775879
986C87775879m66194n40772o51626p80030q92295r57680r66873r43184r34601r90715
$$ 387775879 387309685 386768913 386117287 385337257 384444962 383487282 382520409 381577225 380642624 379651909
996C79651909j136894j357918j606293j830292k010345k180939k425995k839393l467484
$$ 379651909 378515015 377157097 375550804 373720512 371710167 369529228 367103233 364263840 360796356
1005C60796356m256782n032997n528374n457535m619026k987290p56683J686478L863487
$$ 360796356 356539574 351506577 345978203 340520668 335901642 332914352 332157669 333844147 337707634
1014C37707634N343246N873299N452461M317093K849198J443901L91769j85051l26805
$$ 337707634 343050880 348924179 354376640 358693733 361542931 362986832 363378601 363193550 362866745
1023C62866745j76315R7809L61595N42717O25915O29654N84145N15327M40216L65181
$$ 362866745 362690430 362788239 363149834 363692551 364318466 364948120 365532265 366047592 366487808 366852989
1033C66852989K88773K03781J00365k8458j82648l51639n13839o40412p02057o78558
$$ 366852989 367141762 367345543 367445908 367417450 367234802 366883163 366369324 365728912 365026855 364348297
1043C64348297n69687m00467k17781p6065j6327m8942j50833k79427l98674m98581
$$ 364348297 363778610 363378143 363160362 363084297 363067970 363019028 362868195 362588768 362190094 361691513
1053C61691513n98869p32308r19494j151009j391525j599617j753082j862603j965027
$$ 361691513 361092644 360360336 359440842 358289833 356898308 355298691 353545609 351683006 349717979
1062C49717979k104797k313957k604294k970734l400383l879852m397850m947662n533047
$$ 349717979 347613182 345299225 342694931 339724197 336323814 332443962 328046112 323098450 317565403
1071C17565403o173191o899567p737560q678074r656162j0554657j1238823j1603794
$$ 317565403 311392212 304492645 296755085 288077011 278420849 267866192 256627369 245023575
1079B45023575j1608429j1272125j0639019r733620q546486p062016n313797l424854
$$ 245023575 233415146 222143021 211504002 201770382 193223896 186161880 180848083 177423229
1087A77423229j596527m2419J098957J820659K237149K515297K791767L128185L528805
$$ 177423229 175826702 175784283 176883240 178703899 180941048 183456345 186248112 189376297 192905102
1096A92905102L996124M575157N342903O343441P512932Q654289R495240R806881R519138
$$ 192905102 196901226 201476383 206819286 213162727 220675659 229329948 238825188 248632069 258151207
1105B58151207Q764820P821751O982994O427173O156502O029091N858555N520515N008355
$$ 258151207 266916027 274737778 281720772 288147945 294304447 300333538 306192093 311712608 316720963
1114C16720963M419517L891830L533402L381805L404351L526230L664360L750610L740845
$$ 316720963 321140480 325032310 328565712 331947517 335351868 338878098 342542458 346293068 350033913
1123C50033913L615760L379708L056373K683068K298927J933937J603088J307526J040459
$$ 350033913 353649673 357029381 360085754 362768822 365067749 367001686 368604774 369912300 370952759
1132C70952759P91397N47600K92930J2551k98195o22177r18732j136627j237908j220321
$$ 370952759 371744156 372291756 372584686 372597237 372299042 371676865 370758133 369621506 368383598 367163277
1142C67163277j121750j001206r06028q43239p75604o43769m04625o2751L20396O48041
$$ 367163277 366041527 365040321 364134293 363291054 362515450 361871681 361467056 361404305 361724701 362372742
1152C62372742Q24814P93342N53436J57624l13149p82356j204872j579895j944275
$$ 362372742 363197556 363990898 364544334 364701958 364388809 363606453 362401581 360821686 358877411
1161C58877411k347374k816544l327446l790321m064903l998413l480835k495117j146050
$$ 358877411 356530037 353713493 350386047 346595726 342530823 338532410 335051575 332556458 331410408
1170C31410408L46146J690483K600288K878189K484894J564674M11873o17447j219482
$$ 331410408 331756554 333447037 336047325 338925514 341410408 342975082 343386955 342769508 341550026
1179C41550026j243019p31011J09673R98154J685447K031937K026291J751060J320420
$$ 341550026 340307007 339575996 339685669 340683823 342369270 344401207 346427498 348178558 349498978
1188C49498978Q28819L28636j62964o44951j119308j588593k060279k546082l053284
$$ 349498978 350327797 350656433 350493469 349848518 348729210 347140617 345080338 342534256 339480972
1197C39480972l574485m085465m556770m971962n341416n701236o097241o564350p113705
$$ 339480972 335906487 331821022 327264252 322292290 316950874 311249638 305152397 298588047 291474342
1206B91474342p734127q403644r101944r813652j0521488j1193371j1769676j2157174
$$ 291474342 283740215 275336571 266234627 256420975 245899487 234706116 222936440 210779266
1214B10779266j2232513j1856613j0905304r311810p115860m495096j756143P28883
$$ 210779266 198546753 186690140 175784836 166473026 159357166 154862070 153105927 153834810
1222A53834810K632380L786506M255181M319382M374046M773750N695057P075787Q655300
$$ 153834810 156467190 160253696 164508877 168828259 173202305 177976055 183671112 190746899 199402199
1231A99402199J0091476J1095715J1524658J1398106J0849723J0052166R155846Q266239
$$ 199402199 209493675 220589390 232114048 243512154 254361877 264414043 273569889 281836128
1239B81836128P450047O752720O202507N802574N519199N285359N022316M670486M211311
$$ 281836128 289286175 296038895 302241402 308043976 313563175 318848534 323870850 328541336 332752647
1248C32752647L667946L084297K497292J918030J330757P06100K2431p18727j484947
$$ 332752647 336420593 339504890 342002182 343920212 345250969 345957069 345979500 345260773 343775826
1257C43775826k212143k813035l192443l271714l016700k460099j704483r01794k12364
$$ 343775826 341563683 338750648 335558205 332286491 329269791 326809692 325105209 324203415 323991051
1266C23991051K39181L93563K60238j01471o15043j213532j856079k528210l233032
$$ 323991051 324230232 324623795 324884033 324782562 324167519 322953987 321097908 318569698 315336666
1275C15336666l976536m751510n523434o224651o761780p039051o990681o609592n954895
$$ 315336666 311360130 306608620 301085186 294860535 288098755 281059704 274069023 267459431 261504536
1284B61504536n133286m257068l401223k576961j736298q03375K84595J543770K931996
$$ 261504536 256371250 252114182 248712959 246135998 244399700 243596325 243880920 245424690 248356686
1293B48356686M357204N696507O817607P596169P933750P779579P154122O163006M986343
$$ 248356686 252713890 258410397 265228004 272824173 280757923 288537502 295691624 301854630 306840973
1302C06840973L836174K891140K234783J827755J534252J189652O80389q583q01315
$$ 306840973 310677147 313568287 315803070 317630825 319165077 320354729 321035118 321026535 320225220
1311C20225220j585369k278138k861881l367042l817177m173184m317608m091796l367310
$$ 320225220 318639851 316361713 313499832 310132790 306315613 302142429 297824821 293733025 290365715
1320B90365715k114239m28619J488094L385182N028877O253014O987113P259217P173404
$$ 290365715 288251476 287822857 289310951 292696133 297725010 303978024 310965137 318224354 325397758
1329C25397758O867295O456642N989647N436134M725609L820457K782364J783638J044274
$$ 325397758 332265053 338721695 344711342 350147476 354873085 358693542 361475906 363259544 364303818
1338C64303818P23228Q23746J176529J518478J621247J401138R41696M25453K0600
$$ 364303818 365027046 365850792 367027321 368545799 370167046 371568184 372509880 372935333 372955933
1347C72955933k04850k93274l38439m06952m96064n54542n46036n09605n75447r23348
$$ 372955933 372751083 372457809 372119370 371712418 371216354 370661812 370115776 369606171 369030724 368107376
1357C68107376j702232k947541m528274o146355p394142p862739p276841n612564l146324
$$ 368107376 366405144 363457603 358929329 352782974 345388832 337526093 330249252 324636688 321490364
1366C21490364m00925K010422L584862M090729L617057K493401J128578j45492j150017
$$ 321490364 321089439 323099861 326684723 330775452 334392509 336885910 338014488 337868996 336718979
1375C36718979j838875k223968k314187k112541j661720j084785n69153k83585k76565
$$ 336718979 334880104 332656136 330341949 328229408 326567688 325482903 324913750 324630165 324353600
1384C24353600m26980m97856k74772K86941J002426J532593J564369R97239K3345r52186
$$ 324353600 323926620 323428764 323153992 323440933 324443359 325975952 327540321 328537560 328560905 327608719
1394C27608719j512451j442719q34236k3994N92117P60765M73862p6256o43807j077385
$$ 327608719 326096268 324653549 323819313 323795319 324387436 325148201 325622063 325545807 324902000 323824615
1404C23824615j374473j622009j880589k104721k163620j948776j491871j002197p85981
$$ 323824615 322450142 320828133 318947544 316842823 314679203 312730427 311238556 310236359 309450378
1413C09450378j084289j921711l054962m054432m482212m080754k887229j225644M19560
$$ 309450378 308366089 306444378 303389416 299334984 294852772 290772018 287884789 286659145 287078705
1422B87078705J592979K048435J843396J303997Q66317Q57773J322575J986599K395534
$$ 287078705 288671684 290720119 292563515 293867512 294733829 295591602 296914177 298900776 301296310
1431C01296310K164612J209584j75114j443901k068653j799832p77836N53990J671409
$$ 301296310 303460922 304670506 304495392 303051491 300982838 299183006 298405170 298959160 300630569
1440C00630569K190361J980191J149120m1466j257553k147083k403889j882534p42092
$$ 300630569 302820930 304801121 305950241 305908775 304651222 302504139 300100250 298217716 297475624
1449B97475624M87537J032200K13242k137470n434666q475628r954986r120141o196022
$$ 297475624 297963161 298995361 299208603 297071133 291636467 283160839 273205853 264085712 257889690
1458B57889690k306919J094265K979870L248482K680740K384396L075466M635067O205921
$$ 257889690 255582771 256677036 259656906 262905388 265586128 267970524 271045990 275681057 281886978
1467B81886978O749191N704308L345242O27536j352634j949921j260166K4509J068764
$$ 281886978 288636169 294340477 297685719 298313255 296960621 295010700 293750534 293775043 294843807
1476B94843807J355591Q96683J08127n26142p74307p79591r35516j609001k869053
$$ 294843807 296199398 297096081 297204208 296678066 295903759 295124168 294188652 292579651 289710598
1485B89710598m363766n408420n259819l470288j71508L862190P451019R496117R513855
$$ 289710598 285346832 279938412 274678593 271208305 271036797 274898987 282350006 291846123 301359978
1494C01359978P936134N965233M983482N786934Q063812J0452805J1217537R205093
$$ 301359978 309296112 315261345 320244827 326031761 334095573 344548378 355765915 364971008
1502C64971008M561119j223983n991784p961845o575661k697372J900635N437050O899795
$$ 364971008 369532127 368308144 362316360 354354515 347778854 345081482 346982117 352419167 359318962
1511C59318962O323242M509621K451591Q20389k27508r13849j542168k251701k937660
$$ 359318962 365642204 370151825 372603416 373423805 373196297 372282448 370740280 368488579 365550919
1520C65550919l331604l153077k256584p26089J101837K708931L568878L388329K302322
$$ 365550919 362219315 359066238 356809654 356083565 357185402 359894333 363463211 366851540 369153862
1529C69153862Q89626o7635n72J070480K448807L067284K067451o62193m308281p450905
$$ 369153862 370043488 369975853 369975281 371045761 373494568 376561852 378629303 377967110 373658829 366207924
1539C66207924q730202p514992m218063r7809L341065N032730M788627L293877J698418
$$ 366207924 357477722 349962730 345744667 345646858 348987923 354020653 358809280 362103157 363801575
1548C63801575J015205J614418L036347M205741L955651J635437k471466p135887j0624581
$$ 363801575 364816780 366431198 369467545 373673286 377628937 379264374 376792908 369657021 359032440
1557C59032440j1436310r008178m047394J705513O201134P965583O714898L400383
$$ 359032440 347596130 338587952 334540558 336246071 342447205 350412788 357127686 360528069
1565C60528069l27454k946930l754654l075790j924935j345100j806831k989731m030190
$$ 360528069 360200615 357253685 353499031 350423241 348498306 347153206 345346375 342356644 338326454
1574C38326454m061127k717971l38517K229233M070053M636422L951301K505875R53903
$$ 338326454 334265327 331547356 331208839 333438072 337508125 342144547 346095848 348601723 349555626
1583C49555626k07062q06351r69429r52148r61838j060066j174889j183891j005974
$$ 349555626 349348564 348542213 347572784 346620636 345658798 344598732 343423843 342239952 341233978
1592C41233978o54068k34718R7923K11144N9471k82974o51932q81004r10225q43392
$$ 341233978 340579910 340345192 340443115 340654259 340713730 340430756 339778824 338897820 337987595 337144203
1602C37144203q96454j246643j869507k488021k704583k263603j282310k76184Q5754
$$ 337144203 336247749 335001106 333131599 330643578 327938995 325675392 324393082 324116898 324202652
1611C24202652o25916k296600m262619n639114n801792m733601l029537j558876r98345
$$ 324202652 323576736 321280136 317017517 311378403 305576611 300843010 297813473 296254597 295256252
1620B95256252j507988k717018l982773m735298m708919l978443k853394j746101j081467
$$ 295256252 293748264 291031246 287048473 282313175 277604256 273625813 270772419 269026318 267944851
1629B67944851j233044k428035m612713p354813r897747j1416359j1388969r888573
$$ 267944851 266711807 264283772 259671059 252316246 242418499 231002140 219613171 209724598
1637B09724598p607021n559292m603157n022583o397496p823162q362007p489919n319233
$$ 209724598 202117577 196558285 191955128 186932545 180535049 172711887 164349880 156859961 151540728
1646A51540728k500945J32018J995325L045520L782912M954366P093812J0140571J3359261
$$ 151540728 149039783 149171801 151167126 154212646 157995558 162949924 170043736 180184307 193543568
1655A93543568J5644264J6080150J4457875J1439514Q242817O001606N168896N322437
$$ 193543568 209187832 225267982 239725857 251165371 259408188 265409794 270578690 275901127
1663B75901127N495338M819813L073959P82795j172351k152367k150002j710872j462269
$$ 275901127 281396465 286216278 289290237 290073032 288900681 286748314 284598312 282887440 281425171
1672B81425171j612682j797924j399575j11179J668606K928524K606411K73895l503246
$$ 281425171 279812489 278014565 276614990 276503811 278172417 281100941 283707352 283981247 280478001
1681B80478001p375470r880352j0178852q436870n664330l152752j860637k078114
$$ 280478001 273102531 263222179 253043327 244606457 238942127 235789375 233928738 231850624
1689B31850624l487320n493240p575760r456806j1047974j2284222j3002834j2957878
$$ 231850624 228363304 222870064 215294304 205837498 194789524 182505302 169502468 156544590
1697A56544590j1953106r989557p332306m449692j859646M2849J106529J451559J404190
$$ 156544590 144591484 134601927 127269621 122819929 120960283 121003132 122109661 123561220 124965410
1706A24965410J364212J646729K353248L317337M159422M441805L869086K444543N02196
$$ 124965410 126329622 127976351 130329599 133646936 137806358 142248163 146117249 148561792 149063988
1715A49063988j417113k790594l331794l083392k334394j408520m55484O27212K082835
$$ 149063988 147646875 144856281 141524487 138441095 136106701 134698181 134242697 134869909 136952744
1724A36952744M064941O437349Q748598J0424137J1073666J0730267R859943R119606
$$ 136952744 141017685 147455034 156203632 166627769 177701435 188431702 198291645 207411251
1732B07411251Q991108R511776J0263233J0632649J0191383Q960400P404422O154862
$$ 207411251 216402359 225914135 236177368 246810017 257001400 265961800 273366222 279521084
1740B79521084N632362N793953O157398O085949N166607L462754J500377m96m92382
$$ 279521084 285153446 290947399 297104797 303190746 308357353 311820107 313320484 313319988 312827606
1749C12827606J33934J517506L029232M079056M361343L922615L052788K092972J290970
$$ 312827606 312961540 314479046 317508278 321587334 325948677 329871292 332924080 335017052 336308022
1758C36308022P66029N69496P47299J332016K255097L260040L916588L781318K641678
$$ 336308022 337074051 337643547 338390846 339722862 341977959 345237999 349154587 352935905 355577583
1767C55577583O99959j438484l000107l394775k494240o87256J317406K818336L405037
$$ 355577583 356277542 354839058 351838951 348444176 345949936 345262680 346580086 349398422 352803459
1776C52803459L062706K089157R14498o0768n50423m10118L39775J479797K591477
$$ 352803459 355866165 357955322 358869820 358809052 358258629 357848511 358188286 359668083 362259560
1785C62259560L153534K755508J336479o92062k557945l463173k983055j312371Q01354
$$ 362259560 365413094 368168602 369505081 368813019 366255074 362791901 359808846 358496475 359297829
1794C59297829K413597K849617K028351M75845r72023j604233j175232J5793J327362
$$ 359297829 361711426 364561043 366589394 367065239 366093216 364488983 363313751 363329544 364656906
1803C64656906K125359K091446J337852K93465n49927q85239p03086k32468K32925
$$ 364656906 366782265 368873711 370211563 370505028 369955101 369069862 368366776 368134308 368367233
1812C68367233N07202N86167N93910O59561Q14362R77936J030311R04617O28777K85645
$$ 368367233 368874435 369460602 370054512 370714073 371528435 372506371 373536682 374441299 375070076 375355721
1822C75355721o4164m26750q42514j301231j683808j795463j488114p86018Q7585Q23899
$$ 375355721 375291557 374864807 374022293 372721062 371037254 369241791 367753677 366967659 367055244 367879143
1832C67879143J215553J287956J266251J388588J692009J932907J720695P95060p36580
$$ 367879143 369094696 370382652 371648903 373037491 374729500 376662407 378383102 379178162 378441582
1841C78441582k373658l447685l477287k436714p74498Q26492J801682J961059J516075
$$ 378441582 376067924 372620239 369142952 366706238 365931740 366758232 368559914 370520973 372037048
1850C72037048Q86956M31861K65389K61269K06871o333k89306m11072j65177M60587
$$ 372037048 372924004 373355865 373621254 373882523 374089394 374083061 373793755 373382683 373217506 373678093
1860C73678093J222420J711349J557961O45294p89185k227859l097992l039169k077256
$$ 373678093 374900513 376611862 378169823 378815117 378025932 375798073 372700081 369660912 367583656
1869C67583656o10008P86629J630478J736564J255341N42564m6272l14980k64816k3994
$$ 367583656 366973648 367760277 369390755 371127319 372382660 372925224 372878952 372563972 372299156 372275162
1879C72275162K58102M76189N71747N04722K48451j80358o84548j097603j256447j098747
$$ 372275162 372533264 373009453 373581200 374085922 374334373 374154015 373469467 372371864 371115417 370016670
1889C70016670p14187l00522m7760k4948j51253k67105k53372j09368O5460J61400
$$ 370016670 369302483 369001961 368954201 368929253 368778000 368510895 368257523 368148155 368213615 368375015
1899C68375015J45798P6942L7499N0430N2872m3640k53067m63982m90608k03247L51906
$$ 368375015 368520813 368597755 368635254 368685684 368738556 368694916 368441849 367977867 367487259 367284012 367635918
1910C67635918R42192J263389J117592N36041k33306q64602j131820j012116o65054
$$ 367635918 368578110 369841499 370959091 371495132 371261826 370397224 369265404 368253288 367588234
1919C67588234l08189q5946n340K8686J21270L06587N26962O76117O72035N07469K56463
$$ 367588234 367280045 367194099 367188759 367217445 367338715 367645302 368172264 368848381 369520416 370027885 370284348
1930C70284348L7117m7036M4976K69012N10712O30226N22003J68457l41034q38737
$$ 370284348 370321465 370274429 370319405 370588417 371099129 371729355 372251358 372419815 372078781 371240044
1940C71240044j146126j153221q68874m13856L7651L39965M34342L58238K06032O9809
$$ 371240044 370093918 368940697 368071823 367657967 367695618 368035583 368469925 368828163 369034195 369104004
1950C69104004o180l2616m8599q4152j34354j63002j27754j3237J49307K88735L23639
$$ 369104004 369097824 369065208 369016609 368932457 368798103 368635101 368507347 368494110 368643417 368932152 369255791
1961C69255791K03933n6839l76434o33087p16858n82581k74696Q8844L70293M74968
$$ 369255791 369459724 369402885 369026451 368393364 367676506 367093925 366819229 366908073 367278366 367753334
1971C67753334L93524J98288R16j08338j01738j7547P3700J18103J10168Q9836J09253
$$ 367753334 368146858 368345146 368346062 368237724 368135986 368118439 368192139 368310242 368420410 368510246 368619499
1982C68619499J88790K94723L48778K71873L2769l21618o76155q94889q81997o29501
$$ 368619499 368808289 369103012 369451790 369723663 369756432 369434814 368758659 367863770 366981773 366352272
1992C66352272k23389J91460M73900N44548M13704J66626q1597k39105k73323k12479
$$ 366352272 366128883 366320343 366794243 367338791 367752495 367919121 367837524 367598419 367325096 367112617
2002C67112617j20658n8213n1460q4114j14365j03759m3908L5706Q2626N1079o6223
$$ 367112617 366991959 366933746 366882286 366798172 366683807 366580048 366536140 366571846 366654472 366705551 366639328
2013C66639328k29301l64724m03709l17841j39122N5390J81999J93596J02348l0746
$$ 366639328 366410027 366045303 365641594 365323753 365184631 365240021 365422020 365615616 365717964 365687218
2023C65687218j32599j58730j12877l8642J2207J1100l4141r0676j24092j21689r5100
$$ 365687218 365554619 365395889 365283012 365244370 365256577 365267677 365233536 365142860 365018768 364897079 364801979
2034C64801979p0724o9848r6931j38283j72386j81732j59989j11999n0278J0453N5694
$$ 364801979 364731255 364661407 364564476 364426193 364253807 364072075 363912086 363800087 363749809 363760262 363815956
2045C63815956P4043N7946O981p2480j67732k62260l39394l83835l84216l34892k39983
$$ 363815956 363889999 363947945 363954926 363882446 363714714 363452454 363113060 362729225 362345009 362010117 361770134
2056C61770134j16882N417R2620J16730O9733l2540j52740k46658k80686k44675j54571
$$ 361770134 361653252 361658669 361751289 361868019 361937752 361905212 361752472 361505814 361225128 360980453 360825882
2067C60825882m4670M7951R8877J03378P5722L8642J1597K709Q277K0257L4179N2681
$$ 360825882 360781212 360829163 360928040 361031418 361107140 361145782 361157379 361160088 361168365 361188622 361222801 361275482
2079C61275482Q1330J18865J48430J41411P0801o9160k49482m11567m89693m43001
$$ 361275482 361356812 361475677 361624107 361765518 361836319 361767159 361517677 361106110 360616417 360173416
2089C60173416k78244n0812J58387K79693K85225J97373P3509k6016o5651m7112n34
$$ 360173416 359895172 359844360 360002747 360282440 360567665 360765038 360838547 360812531 360746880 360699768 360699234
2100C60699234L8033M5089K0333j9837n5122p3319p3700o3247m9744l7651k8572k4529
$$ 360699234 360737267 360782356 360802689 360782852 360727730 360654411 360580711 360517464 360467720 360430069 360401497 360376968
2112C60376968k8762m2916o2485p5798o8435l2158K5940Q3809J13678R6130L1853n8060
$$ 360376968 360348206 360305290 360242805 360167007 360098572 360066414 360092354 360176163 360289841 360385971 360417824 360359764
2124C60359764j42937j98974k19650k15607k04010j94626j82800j54190r5635p553
$$ 360359764 360216827 360017853 359798203 359582596 359378586 359183960 359001160 358846970 358751335 358743782
2134C58743782R3231J80016K29263K30904J91498J27983N8593m654n7945j02615j40305
$$ 358743782 358837013 359017029 359246292 359477196 359668694 359796677 359855270 359850616 359792671 359690056 359549751
2145C59549751j69601j86119j84632j62010j19552o3591o028L8033N4703L6506j2664
$$ 359549751 359380150 359194031 359009399 358847389 358727837 358664246 358658218 358696251 358750954 358787460 358774796
2156C58774796p6027j30082j54190j40228r9335n5656l5706n2414r7923j45683j65024
$$ 358774796 358698769 358568687 358414497 358274269 358174934 358119278 358083572 358031158 357933235 357787552 357622528
2167C57622528j37825o8779J5488Q1444J06201Q8386M7074P400j5526k5444m0359p7400
$$ 357622528 357484703 357415924 357431412 357512856 357619057 357707443 357754517 357761917 357746391 357720947 357680588 357603188
2179C57603188j37063j98402k28653k02446j17645j145J04599J61362J53885R5787
$$ 357603188 357466125 357267723 357039070 356836624 356718979 356717834 356822433 356983795 357137680 357233467
2189C57233467J9722m0588o5766n8365l6048j9646k3308m8065q5640j24321j54152
$$ 357233467 357253189 357212601 357146835 357088470 357052422 357032776 357009468 356961403 356875763 356751442 356597290
2200C56597290j69945j69944j54610j26038q8577m8676j4572N951Q774o790l6011p1258
$$ 356597290 356427345 356257401 356102791 355976753 355888176 355839500 355824928 355830879 355839653 355832863 355796852 355725594
2212C55725594j02005j16806j06163o5880k213O6147J11771J07727M1313p5989k09427
$$ 355725594 355623589 355506783 355400620 355334740 355332527 355398674 355510445 355618172 355659485 355583496 355374069
2223C55374069l12195l47519l04794k06413r7199k1858m806l9940r7809j42326j50147
$$ 355374069 355061874 354714355 354409561 354203148 354105949 354084091 354079285 354039345 353941536 353799210 353649063
2234C53649063j17683n9929J755M8980P1640O7139L8147p706n7907r5367j03531p5569
$$ 353649063 353531380 353471451 353473206 353522186 353593826 353660965 353699112 353691406 353633499 353538132 353434601 353359032
2246C53359032j9150M4174Q9340J00060P7820L9749Q163l204M539J7167J7280m005
$$ 353359032 353339882 353384056 353473396 353573456 353651276 353691025 353699188 353695984 353700523 353717690 353734970 353730965
2258C53730965m2649q3542j08909j06049p4310k3804K7199N8708N5237J0605p0381
$$ 353730965 353688316 353604774 353495865 353389816 353315506 353291702 353318901 353377609 353432846 353443451 353373070
2269C53373070j72043k73476l52173l89556l73841l00026j73225o943J75247L45612
$$ 353373070 353201027 352927551 352575378 352185822 351811981 351511955 351338730 351331787 351507034 351852646
2279C51852646M77943N55992N77317N51223M92020M11873L18298K16980J17569L4485
$$ 351852646 352330589 352886581 353463898 354015121 354507141 354919014 355237312 355454292 355571861 355606346
2289C55606346j6212k5673L433N7678J21269J84365K46696L13645L88641M69322N46990
$$ 355606346 355590134 355564461 355567894 355625572 355746841 355931206 356177902 356491547 356880188 357349510 357896500
2300C57896500O09092O41175O22902N29365L38059M8790k93847n91850p13501n42908
$$ 357896500 358505592 359146767 359769669 360299034 360637093 360685883 360392036 359800186 359086685 358543777
2310C58543777m2037P03811J487503K037087K115249J622353O57654m95301j465454
$$ 358543777 358501740 359205551 360693054 362730141 364845390 366467743 367125397 366630096 365164642
2319C65164642j939048j797333j177101m17405R3003J02348l81164j096383j669845
$$ 365164642 363225594 361428261 360251160 359833755 359926758 360029106 359647942 358551559 356881714
2328C56881714j815567j479340q46176k14119J80741K67562J06469k41852q28362j792259
$$ 356881714 355066147 353586807 352740631 352526512 352707253 352974815 353081284 352839432 352011070 350218811
2338C50218811l185959m760437n886993n738564l690834K54135N283509R980926J2868500
$$ 350218811 347032852 342272415 336385422 330646858 326956024 327210159 332493668 342474594 355343094
2347C55343094J3028412J0487556O167717J439552k480087m978294o144600o524849
$$ 355343094 368371506 378859062 385026779 386466331 383986244 379007950 372863350 366338501
2355C66338501o714363p031212p422104p599640p285385o398277n097447l685913k457390
$$ 366338501 359624138 352592926 345170822 337571182 330285797 323887520 318790073 315104160 312646770
2364C12646770j579685j060924p93000o27574m42143j73836J79177N75771R60560J291466
$$ 312646770 311067085 310006161 309213161 308585587 308143444 307969608 308148785 308724556 309685116 310976582
2374C10976582J559028J789437K027397K305717K619267K916984L121262L162803L012848
$$ 310976582 312535610 314325047 316352444 318658161 321277428 324194412 327315674 330478477 333491325
2383C33491325K695237K271804J815224J381531J000328O79359M17977K16522P7095
$$ 333491325 336186562 338458366 340273590 341655121 342655449 343334808 343752785 343969307 344046402
2392C44046402j678l0022k6131j0338K785Q011P553N112R15j0223l4371p4195j23482
$$ 344046402 344044724 344014702 343988571 343978233 343981018 343989029 343996582 344001694 344002609 343992386 343958015 343883820 343760338
2405C43760338j68610j93596j87797j52359j01547n6344l4751m2420p0000r6817j02043
$$ 343760338 343591728 343398132 343210335 343057976 342956429 342900085 342865334 342822914 342752914 342656097 342554054
2416C42554054p4348j6823N3978J17226J54876J58310J27754P0611l167q1291j51672
$$ 342554054 342479706 342462883 342516861 342634087 342788963 342947273 343075027 343145638 343142471 343061180 342909508
2427C42909508k01645k19841k00272j45759o9695N531N5924O3934K7733l7880j06582
$$ 342909508 342707863 342488022 342287750 342141991 342072296 342077827 342133751 342197685 342225418 342187538 342080956
2438C42080956j52512j62201j41449j11008r3765j01585j28479j55106j62086j41755
$$ 342080956 341928444 341766243 341624794 341513786 341420021 341318436 341189957 341034851 340872765 340731010
2448C40731010j02844o2561l4904k1553j3504o87J7433L0098K3232q431n4245r3155
$$ 340731010 340628166 340565605 340530701 340509148 340495644 340494957 340512390 340542488 340565720 340557289 340503044 340409889
2460C40409889j07498r5978p5760p0991r4528j38474j75247j76430j31035n4969J6937
$$ 340409889 340302391 340206413 340130653 340059662 339965134 339826660 339651413 339474983 339343948 339288979 339305916
2471C39305916M9934K7962l8490j20621j88027k24914k33650k28691k22817k18506
$$ 339305916 339355850 339383812 339345322 339224701 339036674 338811760 338578110 338349419 338126602 337908096
2481C37908096k07290j77613j24282n5199J1864N7029O7978M4861j678n6344j05934
$$ 337908096 337700806 337523193 337398911 337343712 337355576 337412605 337480583 337525444 337523766 337467422 337361488
2492C37361488j42631j63193j66511j51291j18714p4386l0518j907l8k4720o2980r4681
$$ 337361488 337218857 337055664 336889153 336737862 336619148 336544762 336514244 336512337 336512299 336487579 336424599 336329918
2504C36329918j03035q4992n3215k9106l0288n9548j02920j37787j44348j17073o5651
$$ 336329918 336226883 336141891 336088676 336059570 336029282 335969734 335866814 335729027 335584679 335467606 335401955
2515C35401955q812L4218N2185M2686J0223l6392q6975j29661j53733j53389j32026
$$ 335401955 335393143 335427361 335479546 335522232 335532455 335496063 335409088 335279427 335125694 334972305 334840279
2526C34840279j03493q6327r3612j23940j59454j74217j48774q3618k174N8937O9046
$$ 334840279 334736786 334650459 334556847 334432907 334273453 334099236 333950462 333866844 333864670 333923607 333992653
2537C33992653K0523o6223j52168j99166j89056j32637o1455j0338J145k1859n5694
$$ 333992653 334013176 333946953 333794785 333595619 333406563 333273926 333212471 333202133 333203278 333181419 333125725
2548C33125725p4043o3668l2234j221Q774q125l9177o1607n7602k5826J7243M7340
$$ 333125725 333051682 332988014 332955780 332954559 332963333 332955208 332916031 332854424 332796822 332770996 332788239 332835579
2560C32835579M7150J5068l5286q5144j21804j44081j58844j72767j86081j91307j79978
$$ 332835579 332882729 332897797 332862511 332777367 332655563 332511482 332352638 332179871 331993790 331802483 331622505
2571C31622505j49422j05934o1950k9564j5755k0866m1657p3471j11046j45988j66283
$$ 331622505 331473083 331367149 331305199 331275635 331259880 331239014 331197357 331123886 331012840 330866852 330700569
2582C30700569j59492j19782n4474J5869O5804P6561M7798j793m5395o2027m8790k1248
$$ 330700569 330541077 330421295 330366821 330382690 330448494 330525055 330572853 330571060 330525665 330463638 330414848 330393600
2594C30393600l166j0872m4365q7318j18942j26839j15013j00212j00632j24664j65596
$$ 330393600 330390434 330379562 330335197 330247879 330128937 330002098 329887085 329786873 329686241 329561577 329395981
2605C29395981k06337k30026k28348k05231j71814j38168j09406q4648o1951m1313
$$ 329395981 329189644 328959618 328731270 328526039 328354225 328216057 328106651 328022003 327960052 327918739
2615C27918739k5787j6747j2970r117j945N684M234j6899n9586j10817j46904j43661
$$ 327918739 327892952 327876205 327863235 327854118 327852173 327857857 327862091 327845192 327785606 327674789 327527885 327384224
2627C27384224r2926q469P8430J34621J41525J04027M3907j3084n2605p6332r5367
$$ 327384224 327291298 327282829 327361259 327495880 327637405 327741432 327785339 327772255 327719650 327643318 327547951
2638C27547951j17913j41906j54953j44997j09215n8708j2283J4381J6785J640j9340
$$ 327547951 327430038 327288132 327133179 326988182 326878967 326820259 326807976 326822357 326839142 326840782 326821442
2649C26821442l8681n6534p6790j01166j23253j32370j20659r0255n5008l3264l7156
$$ 326821442 326782761 326726227 326649437 326548271 326425018 326292648 326171989 326081734 326026726 325993462 325956306
2660C25956306o4926j01127j25084j22109r0789m1657R651N0316P4616Q2397P5111
$$ 325956306 325891380 325790253 325665169 325543060 325452271 325410614 325420265 325470581 325545197 325627594 325702705
2671C25702705N2910J5869l2158q2130j20621j36909j28212j02120p2441n1078m1962
$$ 325702705 325755615 325771484 325739326 325657196 325536575 325399666 325271454 325169334 325096893 325045815 325003853
2682C25003853m0550l8186k9220j4305P25J1100J6632K2126L1013M0512L9749J6518
$$ 325003853 324963303 324925117 324895897 324881592 324882317 324893417 324910049 324932175 324963188 325003700 325043449 325059967
2694C25059967l4599j04103j70746k10800k11640j78909j34049j01509r5329j11771
$$ 325059967 325025368 324921265 324750519 324539719 324328079 324149170 324015121 323913612 323818283 323706512
2704C23706512j33514j41754j28899j03531q5029r1057j26495j80130k30065k54326
$$ 323706512 323572998 323431244 323302345 323198814 323113785 323022728 322896233 322716103 322486038 322231712
2714C22231712k41279j92986j23482n1345N569L4561L0556m807o1416j22872j69677
$$ 322231712 321990433 321797447 321673965 321622620 321628189 321662750 321693306 321688499 321627083 321504211 321334534
2725C21334534j86653j69449j28784q7548p0457r2316j50337k23351k81524l00160
$$ 321334534 321147881 320978432 320849648 320762100 320691643 320599327 320448990 320225639 319944115 319643955
2735C19643955k70748k03972j24016n6037j6575q374k3231m9858q0261j11962j45435
$$ 319643955 319373207 319169235 319045219 318989182 318972607 318964233 318941002 318891144 318810883 318698921 318553486
2746C18553486j78299k02828k07710j83792j31874o5174o714K0275L071n3501j28079
$$ 318553486 318375187 318172359 317964649 317780857 317648983 317583809 317577095 317597370 317600441 317546940 317418861
2757C17418861j91784k21366k10381j71623j30291j10150j21307j55086j89858k03457
$$ 317418861 317227077 317005711 316795330 316623707 316493416 316383266 316261959 316106873 315917015 315713558
2767C15713558j86157j46351j04656q1673q6498j12515j43337j65005j75781j86920
$$ 315713558 315527401 315381050 315276394 315194721 315108223 314995708 314852371 314687366 314511585 314324665
2777C14324665k14424k66686l35521l97759m25415m00486l24154k17685j13068l9883
$$ 314324665 314110241 313843555 313508034 313110275 312684860 312284374 311960220 311742535 311629467 311589584
2787C11589584j4133l3321p9728j29146j60465j64261j44616j16786r8649j01623j22986
$$ 311589584 311575451 311542130 311462402 311333256 311172791 311008530 310863914 310747128 310648479 310546856 310423870
2798C10423870j47972j56136j35555r1190m6215l0022o2370j39542k32868l02124l14655
$$ 310423870 310275898 310119762 309984207 309893017 309846802 309816780 309754410 309614868 309382000 309079876 308765221
2809C08765221k63348j69220p1258o257Q240k1000o9256j09577j24740j13640q7452
$$ 308765221 308501873 308332653 308261395 308255138 308263378 308242378 308173122 308063545 307938805 307825165 307737713
2820C07737713o1703m8370n2147p0381r5616j18789j32370j33858j27220j22013j28556
$$ 307737713 307676010 307627640 307575493 307505112 307409496 307290707 307158337 307024479 306897259 306775246 306646690
2831C06646690j50928j81923k04487j99604j58234q9664k0351J7204n72p5760j89095
$$ 306646690 306495762 306313839 306109352 305909748 305751514 305661850 305641499 305658703 305658131 305582371 305393276
2842C05393276l08914m07200m69646m98181n04741n01423m94614m85287m72011m54655
$$ 305393276 305084362 304677162 304207516 303709335 303204594 302703171 302208557 301723270 301251259 300796604
2852C00796604m34093m09451l77846l36818k91329k57358k57950l12882m23641n66635
$$ 300796604 300362511 299953060 299575214 299238396 298947067 298689709 298431759 298118877 297695236 297128601
2862B97128601o98376p73429p65915o83747n65033m60796m10671m26216m88835n63831
$$ 297128601 296430225 295656796 294890881 294207134 293642101 293181305 292770634 292344418 291855583 291291752
2872B91291752o18363o37302o24905n97305n70927n53188n42850n34516n25055n15518
$$ 291291752 290673389 290036087 289411182 288813877 288242950 287689762 287146912 286612396 286087341 285571823
2882B85571823n09281n08919n14660n26294n45884n78422o27728o90918p55081q00438
$$ 285571823 285062542 284553623 284038963 283512669 282966785 282388363 281760635 281069717 280314636 279514198
2892B79514198q09688p78542p20672o62632o31485o39801o79017p23476p45144p27901
$$ 279514198 278704510 277925968 277205296 276542664 275911179 275271378 274592361 273868885 273123741 272395840
2902B72395840o75946o10199n53913n19561n01557m81815m43287l81947l13167k64130
$$ 272395840 271719894 271109695 270555782 270036221 269534664 269052849 268609562 268227615 267914448 267650318
2912B67650318k60048l11317m07315n21926o25000o95057p25785p24716p07378o89316
$$ 267650318 267390270 267078953 266671638 266149712 265524712 264829655 264103870 263379154 262671776 261982460
2922B61982460o80504o83288o93188o99940o91585o58055n94730n05295m00391k92053
$$ 261982460 261301956 260618668 259925480 259225540 258533955 257875900 257281170 256775875 256375484 256083431
2932B56083431j88484r1228K842R4280J75705K31170K44866K11181J42518O5784R041
$$ 256083431 255894947 255803719 255806561 255900841 256076546 256307716 256552582 256763763 256906281 256972065 256981106
2943B56981106j3924j2531j4839n0793j34850k55889l82824m78955n19333m98218m26598
$$ 256981106 256967182 256954651 256939812 256889019 256754169 256498280 256115456 255636501 255117168 254618950 254192352
2954B54192352l21979j99433o9179O0387J77116K65942L12690L10822K65960J92490
$$ 254192352 253870373 253670940 253601761 253662148 253839264 254105206 254417896 254728718 254994678 255187168
2964B55187168J06564K0103o2141j40248k14538k83871l46050m00849m49638m91791
$$ 255187168 255293732 255313835 255251694 255111446 254896908 254613037 254266987 253866138 253416500 252924709
2974B52924709n20496n20020m69150l52097j67503O6280L15113N41306P15351Q24184
$$ 252924709 252404213 251884193 251415043 251062946 250895443 250961723 251276836 251818142 252533493 253357677
2984B53357677Q69885Q63113Q15430P36256O35585N29690M43192M04434M34875N37739
$$ 253357677 254227562 255090675 255906105 256642361 257277946 257807636 258250828 258655262 259090137 259627876
2994B59627876O92978Q63075J007386J099071J134205J130695J115113J106205J103897
$$ 259627876 260320854 261183929 262191315 263290386 264424591 265555286 266670399 267776604 268880501
3003B68880501J088791J032600R13868P30286N03463K72637Q1806l4485o2752j5335
$$ 268880501 269969292 271001892 271915760 272646046 273149509 273422146 273503952 273469467 273406715 273391380
3013B73391380P3242J57586J97525J74369R7790L605o4621p7057l5114K8000O1989
$$ 273391380 273464622 273622208 273819733 273994102 274091892 274095497 274030876 273953819 273918705 273946705 274008694
3024B74008694K6626q6193k46467l99933m94843n06096m45499l52516k72332k35157
$$ 274008694 274035320 273949127 273702660 273302727 272807884 272301788 271856289 271503773 271231441 270996284
3034B70996284k45037k84900l29781l62034l80020l96538m30450m95834n93377p07302
$$ 270996284 270751247 270466347 270136566 269774532 269394512 268997974 268567524 268071690 267478313 266771011
3044B66771011q09765q71105q72898q18729p34692o60095o28681o50959p07665p59411
$$ 266771011 265961246 265090141 264217243 263398514 262663822 262003727 261375046 260724087 260016422 259257011
3054B59257011p69977p27749o55251n97000n93624o56509p60212q55980r00345q81100
$$ 259257011 258487034 257759285 257104034 256507034 255913410 255256901 254496689 253640709 252740364 251859264
3064B51859264q22010p67803p54738p89261q46481q88939q94775q73356q61321q98170
$$ 251859264 251037254 250269451 249514713 248725452 247878971 246990032 246095257 245221901 244360580 243462410
3074B43462410r99661j143226j278305j351147j334095j238632j108246r95140r34944
$$ 243462410 242462749 241319523 240041218 238690071 237355976 236117344 235009098 234013958 233079014
3083B33079014r33628r69887j010799j029168j013908r70879r15355q62885q23288
$$ 233079014 232145386 231175499 230164700 229135532 228121624 227150745 226235390 225372505 224549217
3092B24549217p98473p83463p69367p46689p08561o54716n91335n31311m87595m67815
$$ 224549217 223750744 222967281 222197914 221451225 220742664 220087948 219496613 218965302 218477707 218009892
3102B18009892m69971m83017m91276m82731m53338m08364l58295l12863k75764k43340
$$ 218009892 217539921 217056904 216565628 216082897 215629559 215221195 214862900 214550037 214274273 214030933
3112B14030933k07195j58634r3479j4897O7768J42479K00196K40001K70653L07579
$$ 214030933 213823738 213665104 213571625 213556728 213624496 213766975 213967171 214207172 214477825 214785404
3122B14785404L65257M48647N47867O40297P00454P13273O84223O38866O13518O37531
$$ 214785404 215150661 215599308 216147175 216787472 217487926 218201199 218885422 219524288 220137806 220775337
3132B20775337P19013Q39539R61838J046581J069832J032371R57661Q79021Q23536
$$ 220775337 221494350 222333889 223295727 224342308 225412140 226444511 227402172 228281193 229104729
3141B29104729Q00895Q00896Q01582P81174P28226O46400N49755M55151L73421L06663
$$ 229104729 229905624 230706520 231508102 232289276 233017502 233663902 234213657 234668808 235042229 235348892
3151B35348892K51007K02103J60961J34678J31607J53675J91116K22912K23942J77593
$$ 235348892 235599899 235802002 235962963 236097641 236229248 236382923 236574039 236796951 237020893 237198486
3161B37198486Q4191l6011j50604k28806k54516k34414j94034j65177j71680k18086
$$ 237198486 237282677 237246666 237096062 236867256 236612740 236378326 236184292 236019115 235847435 235629349
3171B35629349k89326l58562m01154m06017l80593l46012l28102l45802m04892m96864
$$ 235629349 235340023 234981461 234580307 234174290 233793697 233447685 233119583 232773781 232368889 231872025
3181B31872025o02170o97059p59697p75871p42703o70872n82676n05485m62513m63219
$$ 231872025 231269855 230572796 229813099 229037228 228294525 227623653 227040977 226535492 226072979 225609760
3191B25609760m98333n43785n71861n65395n27440m80346m54941m75693n48668o59580
$$ 225609760 225111427 224567642 223995781 223430386 222902946 222422600 221967659 221491966 220943298 220283718
3201B20283718p82223q90522r68570j012478j026631j017131r88293r44824q95501
$$ 220283718 219501495 218610973 217642403 216629925 215603294 214586163 213597870 212653046 211757545
3210B11757545q54034q36410q52185q97922r56612j003704j018658r94758r41544q81157
$$ 211757545 210903511 210067101 209214916 208316994 207360382 206356678 205338020 204343262 203401718 202520561
3220B02520561q37345q25615q47740q91399r35879r59587r46770q93097q06084p02838
$$ 202520561 201683216 200857601 200009861 199118462 198182583 197222996 196276226 195383129 194577045 193874207
3230A93874207o03981n26257m76131m49181m31862m10175l74947l25527k67830k08759
$$ 193874207 193270226 192743969 192267838 191818657 191386795 190976620 190601673 190276146 190008316 189799557
3240A89799557j51215r1953k4090N7583J52550K53353L48129M26903M86336N33313
$$ 189799557 189648342 189556389 189532299 189589882 189742432 189995785 190343914 190770817 191257153 191790466
3250A91790466N83725O56338P65247R12114J082649J250152J385842J470661J505318
$$ 191790466 192374191 193030529 193795776 194707890 195790539 197040691 198426533 199897194 201402512
3259B01402512J509609J512890J539783J596527J669369J731968J760464J745815J697178
$$ 201402512 202912121 204425011 205964794 207561321 209230690 210962658 212723122 214468937 216166115
3268B16166115J635532J581192J545029J524849J511917J496715J475201J447849J416588
$$ 216166115 217801647 219382839 220927868 222452717 223964634 225461349 226936550 228384399 229800987
3277B29800987J381455J341304J295281J244698J191310J134987J071816R97658R14783
$$ 229800987 231182442 232523746 233819027 235063725 236255035 237390022 238461838 239459496 240374279
3286B40374279Q37116P88193P90749Q51268R49784J042728J080876J033992R08280
$$ 240374279 241211395 241999588 242790337 243641605 244591389 245634117 246714993 247748985 248657265
3295B48657265P46498O08959N42450N57613O22616O81343O82354O04267M64859L08133
$$ 248657265 249403763 250012722 250555172 251112785 251735401 252416744 253099098 253703365 254168224 254476357
3305B54476357J79996J05476Q0834Q2474Q5086P8011O9733P7972J15185J76010K36797
$$ 254476357 254656353 254761829 254842663 254925137 255010223 255088234 255157967 255235939 255351124 255527134 255763931
3316B55763931K65656K38819J52893K7962j00289j94759k31552k07424j39542n5923
$$ 255763931 256029587 256268406 256421299 256449261 256348972 256154213 255922661 255715237 255575695 255519772
3326B55519772J5754N7526O5689M7398J4839k0504n1880p5436q9569r3269q7681p8259
$$ 255519772 255535526 255593052 255658741 255706139 255720978 255700474 255648594 255573158 255483589 255390320 255302639 255224380
3338B55224380p3928q4172j12781j53980j94321k17781k15302j90105j55487j28288
$$ 255224380 255150452 255066280 254953499 254799519 254605198 254387417 254172115 253982010 253826523 253698235
3348B53698235j20221j33724j62811j98460k33021k61802k81849k91634k92301k90947
$$ 253698235 253578014 253444290 253281479 253083019 252849998 252588196 252306347 252014713 251722412 251431465
3358B51431465l00503l34434l96691m74472n37910n52101m94328l68538k07176n8594
$$ 251431465 251130962 250796528 250399837 249925365 249387455 248835354 248341026 247972488 247765312 247706718
3368B47706718L4104N1327M043p5188j47781j86996j85776j55106j15337q5220p4826
$$ 247706718 247740822 247792149 247796192 247721004 247573223 247386227 247200451 247045345 246930008 246844788 246769962
3379B46769962q2798r9067j10264j06087q3923n0946k2392j5297m2114j04580j91116
$$ 246769962 246687164 246588097 246477833 246371746 246287823 246236877 246214485 246199188 246157074 246052494 245861378
3390B45861378k80457l48301l75118l54557k95582k21424j60923j36719j54896j99356
$$ 245861378 245580921 245232620 244857502 244502945 244207363 243985939 243825016 243688297 243533401 243334045
3400B43334045k37979k36722j77574p0076N1728J45378J82590J64242J18732Q4363
$$ 243334045 243096066 242859344 242681770 242611694 242663422 242808800 242991390 243155632 243274364 243358727
3410B43358727Q5144J14727J39217J17283K4948j27735k99092m34608m91009m52995
$$ 243358727 243443871 243558598 243697815 243815098 243840046 243712311 243413219 242978611 242487602 242034607
3420B42034607l35503j73568p821J26915K08207K26802J87836J10073K2850m2591o4106
$$ 242034607 241699104 241525536 241517715 241644630 241852837 242079639 242267475 242377548 242400398 242357807 242293701
3431B42293701l6697K7714J09691J92833K67849L25871L48301L03916J63212p4539
$$ 242293701 242257004 242284718 242394409 242587242 242855091 243180962 243529263 243833179 243996391 243921852
3441B43921852l60184n98144o82945n53208k32563J70231N08556O68927O24942M43593
$$ 243921852 243561668 242963524 242280579 241727371 241494808 241665039 242173595 242842522 243467464 243911057
3451B43911057K41279J16558J02787J62850K27985K46506K13070J61056J31626J42994
$$ 243911057 244152336 244268894 244371681 244534531 244762516 245009022 245222092 245383148 245514774 245657768
3461B45657768J82076K19002K29263K06947J61629J09253O5098M5490O8569J45302
$$ 245657768 245839844 246058846 246288109 246495056 246656685 246765938 246831036 246876526 246945095 247090397
3471B47090397K63576L77407M18835L34492J26247j33533l30506l70044k33803P133
$$ 247090397 247353973 247731380 248150215 248484707 248610954 248477421 248146915 247776871 247543068 247550201
3481B47550201K34909L56503L57037K98709K69051L15495M16164N05142N29003M92173
$$ 247550201 247785110 248141613 248498650 248797359 249066410 249381905 249798069 250303211 250832214 251324387
3491B51324387M50191M59080N19104N60150M86336K50129r7084m19197n70259m83303
$$ 251324387 251774578 252233658 252752762 253312912 253799248 254049377 253952293 253533096 252962837 252479534
3501B52479534k13032R4796K90355L05252J84975N1270K3040J48716L88241O49071
$$ 252479534 252266502 252361298 252651653 252956905 253141880 253193150 253216190 253364906 253753147 254402218
3511B54402218Q45604R40265R44500Q88081P85160O23074L80592N7755l04623o34060
$$ 254402218 255247822 256188087 257132587 258020668 258805828 259428902 259809494 259867249 259562626 258928566
3521B58928566q54073r15165q07666n57328k09655J79805N46227Q18481R34487Q75282
$$ 258928566 258074493 257159328 256351662 255794334 255584679 255764484 256310711 257129192 258063679 258938961
3531B58938961O94847N18513M92554O97879J077767J433105J508274J134510L48721
$$ 258938961 259633808 260152321 260644875 261342754 262420521 263853626 265361900 266496410 266845131
3540B66845131n91126j319007j549283j230583n70202Q9550M68903M99783L35693K23923
$$ 266845131 266254005 264934998 263385715 262155132 261584930 261674480 262143383 262643166 262978859 263202782
3550B63202782L36208O71520J094055J459828J725902J948300K169571K290973K053395
$$ 263202782 263538990 264210510 265304565 266764393 268490295 270438595 272608166 274899139 276952534
3559B76952534J177025m09852k410068m198952n080414m629516k924462n31044J755429
$$ 276952534 278129559 277719707 275309639 271110687 266030273 261400757 258476295 257945251 259700680
3568B59700680L259983L688297L176842K153377J117459M62208L88813Q93611J778031
$$ 259700680 262960663 266648960 269825802 271979179 273096638 273558846 273947659 274841270 276619301
3577B76619301K674923L122825K721157J335564p54127k884827m260483m321518l039474
$$ 276619301 279294224 282417049 285138206 286473770 285719643 282834816 278574333 274252815 271213341
3586B71213341r55334J077347K306385K422638J643581N22042l80459p48139n69839
$$ 271213341 270258007 271335354 273641739 276064377 277707958 278230000 277849541 277101402 276531563
3595B76531563k0542P04422J473579K187767K704716K823314K371731J344338k1248
$$ 276531563 276511021 277215443 278689022 280876789 283581505 286404819 288776550 290120888 290099640
3604B90099640j301842k063160k053356j310787j40095J007862J689072J600685O87752
$$ 290099640 288797798 286734638 284681282 283370495 283230400 284238262 285927334 287528019 288215771
3613B88215771p88555k256718k977333k336273k03839K838345N593376O714649N363102
$$ 288215771 287427216 285170498 282193165 279856892 279653053 282491398 288084774 294799423 300162525
3622C00162525J708298l034725p107945r010467q173847n154534j269951K080364M017735
$$ 300162525 301870823 298836098 291728153 282717686 274543839 269389305 268119354 270199718 274217453
3631B74217453M421444L765278K752342J998062J885090K545166L846722N347156O297970
$$ 274217453 278638897 282404175 285156517 287154579 289039669 291584835 295431557 300778713 307076683
3640C07076683N838680L400231q59452n886631j0034904j1768971j0421009o559906
$$ 307076683 312915363 316315594 315456142 309569511 299534607 287765636 277344627 270784721
3648B70784721j738357K256603M234219M057216K525139Q21896j02806J14631J275540
$$ 270784721 269046364 271302967 275537186 279594402 282119541 282941437 282838631 282953262 284228802
3657B84228802K879619M397602N407467N617523M881249L264770J110611j016902k557698
$$ 284228802 287108421 291506023 296913490 302531013 307412262 310677032 311787643 310770741 308213043
3666C08213043l248768l290290l229371l599186m532833n613460o080074n268384l008632
$$ 308213043 304964275 301673985 298444614 294845428 290312595 284699135 278619061 273350677 270342045
3675B70342045K61669L714600O511821Q098374Q270550P064991M635906J257210k573128
$$ 270342045 270603714 274318314 280830135 288928509 297199059 304264050 308899956 310157166 307584038
3684C07584038o076412q334713q628712o799774l398285N02910L748951N552445N720138
$$ 307584038 301507626 293172913 284544201 277744427 274346142 274849052 278598003 284150448 289870586
3693B89870586M579392K718239P34634q80566j747722j609688m33235J444797L283139
$$ 289870586 294449978 297168217 297902851 297022285 295274563 293664875 293231640 294676437 297959576
3702B97959576M141750L303528P03239k905445o197758p849884p147026m304027l39108
$$ 297959576 302101326 305404854 306108093 303202648 297004890 289155006 282007980 277703953 277364845
3711B77364845L411427N860081O537990N627270L721504J499119n08499j983567k762622
$$ 277364845 280776272 286636353 293174343 298801613 302523117 304022236 303513737 301530170 298767548
3720B98767548k759800j947689m12713J561928L462944M619656M400558K488289q72268
$$ 298767548 296007748 294060059 293647346 295209274 298672218 303291874 307692432 310180721 309308453
3729C09308453m792538p935200q986358p248517l071098K146187O470318Q279056P024269
$$ 309308453 304515915 296580715 287594357 280345840 277274742 279420929 285891247 294170303 301194572
3738C01194572L493634o05526l537483m419461l594703k291298j786080k591705m157944
$$ 301194572 304688206 304082680 300545197 296125736 292531033 290239735 288453655 285861950 281704006
3747B81704006n259971m808941k570420O55384L489628M767113M176178K372684N38331
$$ 281704006 276444035 271635094 269064674 269720058 273209686 277976799 282152977 284525661 285063992
3756B85063992l17402J13010J355343K511177K794495J928825K20299j662522l026523
$$ 285063992 284746590 284859600 286214943 288726120 291520615 293449440 293669739 292007217 288980694
3765B88980694l419857k740078j204891P42035K543544L661728L735104K727279R86329
$$ 288980694 285560837 282820759 281615868 282357903 284901447 288563175 292298279 295025558 296011887
3774B96011887q59242k154846k516136j999073j038685j81217K28328K15683J03283
$$ 296011887 295152645 292997799 290481663 288482590 287443905 287262688 287491016 287706699 287809982
3783B87809982K54898Q17566J630574K352886K701130K622471K280159J877384J465530
$$ 287809982 288064880 288882446 290513020 292865906 295567036 298189507 300469666 302347050 303812580
3792C03812580Q94661m7073j407719k940025m180489m704037m383525l463421k387810
$$ 303812580 304707241 304660168 303252449 300312424 296131935 291427898 287044373 283580952 281193142
3801B81193142j494713p93877P859J240577K949429M746456N958328N988293M661694
$$ 281193142 279698429 278904552 278912411 280152988 283102417 287848873 293807201 299795494 304457188
3810C04457188K336502k90070k541370m058609m855786n136585n036983m493294l332367
$$ 304457188 306793690 306503620 303962250 299903641 295047855 289911270 284874287 280380993 277048626
3819B77048626j503601P35054K839489M220486M559459L986073K994804K140999J706619
$$ 277048626 275545025 276280079 279119568 283340054 287899513 291885586 294880390 297021389 298728008
3828B98728008J544533J202698K47440j415214l423844n124893n912800n539169m201985
$$ 298728008 300272541 301475239 301722679 300307465 296883621 291758728 285845928 280306759 276104774
3837B76104774k367267m51431J419487L396377N634976P941894R603996R581547P032871
$$ 276104774 273737507 273286076 274705563 278101940 283736916 291678810 301282806 310864353 317897224
3846C17897224J909790m730110j0940056j4603805j4343338j0170994l540039L250599
$$ 317897224 319807014 315076904 304136848 289533043 275189705 265018711 261478672 264729271
3854B64729271Q018761R568367Q062420M766674J341056r39827j664333j277218o67171
$$ 264729271 272748032 282316399 290378819 295145493 296486549 295546722 293882389 292605171 291938000
3863B91938000o08998j356754k565765l536091l614865k539443n60666J688672L488140
$$ 291938000 291329002 289972248 287406483 283870392 280255527 277716084 277155418 278844090 282332230
3872B82332230M328575M077434K959233J398220j70937j428604k200165k425575k132073
$$ 282332230 286660805 290738239 293697472 295095692 294924755 293496151 291295986 288870411 286738338
3881B86738338j439838n76401J54953M86832L36437j00784m05274j43318Q64086K372475
$$ 286738338 285298500 284722099 284877052 285363884 285700321 285599537 285194263 285050945 285915031 288287506
3891B88287506L763256M309406L527966J431999j449547m287510o284618o957855o255913
$$ 288287506 292050762 296360168 299888134 301320133 299870586 295583076 289298458 282340603 276084690
3900B76084690m494553k180061J75400K179356L602714M362660M480381M036350L143329
$$ 276084690 271590137 269410076 269585476 271764832 275367546 279730206 284210587 288246937 291390266
3909B91390266J937581N86700p04117j710415k244377k229767j751995j040649l70159
$$ 291390266 293327847 293914547 293210430 291500015 289255638 287025871 285273876 284233227 283863068
3918B83863068O9179K56863L21083M21314O11305P80220P21226K89936m56276j238308
$$ 283863068 283932247 284189110 284510193 284931507 285542812 286323032 287044258 287334194 286877918 285639610
3928B85639610j680031j511459p26547L97758J430493J991596J915283J301346M38404
$$ 285639610 283959579 282448120 281721573 282119331 283549824 285541420 287456703 288758049 289196453
3937B89196453l43113q10890r05361p29199m71000l04470l07312m35238n59025n44338
$$ 289196453 288853340 288042450 287137089 286407890 285936890 285632420 285325108 284889870 284330845 283786507
3947B83786507l32356K5311L96003O40545O85559N49450L13091O3267j46790k97623
$$ 283786507 283454151 283479462 283875465 284516010 285201569 285751019 286064110 286127377 285980587 285682964
3957B85682964l79104l73078k66018p9021J19724K42596K36759J20545l0270j43147
$$ 285682964 285303860 284930782 284664764 284585743 284705467 284948063 285184822 285305367 285275097 285131950
3967B85131950k01778k49767l35369m49486n15118m48723k42691O123J59969J50528
$$ 285131950 284930172 284680405 284345036 283895550 283380432 282931709 282689018 282695141 282855110 283005638
3977B83005638M0569k6321M1676J81903K09580k2431m64935q65288r56401p04422l97149
$$ 283005638 283046207 283019886 283061562 283243465 283453045 283430614 282965679 282100391 281143990 280439568 280042419
3988B80042419m45747j010723j756096k010918j340313j75533O104k745324r705944
$$ 280042419 279596672 278585949 276829853 274818935 273478622 273303089 273309193 270563869 260857925
3997B60857925k0396995l2296620m1675758
$$ 260857925 240460930 208164310 166488552
4000A66488552
$$ 166488552
##END=$$ End of the data block
