##TITLE=$$ Begin of the data block
##JCAMP-DX=5.00 $$ ACD/SpecManager v 10.08
##SPECTROMETER/DATA SYSTEM=16PC
##DATE=Thu Sep 12 14:40:07 2013
##DATA TYPE=INFRARED SPECTRUM
##DATA CLASS=XYDATA
##ORIGIN=
##OWNER=
##NPOINTS=3601
##FIRSTX=400.00000000
##LASTX=4000.00000000
##MAXX=4000.00000000
##MINX=400.00000000
##MAXY=40.47954178
##MINY=16.70276451
##XFACTOR=1.0000000000
##YFACTOR=0.000000100000000
##FIRSTY=22.59926605
##DELTAX=1.00000000
##XUNITS=1/CM
##YUNITS=TRANSMITTANCE
##XYDATA=(X++(Y..Y))
400B25992661N9184970M7859936L2704659J8252601P522698J117859k230797m253578
408C86151009n894432o983452o858979n300102k996292j205406q99506k062683l675270
417C50274887m386406l393555r19685J998520M211044N130959M951057M326210L821869
426C66014900L543396L174896K332917R34944o94046k024689k663078k578964k080002
435C65960274j583710j357651j392860j464348j305161p80181L2234Q69217J390571
444C60368385J316872N52673p44362k184791l270989l596954l038292j831818m86373
453C47084351M49562O47735J51100o66656j306534j399536q73070M9515R98421J661110
463C46795998J925163J897888J808205J860122K120514K495194K798500K867546K659492
$$ y = [225992661, 285177631, 333037567, 365742226, 383994827, 391517525, 392635384, 390404587, 386151009, 380256577, 373273125, 366414146, 361114044, 358117752, 356912346, 356012840, 353950157, 350274887, 345888481, 342494926, 341575241, 343573761, 347784805, 352915764, 357866821, 362193031, 366014900, 369558296, 372733192, 375066109, 376001053, 375307007, 373282318, 370619240, 368040276, 365960274, 364376564, 363018913, 361626053, 360161705, 358856544, 358076363, 358108597, 358977814, 360368385, 361685257, 362237930, 361493568, 359308777, 356037788, 352440834, 349402542, 347570724, 347084351, 347533913, 348181648, 348332748, 347666092, 346359558, 344960022, 344086952, 344136467, 345134888, 346795998, 348721161, 350619049, 352427254, 354287376, 356407890, 358903084, 361701584, 364569130, 367228622]
472C67228622K274781J897049J681633J656837J700440J607933J218757N27153k98271
481C79494934j002312j397781j491127j497231j719245k352601l325119m273452m688530
490C57747536m161339k605324l34854K051849L924027M884415M914207M334679L616142
499C74371338L138657L031921L159180L239860L028641K452507J641121Q45909L02238
508C95211372J09749J86272L15208K57607j26724q04673j578178k176857k388306k165565
518C86839905j651345j097335p23763n94406n87807m87289j37367M33578J009789J318245
528C84322205J208229P65266K74735M8942K30751O98128J141319J260758R59663M03137
538C91313133r1667k62566o7367K96402N25398M08821l8948n87578r30137q60901l86543
$$ y = [367228622, 369503403, 371400452, 373082085, 374738922, 376439362, 378047295, 379266052, 379793205, 379494934, 378492622, 377094841, 375603714, 374106483, 372387238, 370034637, 366709518, 362436066, 357747536, 353586197, 350980873, 350646019, 352697868, 356621895, 361506310, 366420517, 370755196, 374371338, 377509995, 380541916, 383701096, 386940956, 389969597, 392422104, 394063225, 394909134, 395211372, 395321121, 395507393, 395822601, 396080208, 395953484, 395148811, 393570633, 391393776, 389005470, 386839905, 385188560, 384091225, 383367462, 382773056, 382185249, 381697960, 381560593, 381994171, 383003960, 384322205, 385530434, 386295700, 386570435, 386619377, 386850128, 387548256, 388689575, 389950333, 390909996, 391313133, 391221466, 390958900, 390891533, 391187935, 391713333, 392122154, 392083206, 391495628, 390565491, 389704590, 389318047]
549C89318047K87170Q69789J131973J001397N70259K6626m43344p32345q36983q33702
559C90358887q23365q82759j034622j252861j486854j687699j821899j870079j820564
568C77678185j672249j448212j208649j042518j027413j176147j402931j542511j425858
577C65731697r74007k56729N28984J151886J460686J451264J249237J020393Q68874
586C72232285P87811O85806M68102J12304l12309o87752r23729j011009j020622j051827
596C69279060j166534j352310j535263j626931j573905j375924j065635o70357j87149
605C58725052M09698J127663J914406K642860L144951L277931K992554K364807J571388
614C78171310Q21839K81486K0295Q201J49918L35159M80576N48286N44014N02167M65393
$$ y = [389318047, 389605217, 390475006, 391606979, 392608376, 393178635, 393205261, 392761917, 392029572, 391192589, 390358887, 389535522, 388652763, 387618141, 386365280, 384878426, 383190727, 381368828, 379498749, 377678185, 376005936, 374557724, 373349075, 372306557, 371279144, 370102997, 368700066, 367157555, 365731697, 364757690, 364500961, 365029945, 366181831, 367642517, 369093781, 370343018, 371363411, 372232285, 373020096, 373705902, 374174004, 374286308, 373973999, 373286247, 372362518, 371351509, 370330887, 369279060, 368112526, 366760216, 365224953, 363598022, 362024117, 360648193, 359582558, 358912201, 358725052, 359134750, 360262413, 362176819, 364819679, 367964630, 371242561, 374235115, 376599922, 378171310, 378993149, 379274635, 379294930, 379303131, 379453049, 379788208, 380268784, 380817070, 381361084, 381863251, 382328644]
625C82328644M65240N05715N58052N73654N09834L57666J52588m4441j83563k56729
635C84966660k97776l51333m29383m94918m83857l55797j33056J02730K55546K69623
645C83048439J53198m3220k69966n02777p29638r16824r99603r23729p11899m93813
655C77610168m45823o59027j020165j218300r12552J6861J300202K335052K483101
664C79489517J450005m80461k527314l789863l715439k387695m68331J169319J890946
673C70630684J583328O25229l97110j030235j150246r29375o39762m47960l33367j53389
683C67757797K13509P58171J335411J749420J869698J696396J350441R98344P62901
692C78492088O66390O29463N21202K35825k40555q03108j263810j435203j229591p17736
$$ y = [382328644, 382793884, 383299599, 383857651, 384431305, 384941139, 385298805, 385451393, 385406952, 385223389, 384966660, 384668884, 384317551, 383888168, 383393250, 382909393, 382553596, 382420540, 382523270, 382778816, 383048439, 383201637, 383158417, 382888451, 382385674, 381656036, 380739212, 379739609, 378815880, 378103981, 377610168, 377164345, 376505318, 375485153, 374266853, 373354301, 373371162, 374671364, 377006416, 379489517, 380939522, 380459061, 377931747, 374141884, 370426445, 368038750, 367570419, 368739738, 370630684, 372214012, 372839241, 372442131, 371411896, 370261650, 369332275, 368692513, 368244553, 367911186, 367757797, 367971306, 368729477, 370064888, 371814308, 373684006, 375380402, 376730843, 377729187, 378492088, 379158478, 379787941, 380309143, 380544968, 380304413, 379501305, 378237495, 376802292, 375572701, 374854965]
702C74854965j11122L34015M43459K15148j80168m91142n19791k23884K64435P11059
712C75296974Q98209P25441K47268l61404q85925j157990j111679p95097l41454Q7242
722C72601585L62778M33121L33977J60598J3504n1994m9400m3297j02692k55012m67110
733C72936058o63834p70835p54738o39687m92859l92837l97148n23644p49550j022606
743C66528320j279907j467285j556015j549149j475143j368866j249847j114541r46693
752C54520874p44057n39703l99475l92952n50346q37136j163826j430626j581192j631202
762C45250359j653328j727829j889267k100830k275544k326088k220687k009468j810952
771C27236366j765365j973496k449646l103351l755856m190083m215450l729610k754059
$$ y = [374854965, 374743843, 375077858, 375521317, 375736465, 375556297, 375065155, 374545364, 374321480, 374585915, 375296974, 376195183, 376920624, 377167892, 376806488, 375920563, 374762573, 373650894, 372855797, 372514343, 372601585, 372964363, 373397484, 373731461, 373892059, 373905563, 373853569, 373804169, 373760872, 373658180, 373403168, 372936058, 372272224, 371501389, 370746651, 370106964, 369614105, 369221268, 368824120, 368300476, 367550926, 366528320, 365248413, 363781128, 362225113, 360675964, 359200821, 357831955, 356582108, 355467567, 354520874, 353776817, 353237114, 352837639, 352444687, 351894341, 351057205, 349893379, 348462753, 346881561, 345250359, 343597031, 341869202, 339979935, 337879105, 335603561, 333277473, 331056786, 329047318, 327236366, 325471001, 323497505, 321047859, 317944508, 314188652, 309998569, 305783119, 302053509, 299299450]
780B99299450j430340K3518J376476K446518L133678L422909L363571L042565K568226
789C17246571K058563J629886J374360J330108J461258J664810J808472J788864J579437
798C31942329J244469R08966O99387O85425Q52966J116600J364212J510773J528244
807C41853371J448936J337280J253319J226235J248550J291199J328087J353645J385994
816C53726616J450691J561089J701698J827850J882630J822433J637917J360283J050262
825C68021469P72209N68390M43726L67355K91443J75133N417j97220l88375n19828
835C69539719n59044m99840l57895j60332O8627L12576N60494P99942J012992J180153
845C71897392J288414J337166J338997J308441J251640J161614J021690Q16689N42297
$$ y = [299299450, 297869110, 297892628, 299269104, 301715622, 304849300, 308272209, 311635780, 314678345, 317246571, 319305134, 320935020, 322309380, 323639488, 325100746, 326765556, 328574028, 330362892, 331942329, 333186798, 334095764, 334795151, 335480576, 336333542, 337450142, 338814354, 340325127, 341853371, 343302307, 344639587, 345892906, 347119141, 348367691, 349658890, 350986977, 352340622, 353726616, 355177307, 356738396, 358440094, 360267944, 362150574, 363973007, 365610924, 366971207, 368021469, 368793678, 369362068, 369805794, 370173149, 370464592, 370639725, 370645142, 370447922, 370059547, 369539719, 368980675, 368480835, 368122940, 367962608, 368031235, 368343811, 368904305, 369704247, 370717239, 371897392, 373185806, 374522972, 375861969, 377170410, 378422050, 379583664, 380605354, 381422043, 381964340]
854C81964340K05879j77955n91431j009712j389542j660995j735153j532402j024857
863C73048172k66838O03790J405182J975250K230339K188492J947823J630630J325722
872C86088562J061783Q19168N72281L29361J43890Q9531K11258M89273Q34084J124763
882C91763954J266632J236573J089019R19152Q04748P62444P44247O76422N14946K82822
892D00060959O3209m7340K67J74751L75939M90722M57650L02238J22757L3073R5635
903D02129860K84119M96254O09588N47791L22570K7390k12059k99759k15568j8425
913D03671761J87759L10097L07960K06490P3662k0676m0970j373M8561N2147k1935
924D04773483j65901l36189m74701n31807m86717l53661j75896j1558Q6174Q6365r117
$$ y = [381964340, 382170219, 381992264, 381400833, 380391121, 379001579, 377340584, 375605431, 374073029, 373048172, 372781334, 373385124, 374790306, 376765556, 378995895, 381184387, 383132210, 384762840, 386088562, 387150345, 387969513, 388541794, 388871155, 389015045, 389104576, 389315834, 389805107, 390639191, 391763954, 393030586, 394267159, 395356178, 396275330, 397080078, 397842522, 398586769, 399263191, 399778137, 400060959, 400124168, 400076828, 400077095, 400251846, 400627785, 401118507, 401576157, 401878395, 402001152, 402034225, 402129860, 402413979, 402910233, 403519821, 404067612, 404390182, 404417572, 404205513, 403905754, 403690186, 403671761, 403859520, 404169617, 404477577, 404684067, 404757729, 404737053, 404696083, 404694710, 404743271, 404795418, 404773483, 404607582, 404271393, 403796692, 403264885, 402778168, 402424507, 402248611, 402237053, 402323227, 402409592, 402400475]
935D02400475j68000l41072m83169n71633o12373o32324o60019p10678p78466q45146
945C96597595q93631r16824r16367q91685q30727p11860n17235k49520N9967L59841
955C91089554O00014P52258Q18024Q18252P76672P05338O05621M79317L40424K14233
965C97199707J25542P9918N8174K5940m4289j52359k67982l47329l58619l02430k10838
976C95805435j31607j02501j36986k22320l31421m35257n11208n45387n33829m85153
986C92369766m25110l93180m28544n48744p34977r34716j086616j154480j148453j120644
996C84394302j132812j218071j360741j511116j623726j698646j791611j985283k332306
1005C69739990k802849l267898l532524l406258k779846j675797k52952J234932K510643
$$ y = [402400475, 402232475, 401891403, 401408234, 400836601, 400224228, 399591904, 398931885, 398221207, 397442741, 396597595, 395703964, 394787140, 393870773, 392979088, 392148361, 391436501, 390919266, 390669746, 390729713, 391089554, 391689568, 392441826, 393259850, 394078102, 394854774, 395560112, 396165733, 396645050, 396985474, 397199707, 397325249, 397405167, 397463341, 397489281, 397444992, 397292633, 397024651, 396677322, 396318703, 396016273, 395805435, 395673828, 395571327, 395434341, 395212021, 394880600, 394445343, 393934135, 393388748, 392854919, 392369766, 391944656, 391551476, 391122932, 390574188, 389839211, 388904495, 387817879, 386663399, 385514946, 384394302, 383261490, 382043419, 380682678, 379171562, 377547836, 375849190, 374057579, 372072296, 369739990, 366937141, 363669243, 360136719, 356730461, 353950615, 352274818, 352021866, 353256798, 355767441]
1014C55767441L347626L628692L368569K701263J833458R81674L14026q5793k21710
1023C71635246j58424J6594K26898M21791N73197O64024O81343O16836M74625K75002
1033C75427132N0583j65711l51219m98619o10504o91109p40509p55692p36999o92444
1043C70234909o36940n85709n46722n18951m96636m77257m66995m79126n25207o07109
1053C64894257p12128q17833r02329r55657r85108j012077j062126j152649j287155
1062C56007195j457177j651649j868439k118416k420196k785721l207550l654938m085121
1071C32757988m465027m789848n087872n403690n772057o190548o612873o961765p156181
1080B80318127p136364o873970o367417n630798m688854l583050k382412j183739r6035
$$ y = [355767441, 359115067, 362743759, 366112328, 368813591, 370647049, 371628723, 371942749, 371856956, 371635246, 371476822, 371493416, 371720314, 372142105, 372715302, 373379326, 374060669, 374677505, 375152130, 375427132, 375477715, 375312004, 374960785, 374462166, 373851662, 373160553, 372420044, 371664352, 370927353, 370234909, 369597969, 369012260, 368465538, 367946587, 367449951, 366972694, 366505699, 366026573, 365501366, 364894257, 364182129, 363364296, 362461967, 361506310, 360521202, 359509125, 358446999, 357294350, 356007195, 354550018, 352898369, 351029930, 348911514, 346491318, 343705597, 340498047, 336843109, 332757988, 328292961, 323503113, 318415241, 313011551, 307239494, 301048946, 294436073, 287474308, 280318127, 273181763, 266307793, 259940376, 254309578, 249620724, 246037674, 243655262, 242471523, 242375488]
1089B42375488P91359J439553J871700K159824K391434K637997K940635L317509L778839
1098B63704338M334564M980068N673466O319943O788730O959610O782170O310215N691223
1107C17544327N105552M689522M478493M403038M336891M169579L862419L461609L063812
1116C55115242K761307K596664K551308K566681K580261K554550K483444K379494K256127
1125C77845078K113952J943207J732826J481133J198845R04045O13784L36762P3471
1134C88243103j77917m14811o26526p96241r09653r64622r75380r69010r71947r95140
1144C80441856j024360j023102r49020p76787n16129k15721N0736K10533K19116P6790
1154C76493912j71852m55704p06673q87489j008873j125336j309280j612206k028732
$$ y = [242375488, 243166847, 244606400, 246478100, 248637924, 251029358, 253667355, 256607990, 259925499, 263704338, 268038902, 273018970, 278692436, 285012379, 291801109, 298760719, 305542889, 311853104, 317544327, 322649879, 327339401, 331817894, 336220932, 340557823, 344727402, 348589821, 352051430, 355115242, 357876549, 360473213, 363024521, 365591202, 368171463, 370726013, 373209457, 375588951, 377845078, 379959030, 381902237, 383635063, 385116196, 386315041, 387219086, 387832870, 388169632, 388243103, 388065186, 387650375, 387023849, 386227608, 385317955, 384353333, 383377953, 382408943, 381436996, 380441856, 379417496, 378394394, 377445374, 376668587, 376152458, 375936737, 375987473, 376198006, 376417122, 376493912, 376322060, 375866356, 375159683, 374272194, 373263321, 372137985, 370828705, 369216499, 367187767]
1163C67187767k481117k835388k945633k708512k106132j218796k03400P50504J470184
1172C54909477J839562J820907J460038Q75549K34756k86178n48439m93012j60255
1181C59652405L25355Q01049J125106J221810J094856Q07037M41246O5308k84653o00929
1191C64648590q90541j162643j424714j684227j949653k229080k524567k829170l127518
1200C46826477l402634l642616l846130m025383m203377m410477m676666n024319n462436
1209C08132439n983906o568661p184715p784519q293724q600064q556213q010960o866855
1218B40282822n143967l016968p93915J167317K578792L328114L519764L429184L387089
1227B48738232L645801M285832N199508O155587O904220P277050P235756O862221O301803
$$ y = [367187767, 364706650, 361871262, 358925629, 356217117, 354110985, 352892189, 352688789, 353439293, 354909477, 356749039, 358569946, 360029984, 360905533, 361140289, 360854111, 360305672, 359812660, 359652405, 359977760, 360778809, 361903915, 363125725, 364220581, 365027618, 365468864, 365534172, 365249519, 364648590, 363758049, 362595406, 361170692, 359486465, 357536812, 355307732, 352783165, 349953995, 346826477, 343423843, 339781227, 335935097, 331909714, 327706337, 323295860, 318619194, 313594875, 308132439, 302148533, 295579872, 288395157, 280610638, 272316914, 263716850, 255160637, 247149677, 240282822, 235138855, 232121887, 231327972, 232495289, 235074081, 238402195, 241921959, 245351143, 248738232, 252384033, 256669865, 261869373, 268024960, 274929180, 282206230, 289441986, 296304207, 302606010]
1236C02606010N698681N150338M698581M346276M082489L897705L781395L712844L654595
1245C41628914L559494L388138L125648K787209K406349K015152J623993J218147P66640
1254C62519684K43149l53432r89113j597710k095489k403832k471237k290115j901512
1263C48660393j386223q43277l64571j3618J80931K19688J17226j11160m53530q96873
1273C45108986j417465j977272k527161l016930l408012l680191l831863l874360l823433
1282C17552299l692245l485966l201179k829380k363396j803951j163082m60415K85206
1291B98837891J063213J871357K704506L535595M301529M904842N237694N223122M853935
1300C32533684M211998L449478K739792K211952J901474J740761J595573J332779Q84590
$$ y = [302606010, 308304691, 313455029, 318153610, 322499886, 326582375, 330480080, 334261475, 337974319, 341628914, 345188408, 348576546, 351702194, 354489403, 356895752, 358910904, 360534897, 361753044, 362519684, 362762833, 362409401, 361420288, 359822578, 357727089, 355323257, 352852020, 350561905, 348660393, 347274170, 346430893, 346066322, 346052704, 346233635, 346453323, 346570549, 346459389, 346005859, 345108986, 343691521, 341714249, 339187088, 336170158, 332762146, 329081955, 325250092, 321375732, 317552299, 313860054, 310374088, 307172909, 304343529, 301980133, 300176182, 299013100, 298552685, 298837891, 299901104, 301772461, 304476967, 308012562, 312314091, 317218933, 322456627, 327679749, 332533684, 336745682, 340195160, 342934952, 345146904, 347048378, 348789139, 350384712, 351717491, 352602081]
1309C52602081K76223l94898j016884j522445j912842k234154k522163k754403k840957
1318C37679558k665138k148095j299095k22740R20677J976815K845382L497467L959160
1327C44543991M280777M506340M654999M710426M622688M324837L769570K974815K053108
1336C80441551J198044O15578M28505O05468R62716J247749J264191R67369M72755
1345C88203926k2430l57819m90608m96292m94080n56030o60782p21893o68488n22575
1355C83212929m20609n64232j122055k132530l451767m772453n707512n914421n219917
1364C53907433l699036j675301L71170J958619K766113K731628K043495J033516K7962
1373C59465599p65610j286621j567306j650276j538811j213761o95266r2240M11148
$$ y = [352602081, 352878304, 352483406, 351466522, 349944077, 348031235, 345797081, 343274918, 340520515, 337679558, 335014420, 332866325, 331567230, 331344490, 332265167, 334241982, 337087364, 340584831, 344543991, 348824768, 353331108, 357986107, 362696533, 367319221, 371644058, 375413628, 378388443, 380441551, 381639595, 382255173, 382683678, 383289146, 384251862, 385499611, 386763802, 387731171, 388203926, 388181496, 387823677, 387333069, 386836777, 386342697, 385786667, 385125885, 384403992, 383735504, 383212929, 382792320, 382228088, 381106033, 378973503, 375521736, 370749283, 365041771, 359127350, 353907433, 350208397, 348533096, 348904266, 350862885, 353628998, 356360626, 358404121, 359437637, 359465599, 358699989, 357413368, 355846062, 354195786, 352656975, 351443214, 350747948, 350655708, 351066856]
1382C51066856O37970N26238J87759j30539j75247J62659P62291J312980J469574J042328
1392C56862869J17760r64546j770706j988907j581726p95479k3308L97301L39050q8539
1402C50503769o40755j090126j336555j413307j408043j367531j262589j034698o84242
1411C40265923l29285j79100m28085j128808k121391l066559l574447l371239k427597
1420C23639412r88312N12238J621475K055931J824226J220398O80313N55344R19914
1429C32040939J517639J894150J654473P06443o55555j882668k449531k120820j056251
1438C29648819K92511J414032J954422J811333J095314L5782j085320j953392k255745
1447C30957756j790047o34079P43409J572227J114998q90884l946763o892547q416825
$$ y = [351066856, 351704826, 352231064, 352418823, 352288284, 352113037, 352275696, 353037987, 354350967, 355820541, 356862869, 356980629, 356016083, 354245377, 352256470, 350674744, 349879265, 349855957, 350253258, 350592308, 350503769, 349863014, 348772888, 347436333, 346023026, 344614983, 343247452, 341984863, 340950165, 340265923, 339936638, 339757538, 339329453, 338200645, 336079254, 333012695, 329438248, 326067009, 323639412, 322651100, 323163338, 324784813, 326840744, 328664970, 329885368, 330565681, 331121025, 332040939, 333558578, 335452728, 337107201, 337813644, 337158089, 335275421, 332825890, 330705070, 329648819, 329941330, 331355362, 333309784, 335121117, 336216431, 336252213, 335166893, 333213501, 330957756, 329167709, 328533630, 329277039, 330849266, 331964264, 331073380, 327126617, 320234070, 311817245]
1456C11817245p731399n027409j415558J646729L128624K947197J929264J245232J668090
1465C10208015L111077M715061N409679M586144K467766k8611j826934k278710j459465
1474C24904022l3531J183434J675949J437339Q54264L87916K65999L61672L04603k64053
1484C31077614j438484k927361m123993m346180l153953o13938K628250N544224P152672
1493C29798851P006302N479584L655853K802696L672485O006928Q565445R721680Q336830
1502C85046654M436149p10411n168380p272835o408386l227501P67898M006920N544052
1511C77014160N329704L997384K378540J060485K01455l73726r34182j629486k400055
1520C84644279l013572l177147k671394j473008J74256J788673K812271K872582K018509
$$ y = [311817245, 304085846, 299058437, 297642879, 299289608, 302418232, 305365429, 307294693, 308539925, 310208015, 313319092, 318034153, 323443832, 328029976, 330497742, 330469131, 328642197, 326363487, 324904022, 324870491, 326053925, 327729874, 329167213, 330021477, 330409393, 330675392, 331037064, 331341667, 331077614, 329639130, 326711769, 322587776, 318241596, 315087643, 314473705, 317101955, 322646179, 329798851, 336805153, 342284737, 345940590, 348743286, 352415771, 358422699, 366988144, 376709824, 385046654, 389482803, 388772392, 383604012, 376331177, 369922791, 366695290, 367463188, 371470108, 377014160, 382343864, 386341248, 388719788, 389780273, 389981728, 389608002, 388673820, 387044334, 384644279, 381630707, 378453560, 375782166, 374309158, 374483414, 376272087, 379084358, 381956940, 383975449]
1529C83975449P73849q4724N1040J221238K776985L658294K957688M63562l130074
1538C92663307o491813q269196p730980n102158j432228J913262L870430M104690L072815
1547C76598129J725083J007843J393661K640801L884468M034157K320785j240616n708008
1556C86656303r502563j1054955r532356n295334J74141M879151P181434O515007L584709
1565C73605537m5394k750664l613014k766953j180267k8916l2882j110611k505150
1574C59571686l270340k814903j206475R05190K659530L424759L063546J918296N68886
1583C64820175m72641r68780r82514p59277n58395n27802o66199q65440r87244r41314
1593C57090569p31049m53873k54402k45590m38690p27883r53102j010628r39712r08470
$$ y = [383975449, 384749298, 384664574, 384715614, 385936852, 388713837, 392372131, 395329819, 395793381, 392663307, 386171494, 377902298, 370171318, 365069160, 363636932, 365550194, 369420624, 373525314, 376598129, 378323212, 379331055, 380724716, 383365517, 387249985, 391284142, 393604927, 392364311, 386656303, 377153740, 366098785, 356566429, 351271095, 351445236, 356324387, 363505821, 370020828, 373605537, 373560143, 370809479, 367196465, 364429512, 363249245, 363220329, 363187447, 362076836, 359571686, 356301346, 353486443, 352279968, 353185158, 355844688, 359269447, 362332993, 364251289, 364820175, 364347534, 363378754, 362396240, 361636963, 361078568, 360550766, 359884567, 359019127, 358031883, 357090569, 356359520, 355905647, 355651245, 355405655, 354966965, 354239082, 353285980, 352275352, 351335640, 350427170]
1603C50427170j090050j501121j929932k034416j577797o52581K79122O00929r1820
1612C42429504j695556l584290m911308n068359m023819k339707q56972k47306o93264
1621C19008923j859055l126907l924122l953190l240719k052841p81727J34010K73228
1630C00477600o62289k689266n413341q052578r686318r658508p937279n213699k637348
1639B48526974j290970j660042l378868n398941o505776n929012l730831p68089J763000
1648B21627445K970944K762909J911850J634006K888756N778522R405499J2298679
1656B61278610J3197613J1752129Q723468N555649L560028L205166L930893M589729
1664C15793285M212399K602386L92762j437836k233391k048073j509113j282463j548939
$$ y = [350427170, 349337120, 347835999, 345906067, 343871651, 342293854, 341641273, 341920395, 342521324, 342429504, 340733948, 337149658, 332238350, 327169991, 323146172, 320806465, 319949493, 319702187, 319008923, 317149868, 314022961, 310098839, 306145649, 302904930, 300852089, 300070362, 300204372, 300477600, 299815311, 297126045, 291712704, 283660126, 273973808, 264315300, 256378021, 251164322, 248526974, 247236004, 245575962, 242197094, 236798153, 230292377, 224363365, 220632534, 219864445, 221627445, 224598389, 227361298, 229273148, 230907154, 233795910, 239574432, 248979931, 261278610, 274476223, 286228352, 294951820, 300507469, 304067497, 307272663, 311203556, 315793285, 320005684, 322608070, 323000832, 321562996, 319329605, 317281532, 315772419, 314489956, 312941017]
1673C12941017j878586j597747l80936J363964K619247K338581J22414l451481p059250
1682C05017223r295883r377346p486400m598656j936989l91827k17476j108284k528781
1691B68075581m055310n528679o974945q401966r639625j0338402j0127831q831825
1699B04176998o610107l940411j442680L66554J274529J435108J268863J250782J683178
1708A99462814K552929L536320M146595L962898K838173R94682j042327k653351l382225
1717B10416508l124485k147503r23233J42860R38797J690712K784176M458237O558666
1726B20794735Q521805R631958R421673P981147N973244M319000L718739M284038N498619
1735B80144958O533509O731224N968704M692211L613320L261737L668232M360409M661713
$$ y = [312941017, 311062431, 309464684, 309083748, 310447712, 313066959, 315405540, 315527954, 312076473, 305017223, 295721340, 286343994, 278857594, 274258938, 272321949, 271930122, 271712646, 270604362, 268075581, 264020271, 258491592, 251516647, 243114681, 233475056, 223136654, 213008823, 204176998, 197566891, 193626480, 192183800, 192550354, 193824883, 195259991, 196528854, 197779636, 199462814, 202015743, 205552063, 209698658, 213661556, 216499729, 217494411, 216452084, 213798733, 210416508, 207292023, 205144520, 204221287, 204364147, 205302944, 206993656, 209777832, 214236069, 220794735, 229316540, 238948498, 248370171, 256351318, 262324562, 266643562, 270362301, 274646339, 280144958, 286678467, 293409691, 299378395, 304070606, 307683926, 310945663, 314613895, 318974304, 323636017]
1744C23636017M103470K703132R59053m25796r13620l90701Q14094K135201L061180
1753C35682030L347587L054009K425613J720810J103516O45027L99361M57763R15337
1762C49751053J759033K765045L508988L528671K572708P90176j266899k859955l396492
1771C57152328k702369j090164Q05206K321091L031540K861557K035446R32541n4169
1780C65293007o06842n33638J83678J342391K521592L191719K932701J669159k15683
1789C75778084j994133k914200k572708j139069P10602K123261K492752J750412L70979
1798C74605980q96645j421394r93500J07880J297035J999168J929780J200408K15226
1807C78043938n62744q45261o28471j38131L35083O06842O73638O63566P12166Q55675
$$ y = [323636017, 327739487, 330442619, 331401672, 330975876, 330062256, 329671555, 330485649, 332620850, 335682030, 339029617, 342083626, 344509239, 346230049, 347333565, 347978592, 348377953, 348835716, 349751053, 351510086, 354275131, 357784119, 361312790, 363885498, 364675674, 363408775, 360548820, 357152328, 354449959, 353359795, 354165001, 356486092, 359517632, 362379189, 364414635, 365347176, 365293007, 364686165, 364152527, 364336205, 365678596, 368200188, 371391907, 374324608, 375993767, 375778084, 373783951, 370869751, 368297043, 367157974, 367868576, 369991837, 372484589, 374235001, 374605980, 373709335, 372287941, 371294441, 371402321, 372699356, 374698524, 376628304, 377828712, 378043938, 377481194, 376635933, 376007462, 375869331, 376204414, 376811256, 377484894, 378148460, 378860626, 379716301]
1817C79716301J014061J063271R32350O50596L09792j8463l35007o86836j083336j428070
1827C80134659j543884j285935o65474J16539P74079J115074J167984J150512J290055
1836C82253609J616134J886559J721382Q72269n50957k064590l038407l039970k082062
1845C77573967o18820P04803J398430J357079Q54339L26233R4452K01721M42620N46302
1855C82881126L81012M8294j84555o5345M61540J184769J710395J661568Q90198m15421
1865C88553581j790313k697068k778663k025681p74879M63180J250725J410980J064263
1874C82676125N12046N1575j62659j43623J679J69448L08380M00162M16260L03993
1884C84533386K6474l79905p88613j037216j023102p72438m26254j50185l1891l8719
$$ y = [379716301, 380730362, 381793633, 382725983, 383376579, 383686371, 383667908, 383332901, 382646065, 381562729, 380134659, 378590775, 377304840, 376639366, 376755905, 377529984, 378645058, 379813042, 380963554, 382253609, 383869743, 385756302, 387477684, 388349953, 387798996, 385734406, 382695999, 379656029, 377573967, 376955147, 377659950, 379058380, 380415459, 381269798, 381596031, 381690483, 381892204, 382334824, 382881126, 383262138, 383310432, 383125877, 383060532, 383522072, 384706841, 386417236, 388078804, 388969002, 388553581, 386763268, 384066200, 381287537, 379261856, 378486977, 378950157, 380200882, 381611862, 382676125, 383188171, 383239746, 383077087, 382933464, 382935143, 383104591, 383412971, 383813133, 384229393, 384533386, 384559860, 384179955, 383391342, 382354126, 381331024, 380558586, 380132332, 379982147, 379950256, 379911537]
1894C79911537o4964k4338Q4267J87912K11372J46294N3749M883O828r766j28479l52173
1906C80027122n59654n64689k45743L40690R53026J284561J138382N48325k34489q80509
1916C81807022j157837j037483o76155k98424o4583k022k8495l3264M4593J86806L22495
1927C79062653L82652L43017K36702J34621J07651J92528L68499N57557O50749N53322
1937C82589951K35061k40707p30477j066207j129532r07784m98657o1035K60772L97339
1947C78848724L70255K58636J44425O8550K3231k3841r3804j73111k19307j88598o7559
1958C78947601J09978K72064L39928K65999O0844k06184m34151n33447m66690k63787
1968C78092155r651J97220K88620K53906J37635J1177o6643p5913l7841N417J9645
$$ y = [379911537, 379846573, 379822235, 379906502, 380094414, 380305786, 380452080, 380505829, 380510712, 380517540, 380507774, 380379295, 380027122, 379467468, 378902779, 378657036, 378997726, 379950752, 381235313, 382373695, 382922020, 382687531, 381807022, 380649185, 379611702, 378935547, 378637123, 378572540, 378570518, 378542023, 378508759, 378553352, 378740158, 379062653, 379445305, 379788322, 380025024, 380159645, 380267296, 380459824, 380828323, 381385880, 382036629, 382589951, 382825012, 382584305, 381853828, 380787621, 379658089, 378750305, 378251648, 378190613, 378451385, 378848724, 379218979, 379477615, 379622040, 379690590, 379713821, 379689980, 379596176, 379423065, 379203758, 379015160, 378947601, 379057579, 379329643, 379669571, 379935570, 379996414, 379790230, 379356079, 378822632, 378355942, 378092155, 378082504, 378279724, 378568344, 378822250, 378959885, 378971062, 378904419, 378828506, 378790665, 378796082, 378815727]
1979C78815727m58l2386m3068j4687M0131Q0337N9357m7760k22893m07676n26429n22194
1991C77178001l86467j64108O5804K26936K79007K31628J30616K8762m2228q3199j16653
2002C77348099j64070k27204k83470k99606k53144j48277j8043Q9912J33553R4833
2012C76272583j2779j50109k68478l27377l09563k26059j09520j640O4125P2746L1319
2023C75035248l7804j08032j58234j79329j72119j44462j04943o1874k2430N531J4763
2034C74066315J52l8414r2773j47209j83449j86806j54610r8419m0931o905r766m6463
2046C73060722r7274j37635j51291j39350j17493j04904j09558j22834j24778r9946
2056C71855659m9476M616L1128Q239o2217j52741k24457k46086k11525j41182o9999
$$ y = [378815727, 378815269, 378782883, 378739815, 378725128, 378765259, 378845596, 378904953, 378857193, 378634300, 378226624, 377700195, 377178001, 376791534, 376627426, 376693230, 376920166, 377199173, 377430801, 377561417, 377590179, 377547951, 377464752, 377348099, 377184029, 376956825, 376673355, 376373749, 376120605, 375972328, 375954285, 376044197, 376177750, 376272583, 376259804, 376109695, 375841217, 375513840, 375204277, 374978218, 374868698, 374867058, 374931183, 375003929, 375035248, 374997444, 374889412, 374731178, 374551849, 374379730, 374235268, 374130325, 374068451, 374046021, 374051552, 374066315, 374066467, 374028053, 373935280, 373788071, 373604622, 373417816, 373263206, 373164787, 373123856, 373116951, 373107185, 373060722, 372963448, 372825813, 372674522, 372535172, 372417679, 372312775, 372203217, 372080383, 371955605, 371855659, 371806183, 371810799, 371841927, 371850166, 371787949, 371635208, 371410751, 371164665, 370953140, 370811958, 370741959]
2067C70741959k8878k8038n4474q0757q1978n0048K975N1956P4005O1531K6207r040
2079C70625420k2660r193J7891L3455J4915m3869j27678k06260k48719k36969j73645
2090C69622688q1215R613P0725Q8730O7405K6093j1368k7580k0638o218p934m2267
2102C69688034j06087j71966k00577j62659n8593P4195J76316J94587J10131m7760
2112C69495621k14272l18336l15361k08207m2648J13831K02522J96991J09863j8005
2122C69001999j36795k09923k25334j96228j50032j12572r5634r3041q7089o1837j4686
2133C67618828L9520P6752P7247L8567k2087p6294j01395r2010o3248m0245m1580o8321
2145C67345734j03875j24626j14898p7095k8496Q774K1553J1711p897k3575k9907l2081
$$ y = [370741959, 370713081, 370685043, 370630569, 370549812, 370467834, 370417786, 370420761, 370472717, 370546722, 370608253, 370634460, 370625420, 370602760, 370593567, 370611458, 370644913, 370659828, 370615959, 370488281, 370282021, 370033302, 369796333, 369622688, 369541473, 369551086, 369621811, 369710541, 369777946, 369804039, 369792671, 369765091, 369744453, 369738235, 369730301, 369688034, 369581947, 369409981, 369209404, 369046745, 368988152, 369062347, 369238663, 369433250, 369543381, 369495621, 369281349, 368963013, 368647652, 368439445, 368396797, 368510628, 368713150, 368910141, 369020004, 369001999, 368865204, 368655281, 368429947, 368233719, 368083687, 367971115, 367875481, 367782440, 367695351, 367633514, 367618828, 367658348, 367735100, 367812347, 367850914, 367828827, 367752533, 367651138, 367559128, 367495880, 367455635, 367414055, 367345734, 367241859, 367117233, 367002335, 366925240, 366896744, 366905518, 366927071, 366938782, 366930885, 366907310, 366877403, 366845322]
2157C66845322l8758n4130p1984q0986p3204n2261l3302l3379n9090j00898j36528
2168C66110802j44692j18789p0610k4071J52m730l0098o0158q4495j03836j24665j49078
2180C65195732j66092j55029r8000L662J23864K18506K46315J89170O3706q6403k09160
2191C65326271k66609k48757j74064p6447R880O4125Q1940P1869M6921J6975j4381
2202C64837723m7989q5220j23520j54839j68457j56555j20545p4729m1428m2954q8958
2213C63732529j66931k44141k79541k42882j33858J2932J39427J89972J39084O409
2223C63153000j49346k58865k74734j95618o5994M7874R1248M8065n3711j59226k15911
2234C61966782j99013j21040k2126N1499O8321K5482n4626j34697j79558j70441j11542
$$ y = [366845322, 366806564, 366752434, 366680450, 366599464, 366526260, 366473999, 366440697, 366407318, 366348228, 366247330, 366110802, 365966110, 365847321, 365776711, 365752640, 365752792, 365748062, 365717964, 365657806, 365573311, 365469475, 365344810, 365195732, 365029640, 364874611, 364776611, 364780273, 364904137, 365122643, 365368958, 365558128, 365621834, 365535431, 365326271, 365059662, 364810905, 364636841, 364560394, 364570274, 364634399, 364716339, 364788208, 364835129, 364852104, 364837723, 364789734, 364704514, 364580994, 364426155, 364257698, 364101143, 363980598, 363905869, 363864441, 363821487, 363732529, 363565598, 363321457, 363041916, 362799034, 362665176, 362678108, 362817535, 363007507, 363146591, 363153000, 363003654, 362744789, 362470055, 362274437, 362208443, 362256317, 362347565, 362395630, 362341919, 362182693, 361966782, 361767769, 361646729, 361624603, 361676102, 361744423, 361769905, 361715279, 361580582, 361401024, 361230583, 361119041]
2245C61119041k7465M7149Q1787O3477J869p4997j33133j47514j13220m6616K2812
2256C60793190O5613O5117K4147l7308r0828j13640r8038n5618j1864P248j1901o3706
2268C60472412j26839j78947k09007k23275k37236k59056k75879k55508j61743J8959
2278C58563881K61955N06478O79817P29332O46972M71764K71149J09176K2087P019
2288C62269630L2425N8594O0349L7727J4229K0370P6180J78604L03574M20303N09300
2299C63981285N71022O19736O63414O85081O43387M94042K26020j09901m03900n22690
2309C66847496l68156P1373P00531J337852J771240J827660J436500O63910k93426
2318C73994980j164055j693764j748848j380996q13332l41568j87645l86620p72666
$$ y = [361119041, 361091576, 361138725, 361220512, 361283989, 361285858, 361210861, 361077728, 360930214, 360816994, 360770378, 360793190, 360858803, 360923920, 360948067, 360910759, 360819931, 360706291, 360608253, 360552635, 360540771, 360548019, 360536118, 360472412, 360345573, 360166626, 359957619, 359734344, 359497108, 359238052, 358962173, 358706665, 358544922, 358563881, 358825836, 359332314, 360012131, 360741463, 361388435, 361860199, 362131348, 362240524, 362262611, 362269630, 362302055, 362360649, 362420998, 362458725, 362472954, 362493324, 362569504, 362748108, 363051682, 363471985, 363981285, 364552307, 365172043, 365835457, 366520538, 367163925, 367657967, 367883987, 367774086, 367370186, 366847496, 366479340, 366550713, 367251244, 368589096, 370360336, 372187996, 373624496, 374288406, 373994980, 372830925, 371137161, 369388313, 368007317, 367193985, 366852417, 366664772, 366278152, 365505486]
2327C65505486j082497j117630q62045m81263k01301j55602l15361n57785q21686j219749
2337C58690567j987076l262481m836731o062088o052018m120178k30980M809265R575501
2346C46523781J2584686J2920914J0601616O508026J939201j955261m573021n920258
2354C78629684o381416o388588o194191n844536n305862m605713l880157l303299k971802
2363C33754120k838402k743988k522392k101288j534500r53675m80079j58730N1537
2372C20472603K36626M72412P90939J180572J606179K027473K404061K692413K847175
2381C34730453K832757K642135K307816J894607J477585J116409Q38585O39839M98238
2390C48978424L89938L01018K28806J77116J48430J39694J39733J32827J03455M4060
$$ y = [365505486, 364422989, 363305359, 362443314, 361962051, 361760750, 361605148, 361289787, 360732002, 359910316, 358690567, 356703491, 353441010, 348604279, 342542191, 336490173, 332369995, 332139015, 336948280, 346523781, 359108467, 372029381, 382630997, 389139023, 391078224, 389122963, 384549942, 378629684, 372248268, 365859680, 359665489, 353820953, 348515091, 343909378, 340029221, 336725922, 333754120, 330915718, 328171730, 325649338, 323548050, 322013550, 321059875, 320579796, 320421066, 320472603, 320709229, 321181641, 321972580, 323153152, 324759331, 326786804, 329190865, 331883278, 334730453, 337563210, 340205345, 342513161, 344407768, 345885353, 347001762, 347840347, 348480186, 348978424, 349368362, 349669380, 349898186, 350075302, 350223732, 350363426, 350503159, 350635986, 350739441, 350783501]
2400C50783501m0589j31797k02866k29454k02141j31073m4327K4758N1803L2311j7205
2411C49892921o8512r6206r0294o1417l4332l4027p2250j38398k04696k38266k17476
2422C48637047j44005m2572N0125J01776R8229M8713k0599p8964j05667r6550o5575
2433C48381958l6812l2425o3095j20888j81579k15874k03133j43699o2142L395J9684
2444C47345390k3422j06583j89933k33193k17666j54877p8468k6207j9188n4131j08223
2455C46133499j53580j71012j56250j17455o8703k4337L242M387k5101q0795j46713
2466C45197182j98059k12517j80741j14593m3068J335r53m6196j09330j57280j66702
2477C43969078j35078q1292l4408j9074m2076q9683j35193j52397j28975p3090j0452
$$ y = [350783501, 350742912, 350611115, 350408249, 350178795, 349976654, 349845581, 349801254, 349826012, 349877815, 349910126, 349892921, 349824409, 349728203, 349637909, 349576492, 349542160, 349508133, 349435883, 349297485, 349092789, 348854523, 348637047, 348493042, 348450470, 348500595, 348602371, 348700600, 348749313, 348728714, 348649750, 348544083, 348447533, 348381958, 348345146, 348312721, 348249626, 348128738, 347947159, 347731285, 347528152, 347384453, 347322311, 347325706, 347345390, 347321968, 347215385, 347025452, 346792259, 346574593, 346419716, 346341248, 346315041, 346295853, 346241722, 346133499, 345979919, 345808907, 345652657, 345535202, 345466499, 345442162, 345445404, 345449791, 345424690, 345343895, 345197182, 344999123, 344786606, 344605865, 344491272, 344448204, 344449539, 344448586, 344402390, 344293060, 344135780, 343969078, 343834000, 343752708, 343718300, 343699226, 343657150, 343567467, 343432274, 343279877, 343150902, 343077812, 343067360]
2488C43067360K8381K3079k5596r6894j60293j91689j86348j59836j37634j39389j66359
2499C41854782k00729k16522j95427j38665o6719r079J1559j0834o3553j23062j66664
2510C40675087j80054j61285j18027o4125j4648J6174J8654q812n8174j10970j45759
2521C39848061j44921j04255l5363L7308Q6479R2812N2872j9989j00937j62621j86272
2532C39363174j67083j16844n8518j8234j3504m6044j00364j49193j68076j46598r5215
2543C38283501m0779j3543l1204q8730j60942k13928k21634j77383r5406l242P1678
2554C37308388J11503J11199P6561J8730m9591j15853j68571j98822k02560j83564
2564C36707420j51558j18331r2125p3967n8213l8337j2703J2779K6512J8082j5869
$$ y = [343067360, 343095741, 343118820, 343093224, 342996330, 342836037, 342644348, 342458000, 342298164, 342160530, 342021141, 341854782, 341654053, 341437531, 341242104, 341103439, 341036720, 341027641, 341039200, 341028366, 340964813, 340841751, 340675087, 340495033, 340333748, 340215721, 340151596, 340136948, 340153122, 340171776, 340162964, 340104790, 339993820, 339848061, 339703140, 339598885, 339563522, 339600830, 339687309, 339780121, 339832993, 339813004, 339712067, 339549446, 339363174, 339196091, 339079247, 339020729, 339002495, 338988991, 338942947, 338842583, 338693390, 338525314, 338378716, 338283501, 338242722, 338229179, 338197975, 338109245, 337948303, 337734375, 337512741, 337335358, 337239952, 337236710, 337308388, 337419891, 337531090, 337607651, 337626381, 337576790, 337460937, 337292366, 337093544, 336890984, 336707420, 336555862, 336437531, 336345406, 336271439, 336213226, 336174889, 336162186, 336174965, 336201477, 336219559, 336203690]
2575C36203690o8055j22985j63994j78948j66130j33323r3766o0158l9062k9335k3804
2586C35124130j4534J107J8005K5406J3008k2278p4081j28289j70898j95084k03247
2597C34373245k02560j98937j90239j68609j27526o9541j0109K8762L0442n570o0463
2608C33398895j05514j16349q6288l1548J8235L4942O752n5046j23024j65863j64795
2619C32610397j21612n7831m005J3999j2893p3815j43051j91688k00386j68267j11503
2630C31539345n6343k5826k9983o0959r7733j16882j03951o1225o791L3837M1008J0719
2642C31065216m1466q8348j03836p7553k0599L8833P0038N5504R54o8779j23368j43432
2654C30563164j30806j04752q8615r4414j14975j29776j18599p6904j9951K4490L1739
$$ y = [336203690, 336135635, 336012650, 335848656, 335669708, 335503578, 335370255, 335276489, 335216331, 335177269, 335147934, 335124130, 335109596, 335110703, 335128708, 335154114, 335167122, 335144844, 335070763, 334942474, 334771576, 334576492, 334373245, 334170685, 333971748, 333781509, 333612900, 333485374, 333415833, 333405724, 333434486, 333464928, 333459358, 333398895, 333293381, 333177032, 333090744, 333059196, 333077431, 333112373, 333119125, 333064079, 332941055, 332775192, 332610397, 332488785, 332430954, 332426949, 332440948, 332428055, 332354240, 332211189, 332019501, 331819115, 331650848, 331539345, 331483002, 331457176, 331427193, 331366234, 331268501, 331151619, 331047668, 330986443, 330979652, 331013489, 331054497, 331065216, 331023750, 330935402, 330831566, 330754013, 330733414, 330772247, 330842285, 330897789, 330898743, 330829964, 330706596, 330563164, 330432358, 330327606, 330238991, 330144577, 330029602, 329899826, 329781227, 329704323, 329684372, 329708862, 329740601]
2665C29740601m540o8664j29662j57547j38016p8430l624N6191P9040O0043J0834m5357
2677C29320869q4495r1210o3552j3848L7422O9085O7482L1051k9182r4414j45111j67542
2689C28836555j59034j27297q7661n6305m5433n8442q8958j24970j53198j65329j60866
2700C27609062j45340j26381j08375r0943p1334m9439l1776k9641n1841r7351j50948
2711C26655693j88713j90048j50566q6747k9754r422l8682j06201j82266k34947k45705
2722C25192642k17171j69181j25580j02348j00899j12343j25542j35307j44730j60484
2732C23799057j86653k20223k50740k65655k55814k19612j62849r7466l6659Q545L1319
2743C22143250L0860J1254j8578m9171p2403q5488r0026r1553r5482j03684j13716
$$ y = [329740601, 329736061, 329667397, 329537735, 329380188, 329242172, 329163742, 329160118, 329216309, 329295349, 329355392, 329366226, 329320869, 329236374, 329145164, 329081612, 329067764, 329105186, 329174271, 329241753, 329272804, 329243622, 329149208, 329004097, 328836555, 328677521, 328550224, 328462563, 328406258, 328360825, 328302383, 328213425, 328088455, 327935257, 327769928, 327609062, 327463722, 327337341, 327228966, 327138023, 327066689, 327017250, 326985474, 326955833, 326903992, 326806641, 326655693, 326466980, 326276932, 326126366, 326039619, 326009865, 326000443, 325961761, 325855560, 325673294, 325438347, 325192642, 324975471, 324806290, 324680710, 324578362, 324477463, 324365120, 324239578, 324104271, 323959541, 323799057, 323612404, 323392181, 323141441, 322875786, 322619972, 322400360, 322237511, 322140045, 322103386, 322111931, 322143250, 322174110, 322185364, 322166786, 322117615, 322045212, 321959724, 321869698, 321778145, 321682663, 321578979, 321465263]
2754C21465263j19400j15165r9678p7210n6953m8409n6343p8239j04447j22413j21842
2765C20465164r9830o1989k0638R957J6861n990n8746j33362k15912k89287l36685
2776C19269543l47920l23066k74125k20432j81084j66053j72005j84422j87072j70575
2786C17042789j38969j07441r3956j09444j51271k03858k45933k59724k38552j89362
2796C15304279j29661q0586n8708p0209j08052j54838j89057j95217j69945j24931
2806C14023075q1901o2218p6790j19457j69163j98994j88484j32789m6940M0912R8610
2817C13085861J03340N0202m5643j54057k42424k88887k90966k66456k43206k44713
2827C11463051k77958l30372l78017m00582l92647l67298l46794l48854l77846m23851
$$ y = [321465263, 321345863, 321230698, 321131020, 321053810, 320996857, 320948448, 320892105, 320813866, 320709419, 320587006, 320465164, 320365334, 320303345, 320282707, 320292664, 320309525, 320303535, 320244789, 320111427, 319895515, 319606228, 319269543, 318921623, 318598557, 318324432, 318104000, 317922916, 317756863, 317584858, 317400436, 317213364, 317042789, 316903820, 316796379, 316702423, 316592979, 316441708, 316237850, 315991917, 315732193, 315493641, 315304279, 315174618, 315094032, 315035324, 314965115, 314857063, 314702225, 314513168, 314317951, 314148006, 314023075, 313941174, 313878956, 313802166, 313682709, 313513546, 313314552, 313126068, 312993279, 312946339, 312987251, 313085861, 313189201, 313239403, 313193760, 313039703, 312797279, 312508392, 312217426, 311950970, 311707764, 311463051, 311185093, 310854721, 310476704, 310076122, 309683475, 309316177, 308969383, 308620529, 308242683, 307818832]
2837C07818832m73194n18970n66578o28643p13577q15392r13296r79004r90657r39656
2847C00279865q32023o81267n01938l06759j10512O5346J94740K53659K33211J46370
2857B98740692K6016q8329j66149j97220j92051j71852j56479j56040j70174j93424
2867B97274990k20814k49996k79541l06415l25871l34053l31974l25871l25107l36609
2877B94238739l60832l92800m24938m52022m72298m86774m95949m99153m95854m89254
2887B89668865m86603m96654n23663n63068o01578o23436o19583n93796n61542n43328
2897B84055614n53932n95035o54583p11575p45067p42207p02744o39152n72491n26695
2907B77612133n21297n64537o49529p54242q47645r00287q94966q33817p37839o38752
$$ y = [307818832, 307345638, 306826668, 306260090, 305631447, 304917870, 304102478, 303189182, 302210178, 301219521, 300279865, 299447842, 298766575, 298264637, 297957878, 297847366, 297912712, 298107452, 298361111, 298594322, 298740692, 298766708, 298678379, 298512230, 298315010, 298122959, 297951107, 297794628, 297638588, 297468414, 297274990, 297054176, 296804180, 296524639, 296218224, 295892353, 295558300, 295226326, 294900455, 294575348, 294238739, 293877907, 293485107, 293060169, 292608147, 292135849, 291649075, 291153126, 290653973, 290158119, 289668865, 289182262, 288685608, 288161945, 287598877, 286997299, 286373863, 285754280, 285160484, 284598942, 284055614, 283501682, 282906647, 282252064, 281540489, 280795422, 280053215, 279350471, 278711319, 278138828, 277612133, 277090836, 276526299, 275876770, 275122528, 274274883, 273374596, 272479630, 271645813, 270907974, 270269222]
2917B70269222n65071n29976n26142n28908n08670m45443l38554k07787q4209M768
2927B66539230M8199N6763N6820P7533J37043K34452L51085M58699N31253N53418N24635
2938B69569130M57859L73516K93465K33440J98383J81580J67790J40666R1591K3995
2948B71731415m7779j05515j35193j32084r9353m3202L0174J14422J99013K66266K96478
2959B72074642K76756K12307J26954N5542K4795M0321Q2913J19762J23387Q4552J4878
2970B73236809o4678j35918j90983k28615k45781k30903j68171m8695J19438L08056
2980B72350559M78535N97248O49128O40869N94692N37510M90055M63486M59080M71401
2990B77732563M91638N10502N22270N28069N37243N62877O14720O90231P72324Q34617
$$ y = [270269222, 269704151, 269174175, 268648033, 268119125, 267610455, 267165012, 266826458, 266618671, 266534462, 266539230, 266587429, 266644192, 266701012, 266778545, 266915588, 267150040, 267501125, 267959824, 268491077, 269044495, 269569130, 270026989, 270400505, 270693970, 270927410, 271125793, 271307373, 271475163, 271615829, 271707420, 271731415, 271683636, 271578121, 271442928, 271310844, 271211491, 271168289, 271198463, 271312885, 271511898, 271778164, 272074642, 272351398, 272563705, 272690659, 272746201, 272770996, 272811317, 272894230, 273013992, 273137379, 273221931, 273236809, 273172131, 273036213, 272845230, 272616615, 272370834, 272139931, 271971760, 271923065, 272042503, 272350559, 272829094, 273426342, 274075470, 274716339, 275311031, 275848541, 276338596, 276802082, 277261162, 277732563, 278224201, 278734703, 279256973, 279785042, 280322285, 280885162, 281499882, 282190113, 282962437, 283797054]
3000B83797054Q53749Q20465P44171O46095N47485M58584L75729K89116J93844R7942
3010B88824234K0218j9608j4686K2926O4564P9403M9686k0256j05839j75266k06203
3021B88519173j96743j66092j43395j51653j95141k56729l07102l19596k84347k13127
3031B86285248j33667p7286o4506r8134j64241k40193l05195l47786l67717l72963
3041B84113560l74298l79429l91407m08211m25110m37431m42791m41818m39225m41608
3051B79932232m55303m83284n22747n64328n96046o08444n99575n76535n52368n38177
3061B74435425n36652n40428n36690n16414m81720m46606m30527m47235m97913n70870
3071B69430370o48384p17087p71884q14763q48083q69389q70876q46024p94658p25250
$$ y = [283797054, 284650803, 285471268, 286215439, 286861534, 287409019, 287867603, 288243332, 288532448, 288726292, 288824234, 288844452, 288824844, 288810158, 288833084, 288897648, 288977051, 289026737, 289006481, 288900642, 288725376, 288519173, 288322430, 288156338, 288012943, 287861290, 287666149, 287409420, 287102318, 286782722, 286498375, 286285248, 286151581, 286074295, 286009789, 285911655, 285747414, 285507221, 285202026, 284854240, 284486523, 284113560, 283739262, 283359833, 282968426, 282560215, 282135105, 281697674, 281254883, 280813065, 280373840, 279932232, 279476929, 278993645, 278470898, 277906570, 277310524, 276702080, 276102505, 275525970, 274973602, 274435425, 273898773, 273358345, 272821655, 272305241, 271823521, 271376915, 270946388, 270499153, 270001240, 269430370, 268781986, 268064899, 267293015, 266478252, 265630169, 264760780, 263889904, 263043880, 262249222, 261523972]
3081B61523972o50845n82104n23357m74434m35638m12026m11072m36268m81395n30110
3091B56586723n64880n76706n71098n62973n64270n73349n72758n40142m63619l53432
3101B51243496k40116j60446j38932j76067k48527l20492l59955l49789k91290k00958
3111B48756924j02616k0065L0041M3010K7886N188j125K6378R0065J76201K61803L27015
3123B49620705L62644L73974L73611L73039L77217L85360L96634M14981M47426M99420
3133B53625011N66292O31924O74438O75335O29998N49926M58775L82996L42788L45936
3143B58883419L86562M46873N01862N26714N04646M35181L36323K38819J72577J51825
3153B62584801J67007J89667J88446J48201P8373P877l3989l6316j4438j91k1992q6612
$$ y = [261523972, 260873127, 260291023, 259767666, 259293232, 258857594, 258445568, 258034496, 257598228, 257116833, 256586723, 256021843, 255445137, 254874039, 254311066, 253746796, 253173447, 252600689, 252060547, 251596928, 251243496, 251003380, 250842934, 250704002, 250527935, 250279408, 249958916, 249598961, 249249172, 248957882, 248756924, 248654308, 248634243, 248664284, 248707294, 248735180, 248740368, 248739243, 248765621, 248855686, 249031887, 249293690, 249620705, 249983349, 250357323, 250730934, 251103973, 251481190, 251866550, 252263184, 252678165, 253125591, 253625011, 254191303, 254823227, 255497665, 256173000, 256802998, 257352924, 257811699, 258194695, 258537483, 258883419, 259269981, 259716854, 260218716, 260745430, 261250076, 261685257, 262021580, 262260399, 262432976, 262584801, 262751808, 262941475, 263129921, 263278122, 263356495, 263364372, 263330383, 263294067, 263279629, 263279438, 263257446, 263170834]
3165B63170834j74923k55585l04298l19596l21350l34835l71284m16928m41665m18282
3175B59812088l43933k46620j73703j67179k40249l68767n02529n88474n97115n34229
3185B56049290m35734l49445l12596l36304m04796m85478n45654n66120n47676n06859
3195B51558628m67052m47941m57649m92211n38902n83191o15597o34289o44760o55365
3205B46021671o72226o94885p16343p26929p19337o94084o60458o32858o24619o41880
3215B39238052o80351p28207p70854p96853q01162p84245p49435p00646o41288n75657
3225B32009354n09606m50725m05236l76205l61710l56006l51963l44677l32547l17001
3235B28203678l01018k87342k76775k67696k56100k35729k00196j45549p2289J2589
$$ y = [263170834, 262995911, 262740326, 262436028, 262116432, 261795082, 261460247, 261088963, 260672035, 260230370, 259812088, 259468155, 259221535, 259047832, 258880653, 258640404, 258271637, 257769108, 257180634, 256583519, 256049290, 255613556, 255264111, 254951515, 254615211, 254210415, 253724937, 253179283, 252613163, 252065487, 251558628, 251091576, 250643635, 250185986, 249693775, 249154873, 248571682, 247956085, 247321796, 246677036, 246021671, 245349445, 244654560, 243938217, 243211288, 242491951, 241797867, 241137409, 240504551, 239879932, 239238052, 238557701, 237829494, 237058640, 236261787, 235460625, 234676380, 233926945, 233226299, 232585011, 232009354, 231499748, 231049023, 230643787, 230267582, 229905872, 229549866, 229197903, 228853226, 228520679, 228203678, 227902660, 227615318, 227338543, 227070847, 226814747, 226579018, 226378822, 226233273, 226160984, 226173573]
3245B26173573R8247J73016K30331K70538L01629L35807L84064M52786N41191O41174
3255B29602356P39689Q21934Q76464R00345R02405R02634R24968R85947J084156J196251
3265B38937149J283894J310157J257401J138191R92432Q69922Q08773Q18177Q75644
3274B48291740R39637R69600R45874Q76178P90348P22924O96735P11021P43809P62329
3284B56450195P40891O72970N76191M85839M38519M54578N26142O17657O80065O73619
3294B62316666N88073M50955L16086K38590K46754L26004M25968M84314M59347L50475
3304B66203232J97086N6706k5559l8090m387L4295M5089J9703k3765n5619n3615j6346
3316B66338730L8261Q2855R5826P0553J6460m6673r7790j22757j17912r2258o4049
$$ y = [226173573, 226271820, 226444836, 226675167, 226945705, 227247334, 227583141, 227967205, 228419991, 228961182, 229602356, 230342045, 231163979, 232040443, 232940788, 233843193, 234745827, 235670795, 236656742, 237740898, 238937149, 240221043, 241531200, 242788601, 243926792, 244919224, 245789146, 246597919, 247416096, 248291740, 249231377, 250200977, 251146851, 252023029, 252813377, 253536301, 254233036, 254944057, 255687866, 256450195, 257191086, 257864056, 258440247, 258926086, 259364605, 259819183, 260345325, 260962982, 261643047, 262316666, 262904739, 263355694, 263671780, 263910370, 264157124, 264483128, 264909096, 265393410, 265852757, 266203232, 266400318, 266457024, 266431465, 266393375, 266388988, 266423283, 266468372, 266488075, 266464310, 266408691, 266355076, 266338730, 266376991, 266459846, 266555672, 266626225, 266642685, 266596012, 266498222, 266375465, 266257553, 266165295, 266101246]
3327B66101246n4970q2474j50737k46888l43685m08497m16889l63884k67143j61438
3337B63604641q5087o4678j04580j85585k72083l28484l33328k89765k24590j75094
3347B61541367j72863k26345l17631m09909m66079m67015m20322l55186l06893k98157
3357B58100967l30524l85304m35752m60854m53739m20971l75843l29914k87628k46601
3367B54373837k01169j46598q1807j1043N6915J09425J31454J10283M0169p2155k05784
3378B54103527l28770m08611m23088l70045k68840j52970n8460j0910j8845p4711j60408
3389B51827869k53696l33481l81393l85342l42998k66438j82037j22052j10435j49632
3399B49300365k16274k72407k86332k50282j84898j24989r5749r5825r8190p1049l548
$$ y = [266101246, 266046276, 265963802, 265813065, 265566177, 265222492, 264813995, 264397106, 264033222, 263766079, 263604641, 263519554, 263454876, 263350296, 263164711, 262892628, 262564144, 262230816, 261941051, 261716461, 261541367, 261368504, 261142159, 260824528, 260414619, 259948540, 259481525, 259061203, 258706017, 258399124, 258100967, 257770443, 257385139, 256949387, 256488533, 256034794, 255613823, 255237980, 254908066, 254620438, 254373837, 254172668, 254026070, 253944263, 253933220, 253990135, 254099560, 254231014, 254341297, 254381466, 254309311, 254103527, 253774757, 253366146, 252943058, 252573013, 252304173, 252151203, 252092743, 252081833, 252062988, 251988277, 251827869, 251574173, 251240692, 250859299, 250473957, 250130959, 249864521, 249682484, 249560432, 249449997, 249300365, 249084091, 248811684, 248525352, 248275070, 248090172, 247965183, 247869434, 247773609, 247675419, 247604370, 247600822]
3410B47600822Q0414J30558R8839l0994k29531m32338n68619n91927m96139l13072
3420B45248013r5940J00269K32487K77653K35347J28823J793r4757j21193o8856L2864
3431B45876503J29738J71528J41620O7940O352M921O9236J53981J86786J12744o6910
3442B46854439k86999m49734m74319l41168j00631J55182L40499M15764L96805L33004
3452B46842842K71721K32010K02789J62163R8934K4071l6640n9796l7651J9856R2945
3463B47813244J61896K12097K33784K24227J91307J57910J56917K13929L25451M47959
3473B50138721N12696M62684K90165N1842j56784k51617k05899o1245J03169K21329
3483B51105061K75974K95639L19309L58105L87001L70483L02239K23350J97964K63462
$$ y = [247600822, 247681236, 247811794, 247910633, 247879639, 247650108, 247217770, 246649151, 246057224, 245561085, 245248013, 245152073, 245252342, 245484829, 245762482, 245997829, 246126652, 246128445, 246033688, 245912495, 245843639, 245876503, 246006241, 246177769, 246319389, 246387329, 246393681, 246398602, 246467838, 246621819, 246808605, 246921349, 246854439, 246567440, 246117706, 245643387, 245302219, 245201588, 245356770, 245697269, 246113033, 246509838, 246842842, 247114563, 247346573, 247549362, 247711525, 247810459, 247834530, 247797890, 247738094, 247700443, 247720299, 247813244, 247975140, 248187237, 248421021, 248645248, 248836555, 248994465, 249151382, 249365311, 249690762, 250138721, 250651417, 251114101, 251404266, 251456108, 251299324, 251047707, 250841808, 250780563, 250883732, 251105061, 251381035, 251676674, 251995983, 252354088, 252741089, 253111572, 253413811, 253637161, 253835125, 254098587]
3493B54098587L90530M89196M62342K74276j4400k73933l80001k90318p1068J42498
3503B54827709K28386J49632k7657j77212j88121k4624K62737N73063Q11806R31491
3513B57367210R38359Q68244P54127O07319M19941J81790j00995l98292o59561q26569
3523B59151573q47931o95057l76567N1193M88605Q17261R45301Q56514O34613M39415
3533B61464920M32224O82011J103649J475086J538945J145916L56445n61276j253833
3542B66384087j461487j153355n36899O6948M08077M36706L03307K34642L76911P14207
3552B65773144J108570J423416J625195J779346J943398K044849J857777J126213k29493
3561B78452415j964626l539982m346142m004955k574844n37911J422768K728291L124809
$$ y = [254098587, 254489117, 254978313, 255440655, 255714931, 255700531, 255426598, 255046597, 254756279, 254685211, 254827709, 255056095, 255205727, 255178070, 255000858, 254812737, 254788113, 255050850, 255623913, 256435719, 257367210, 258305569, 259173813, 259927940, 260535259, 260955200, 261136990, 261035995, 260637703, 259978142, 259151573, 258303642, 257608585, 257232018, 257283211, 257771816, 258589077, 259534378, 260390892, 261025505, 261464920, 261897144, 262579155, 263682804, 265157890, 266696835, 267842751, 268199196, 267637920, 266384087, 264922600, 263769245, 263232346, 263299294, 263707371, 264144077, 264447384, 264682026, 265058937, 265773144, 266881714, 268305130, 269930325, 271709671, 273653069, 275697918, 277555695, 278681908, 278452415, 276487789, 272947807, 268601665, 264596710, 262021866, 261483955, 262906723, 265635014, 268759823]
3570B68759823K725296J885147J018257M51336L58810P54662J493206K278614K715759
3579B82440910K440968J308308m68216k327328l570328l689003k631035q46367R27678
3588B73585587K027816K165337J508293N22366l06092o90479n98469j57871M76265
3597B78532753J186275J864205K355823K463494K035770J091328j24951j210346j775036
3606B86419315j617603q13103L24097J362724J900235J683521O97708p79877k195339
3615B86981678k854137k193394j10436K833214N503941O630573N414867J997109k503643
3624C01699772o449318q421021p850151n207786j684418J429405L300858L785438L288975
3633B83891754K439881J796970J709499K297917L447151M769134N613728N235844L145198
$$ y = [268759823, 271485119, 273370266, 274388523, 274839859, 275198669, 275953331, 277446537, 279725151, 282440910, 284881878, 286190186, 285721970, 283394642, 279824314, 276135311, 273504276, 272657909, 273585587, 275613403, 277778740, 279287033, 279809399, 279503307, 278812828, 278214359, 278056488, 278532753, 279719028, 281583233, 283939056, 286402550, 288438320, 289529648, 289404697, 288194351, 286419315, 284801712, 283988609, 284312706, 285675430, 287575665, 289259186, 289956894, 289177017, 286981678, 284127541, 281934147, 281823711, 284656925, 290160866, 296791439, 302206306, 304203415, 301699772, 295250454, 286829433, 278979282, 273771496, 272087078, 273516483, 276817341, 280602779, 283891754, 286331635, 288128605, 289838104, 292136021, 295583172, 300352306, 305966034, 311201878, 314347076]
3642C14347076n20019m851437q435363r961854q872375n666294j671906J605950L191566
3651B79165344L012104J773415M73347j23654K35729J339951K752209M039764M872990
3660B97541199N027218M386558L005943J174431o28471j930924k526741k614631k684708
3669C00749874l189011m200153n292625n749302m971390k837086K11525L386383N914040
3678B84022255P305508P410659O299000M132729J158333k198868n273800p274628p574463
3687B88006725o028766l109131K58026L073730M656697M836445L886280K299556N81723
3696B98461285q39997j613311j479149l81852J384182L135109L990746L272266R04866
3705C06834145k425480n500851p101402o565399m080525n65452K775859M968300N594158
$$ y = [314347076, 313827057, 308975620, 300540257, 290578403, 281706028, 276039734, 274367828, 275973778, 279165344, 282177448, 283950863, 284424210, 284300556, 284536285, 285876236, 288628445, 292668209, 297541199, 302568417, 306954975, 309960918, 311135349, 310506878, 308575954, 306049213, 303434582, 300749874, 297560863, 293360710, 288068085, 282318783, 277347393, 274510307, 274721832, 278108215, 284022255, 291327763, 298738422, 305037422, 309170151, 310328484, 308129616, 302855816, 295581188, 288006725, 281977959, 278868828, 279126854, 282200584, 286857281, 291693726, 295580006, 297879562, 298461285, 297621288, 296007977, 294528828, 294146976, 295531158, 298666267, 302657013, 305929279, 306834145, 304408665, 298907814, 291806412, 285241013, 281160488, 280595036, 283370895, 288339195, 293933353]
3714B93933353M816304L157959J214008n48687j842270k507191k452621j653481k06146
3723B93911228J604748L292866M252128L939343K112179r67179m475994p215214q030357
3732B88423748o332092k472019K264251O127281P664738O406975L096714o95400l384972
3741C01099224m175129l391456k162800j656914k338505l704700m645138m183312k124614
3750B72716656P92179L317890M414177L823128K154751M78286l07941O0692J156292
3759B88606110K186317K464085J746597K88239j352883k593307l036137k556610j289082
3768B84463329M23241K097702L219147L399181K545128R46388q08983k078972k466335
3777B91739826j998787j080742k39162J82877J96151J01223K45419P73582J536789
$$ y = [293933353, 298749657, 301907616, 303121624, 302572937, 300730667, 298223476, 295770855, 294117374, 293911228, 295515976, 298808842, 303060970, 307000313, 309112492, 308145313, 303669319, 296454105, 288423748, 282091656, 279619637, 281883888, 288011169, 295675907, 302082882, 305179596, 304484196, 301099224, 296924095, 293532639, 291369839, 289712925, 287374420, 283669720, 279024582, 274841270, 272716656, 273508835, 276826725, 281240902, 285064030, 287218781, 287697067, 287389126, 287449818, 288606110, 290792427, 293256512, 295003109, 295291348, 293938465, 291345158, 288309021, 285752411, 284463329, 284886570, 286984272, 290203419, 293602600, 296147728, 297094116, 296285133, 294206161, 291739826, 289741039, 288660297, 288421135, 288604012, 288800163, 288901386, 289146805, 289920387, 291457176]
3786B91457176K211132K525845K431297K089348J705627J342621Q65193O5918j120930
3795C03573227k490311l630333m155426l946285l219662k369289j682968j138401m35658
3804B80504894P44534K432060M230442N469666N563049M347954K188701k21786k227154
3813C03032360l505669m121646m330559m300919l965759l105183j590137M03766K385903
3822B80902157L771629M198170L727398K796860J944046J478424J310062J041088K59838
3831C01429672j151867k895260m391212n091515m769058l605556k028923m15306J137924
3840B78218899K800102M749432O834163Q404084Q486862O278038J701927m289322r913940
3849C03270245j3226529j2961216r133110l080272L092575P401542Q777714P393933
$$ y = [291457176, 293668308, 296194153, 298625450, 300714798, 302420425, 303763046, 304628239, 304694157, 303573227, 301082916, 297452583, 293297157, 289350872, 286131210, 283761921, 282078953, 280940552, 280504894, 281249428, 283681488, 287911930, 293381596, 298944645, 303292599, 305481300, 305259514, 303032360, 299526691, 295405045, 291074486, 286773567, 282807808, 279702625, 278112488, 278516254, 280902157, 284673786, 288871956, 292599354, 295396214, 297340260, 298818684, 300128746, 301169834, 301429672, 300277805, 297382545, 292991333, 287899818, 283130760, 279525204, 277496281, 277080975, 278218899, 281019001, 285768433, 292602596, 301006680, 309493542, 315771580, 317473507, 313184185, 303270245, 290043716, 277082500, 267949390, 264869118, 267961693, 275363235, 284140949, 291534882]
3857B91534882M415798J345501o85654j336536j033345n82962o65760j476898k667637
3866B88847389l577575l607045k530899o09321J539058L218270L944606L610230K466106
3875B93300819R59874m65470j509762k051887k102604j748390j125546m23774J31702
3884B84964962L52345J96323j58539l57952m4346R17397K297153L544197M020806L310203
3894B99042549J432972j139984l682499n501804o178437n658836m194317k195282q6136
3903B71838226J788559L196507M015980M218025L848152L008060J842804N35317o98395
3912B93593235j631584k080517j975460j414204o44130L5591M13456M64782L41378
3921B87102547K51236L05156M31176M26406J11828n10063j209507j633510j503945
$$ y = [291534882, 295950680, 297296181, 296610527, 295273991, 294240646, 293657684, 292991924, 291515026, 288847389, 285269814, 281662769, 279131870, 278522549, 280061607, 283279877, 287224483, 290834713, 293300819, 294260693, 293795223, 292285461, 290233574, 288130970, 286382580, 285257034, 284833260, 284964962, 285317307, 285513630, 285355091, 284997139, 284952793, 285870190, 288167343, 291711540, 295732346, 299042549, 300475521, 299335537, 295653038, 290151234, 283972797, 278313961, 274119644, 271924362, 271838226, 273626785, 276823292, 280839272, 285057297, 288905449, 291913509, 293756313, 294291630, 293593235, 291961651, 289881134, 287905674, 286491470, 285847340, 285882931, 286296387, 286761169, 287102547, 287353783, 287658939, 288090115, 288516521, 288628349, 288118286, 286908779, 285275269, 283771324]
3930B83771324p85389K76947J273289J827793J769905J190548L71475l63006p88079
3939B88544807q53366o69003m23431k80686l03116m32930n38272m96407k67754P8717
3949B84358559M07009N91697N84851M28123K10591Q182j50776k70729l50170l60718
3959B85456619k66037o8359J66912L35121L56007K26974K0867j71128l03306l93315
3969B85360355m78839n57709n72624m61045k29568K1877J63364J40667L1205j2894
3979B83404789R6664K83356L43552J16672l47042p80029q96282o53515l50132m21162
3989B80796871j045685j883087k228794j600647l98445j06506k721463r583492k0258694
3998B40970058l2226600m1715813
$$ y = [283771324, 282985935, 283262882, 284536171, 286363964, 288133869, 289324417, 289695892, 289332886, 288544807, 287691441, 287022438, 286599007, 286318321, 286015205, 285582275, 285044003, 284547596, 284279842, 284358559, 284765568, 285357265, 285942116, 286370239, 286580830, 286589012, 286438236, 286167507, 285817337, 285456619, 285190582, 285122223, 285289135, 285624256, 285980263, 286207237, 286228104, 286056976, 285753670, 285360355, 284881516, 284323807, 283751183, 283290138, 283060570, 283082447, 283245811, 283386478, 283417683, 283404789, 283501453, 283784809, 284128361, 284245033, 283897991, 283117962, 282221680, 281568165, 281218033, 280796871, 279751186, 277868099, 275639305, 274038658, 273640213, 273533707, 270812244, 261228752, 240970058, 208743458, 167027645]
4000A67027645
$$ y = [167027645]
##END=$$ End of the data block
