##TITLE=Clor. $$ Begin of the data block
##JCAMP-DX=5.00 $$ ACD/SpecManager v 10.08
##SPECTROMETER/DATA SYSTEM=Alpha
##DATE=03 Dec 2014 11:51:24
##DATA TYPE=INFRARED SPECTRUM
##DATA CLASS=XYDATA
##ORIGIN=
##OWNER=
##NPOINTS=1765
##FIRSTX=399.76428223
##LASTX=3997.64306641
##MAXX=3997.64306641
##MINX=399.76428223
##MAXY=1.00275791
##MINY=0.75488901
##XFACTOR=1.0000000000
##YFACTOR=0.000000010000000
##FIRSTY=0.99833846
##DELTAX=2.03961372
##XUNITS=1/CM
##YUNITS=ARBITRARY UNITS
##XYDATA=(X++(Y..Y))
399.8I9833846p3123p4524p9834q9073j02216k29323k29317J62315j79898m65245k66247
422.2I8207361J21146K41697L7557j78171j52897L5053J29902K1452j54173k08080
442.6I8100847j20324l8654r4240k64776m18699m52322l55524j67840P7808L45593
463I6611869N59175O21772M97240K59310L9381q0240j18422j45001j95843k47621k66481
485.4I7535139k58797k62469k97743l45153l76689l98672m51052n64039p21645q67766
505.8I2991114r39525q90785o96075l57461P6288N03689Q08114R25946Q87621P89600
526.2I4098526P19548P00163O96504O66512N99539N13017M25774L43698K67512K03681
546.6I9234474J60074J34289J12677Q3905N0199K2680P176k038j4234l2186n2989p7098
$$ y = [99833846, 99760723, 99686199, 99606365, 99517292, 99415076, 99185753, 98956436, 99118751, 98938853, 98473608, 98207361, 98328507, 98570204, 98607761, 98429590, 98276693, 98311746, 98441648, 98463100, 98308927, 98100847, 97980523, 97941869, 97847629, 97582853, 97164154, 96711832, 96356308, 96188468, 96266276, 96611869, 97171044, 97792816, 98290056, 98549366, 98588747, 98508507, 98390085, 98245084, 98049241, 97801620, 97535139, 97276342, 97013873, 96716130, 96370977, 95994288, 95595616, 95144564, 94580525, 93858880, 92991114, 92051589, 91160804, 90464729, 90107268, 90183556, 90687245, 91495359, 92421305, 93308926, 94098526, 94818074, 95518237, 96214741, 96881253, 97480792, 97993809, 98419583, 98763281, 99030793, 99234474, 99394548, 99528837, 99641514, 99725419, 99775618, 99798298, 99805474, 99803436, 99789202, 99757016, 99704027, 99626929]
571.1I9626929j11241j60801k20841k78711l25305l61252l90684m10617m09680l77917
591.5I6579880l15571k32202j38998m5747L5429Q7410R4921N4181k3848j21445k21884
613.9I5752126l08013l55971l37106k34353o0261J42569L21185M38804M87232M80956
634.3I6327168M42946L94892L52925L25442L11029L00550K84988K62058K35802K09337
654.7I9447137J80084J42532R3425L1501m7785j50770k72668l82751m28230l63117
675.1I8249358j84637N3537K64704L74818L58682K45589R6328k8986r4766r8610o5642
697.5I9170375l3176l0583o3718j12903j45924j38396q8000j4353N3305R2315R6899
720I8785841P8339N6207M5615M8972N7405O0296N4359M5157L9381L7759L5429K9397
$$ y = [99626929, 99515688, 99354887, 99134046, 98855335, 98530030, 98168778, 97778094, 97367477, 96957797, 96579880, 96264309, 96032107, 95893109, 95847362, 95882791, 95970201, 96065122, 96119303, 96095455, 95974010, 95752126, 95444113, 95088142, 94751036, 94516683, 94456422, 94598991, 94920176, 95358980, 95846212, 96327168, 96770114, 97165006, 97517931, 97843373, 98154402, 98454952, 98739940, 99001998, 99237800, 99447137, 99627221, 99769753, 99863178, 99894679, 99846894, 99696124, 99423456, 99040705, 98612475, 98249358, 98064721, 98118258, 98382962, 98757780, 99116462, 99362051, 99458379, 99429393, 99334627, 99236017, 99170375, 99137199, 99106616, 99042898, 98929995, 98784071, 98645675, 98557675, 98543322, 98596627, 98688942, 98785841, 98864180, 98920387, 98966002, 99014974, 99072379, 99132675, 99187034, 99232191, 99271572, 99309331, 99344760, 99374157]
744.5I9374157K3723K6017L9274N8561P6330R0098J00989J02907P4744j0824j61624
766.9I9794352l42655m77809m84752l26044m1890K60806M61996M92853L68917J70660
787.3I9876434j1844j29074j82157j95599j85138j51205r7138m3493j7768l0822p2837
809.7I8759359j39022k55501m62258p51287j017028j086724q35299l02058K97588O96522
830.1I4904292P52496N39571K81001J78545K74951M49860N36376M50808K36678P522
850.5I8612100j44130j93691j67632r9409o998R6751J85883K23606J84495P4923o8540
873I8697358k01273k96032l56460m13364n06681o57940q43918r89372r95505p98285
893.4I2638528m23497N913L26932M28384L17121J11931l1274j3966J49990L49628M47053
$$ y = [99374157, 99397880, 99423897, 99463171, 99521732, 99598062, 99688160, 99789149, 99892056, 99966800, 99955976, 99794352, 99451697, 98973888, 98489136, 98163092, 98121202, 98382008, 98844004, 99336857, 99705774, 99876434, 99864590, 99735516, 99553359, 99357760, 99172622, 99021417, 98924279, 98880786, 98863018, 98832196, 98759359, 98620337, 98364836, 97902578, 97151291, 96134263, 95047539, 94212240, 93910182, 94207770, 94904292, 95656788, 96196359, 96477360, 96655905, 96930856, 97380716, 97917092, 98367900, 98604578, 98612100, 98467970, 98274279, 98106647, 98007238, 98000240, 98096991, 98282874, 98506480, 98690975, 98765898, 98697358, 98496085, 98200053, 97843593, 97430229, 96923548, 96265608, 95421690, 94432318, 93436813, 92638528, 92215031, 92220944, 92547876, 92976260, 93293381, 93405312, 93374038, 93360072, 93510062, 93859690, 94306743]
915.8I4306743L58635J02002k16288m61864n46527m69178k99996j22917J7762J25647
936.2I2794019K15363K70528K42835R6459j42503l82275n18560n04005l77524k31373
956.6I1462964j45912j43814j94258k52235k95770l32129l76588m26406m51296m05670
977H8438886k52407J5050L62634P22492J014537J174855J178461J044959Q25173N77807
997.4I5102447L48377J60087J6719q8436j64663k19757k59411k88379l11458l34174
1017.8I3961352l62527m01777m54855n20987n95432o70141p35158p78764p88790p55358
1038.2H7897563o76578n63866m41307l36176k64502k21264j84018j28650m6110N2464
1058.6H5087556J45465K16269K61462K86669K96378K88117K57033K04795J44118R3693
$$ y = [94306743, 94665378, 94767380, 94551092, 94089228, 93542701, 93073523, 92773527, 92650610, 92668372, 92794019, 93009382, 93279910, 93522745, 93619204, 93476701, 93094426, 92575866, 92071861, 91694337, 91462964, 91317052, 91173238, 90978980, 90726745, 90430975, 90098846, 89722258, 89295852, 88844556, 88438886, 88186479, 88201529, 88564163, 89286655, 90301192, 91476047, 92654508, 93699467, 94524640, 95102447, 95450824, 95610911, 95627630, 95539194, 95374531, 95154774, 94895363, 94606984, 94295526, 93961352, 93598825, 93197048, 92742193, 92221206, 91625774, 90955633, 90220475, 89441711, 88652921, 87897563, 87220985, 86657119, 86215812, 85879636, 85615134, 85393870, 85209852, 85081202, 85035092, 85087556, 85233021, 85449290, 85710752, 85997421, 86293799, 86581916, 86838949, 87043744, 87187862, 87281555]
1079H7281555O7025O3527O8033N9384K2626m1610j15270j69450j77228j25438k1577
1101.4H6911577J08105K26879K98494K98226K20639Q2355q1944k30593l28999l60328
1121.8H7144411l27492k47282j40917k7579P7456J62190K18177K43396K44718K37638
1142.2H7584716K39778K61008K95365L20143L05617K31003R7770o8396k28531l47983
1162.6H8690490m09586m16213l83729l30978k73061k18797j71131j28907q8829m8226
1183H6221033p116L2156O7044R6833J23054J47772J72156J95980K17491K33424K38478
1205.4H7738305K26850J95157J45549Q5991K6977k3025n9712q1515q6051o8242k3031
1227.9H8077253M9317J37520K19017K66934K61503K00409J00600r948j05482j72567
$$ y = [87281555, 87348580, 87412107, 87480140, 87539524, 87562150, 87520540, 87405270, 87235820, 87058592, 86933154, 86911577, 87019682, 87246561, 87545055, 87843281, 88063920, 88146275, 88064331, 87833738, 87504739, 87144411, 86816919, 86569637, 86428720, 86401141, 86478597, 86640787, 86858964, 87102360, 87347078, 87584716, 87824494, 88085502, 88380867, 88701010, 89006627, 89237630, 89335400, 89267004, 89038473, 88690490, 88280904, 87864691, 87480962, 87149984, 86876923, 86658126, 86486995, 86358088, 86269259, 86221033, 86213917, 86246073, 86313117, 86409950, 86533004, 86680776, 86852932, 87048912, 87266403, 87499827, 87738305, 87965155, 88160312, 88305861, 88391852, 88418829, 88395804, 88336092, 88254577, 88168526, 88100284, 88077253, 88126570, 88264090, 88483107, 88750041, 89011544, 89211953, 89312553, 89302605, 89197123, 89024556]
1248.2H9024556k10750k25240k19346j92832j46252q6481k7609J4389K8789J5384j5664
1270.7H7958944m8137o6906o4564m4209j7559K158P706J359p712r841r18J6081L3522
1297.2H7759924M3750M3148L3766K2339J7143K4074M4954P8249J21283J71507K25115
1319.6H8585252K75564L14563L35717L36934L18360K77573K08479J07700j5432j35708
1340I0609002k22510k57623k46656k12705j77217j44517j03247m2785L1048R5666J26111
1362.5H9454567J10692N4795k7752j23441k19673k99424l39699l20995k40159j14512
1382.9H7934399K7275J59299K65205L33965L54749L21466K44963J59186J08230J20181
1403.3I0028918J87313K70218L23921L25340K81913K19196J61540J21921J04207J08230
$$ y = [89024556, 88813806, 88588566, 88369220, 88176388, 88030136, 87943655, 87916046, 87930435, 87959224, 87974608, 87958944, 87910807, 87843901, 87779337, 87735128, 87717569, 87719727, 87727433, 87728792, 87721080, 87711239, 87710321, 87726402, 87759924, 87803674, 87846822, 87880588, 87902927, 87920070, 87944144, 87989098, 88067347, 88188630, 88360137, 88585252, 88860816, 89175379, 89511096, 89848030, 90166390, 90443963, 90652442, 90760142, 90744710, 90609002, 90386492, 90128869, 89882213, 89669508, 89492291, 89347774, 89244527, 89201742, 89232790, 89328456, 89454567, 89565259, 89620054, 89592302, 89468861, 89249188, 88949764, 88610065, 88289070, 88048911, 87934399, 87961674, 88120973, 88386178, 88720143, 89074892, 89396358, 89641321, 89800507, 89908737, 90028918, 90216231, 90486449, 90810370, 91135710, 91417623, 91636819, 91798359, 91920280, 92024487, 92132717]
1423.7I2132717J29295J53243J56671J16933K6041j01894k36690l46262m09293m20058
1444.1I1200703l85660l20708k41882j62810q8751j3215P9763K07126L74049N64951
1464.5I1213566P43592Q64804Q93634Q22348O76357N04005L56174K65229K34937K44802
1484.9I6819448K64216K68108K46805K07120J65713J38366J30033J31703J27142J05155
1505.2I8603809O9451L7080K5928M0883O9690R1594R2393P2933M6664K9195K9194M5991
1529.7I9254805P2092R6774J07991R5267N5116l475n9223q7661p5555l0511K1911N3232
1554.2I9500763M9258J7595j9377m0401l8665k3526j1772j5980l8069p1103j05214
1576.6I9203509j32704j50168j58316j60914j63394j70511j83970k02131k22063k41977
$$ y = [92132717, 92262012, 92415255, 92571926, 92688859, 92714900, 92613006, 92376316, 92030054, 91620761, 91200703, 90815043, 90494335, 90252453, 90089643, 90000892, 89987677, 90067440, 90274566, 90648615, 91213566, 91957158, 92821962, 93715596, 94537944, 95214301, 95718306, 96074480, 96339709, 96574646, 96819448, 97083664, 97351772, 97598577, 97805697, 97971410, 98109776, 98239809, 98371512, 98498654, 98603809, 98673260, 98710340, 98736268, 98777151, 98846841, 98938435, 99030828, 99103761, 99150425, 99179620, 99208814, 99254805, 99326897, 99423671, 99531662, 99626929, 99682045, 99678570, 99619347, 99531686, 99456131, 99425620, 99447531, 99500763, 99550021, 99567616, 99548239, 99507838, 99469173, 99445647, 99433875, 99417895, 99379826, 99308723, 99203509, 99070805, 98920637, 98762321, 98601407, 98438013, 98267502, 98083532, 97881401, 97659338, 97417361]
1597I7417361k61540k80702k98077l12346l24273l36617l50785l63559l68410l60859
1617.4I4160193l42923l20816k98047k70862k31999j80107j24049p6813m4185j8459
1637.8I2251933J4424O1512J14691J56248J71518J58620J27602R3186O7889N9086O7473
1660.3I3344182Q5664R9945R7811P6884M5729J1658l2878j08528k26128l60984m52357
1682.7I2580998m38756l05962j07724O2102J27721P4458n2738j89441k93148l56281
1703.1I1101229l90923m08315m12936m08744m02445l96520l80742l35902k50674j36745
1723.5H7577283k6410M6658O8116M9031J4776j1724k0498j3918o50J1200J8609K5505
1748H7737978M1008P3701J24925J85937K42567K82740L01826L00920K82044K45285
$$ y = [97417361, 97155821, 96875119, 96577042, 96264696, 95940423, 95603806, 95253021, 94889462, 94521052, 94160193, 93817270, 93496454, 93198407, 92927545, 92695546, 92515439, 92391390, 92314577, 92270392, 92251933, 92266357, 92327869, 92442560, 92598808, 92770326, 92928946, 93056548, 93149734, 93217623, 93276709, 93344182, 93429846, 93529791, 93627602, 93704486, 93750215, 93761873, 93728995, 93620467, 93394339, 93033355, 92580998, 92142242, 91836280, 91728556, 91790658, 91918379, 91992837, 91940099, 91750658, 91457510, 91101229, 90710306, 90301991, 89889055, 89480311, 89077866, 88681346, 88300604, 87964702, 87714028, 87577283, 87550873, 87597531, 87665647, 87714678, 87729454, 87717730, 87697232, 87683314, 87682664, 87693864, 87712473, 87737978, 87778986, 87852687, 87977612, 88163549, 88406116, 88688856, 88990682, 89291602, 89573646, 89818931]
1768.4H9818931J90448J20402M1741l7867j12271j76454k24745k50322k47961k17485
1788.8H8904417j64795r9898l3182K7138P6151J13094J40971J65659J93405K28727
1809.2H9551687K73991L29542L93534M60297N19216N57202N64635N41365M98318M52501
1829.6I4142288M18621M02177L97676L92544L74359L37249K85119K29090J81181J48046
1850I7308350J28936J18441J11764J06895J03319R8860Q9372P1924M8221K4664Q541
1872.4I8219287L374P308J5777K4730L2389L8624M3136M5347M4644M1479L7443L4035
1896.9I8587573L1972L0809K9326K6691K3323K0724K0218K1160K0695J4960J836j7482
1921.3I8811805l9029n7655o8558o7848n2881k3550J5909N7035Q9598J06335J06025
$$ y = [89818931, 90009379, 90129781, 90171522, 90133655, 90021384, 89844930, 89620185, 89369863, 89121902, 88904417, 88739622, 88639724, 88606542, 88633680, 88709831, 88822925, 88963896, 89129555, 89322960, 89551687, 89825678, 90155220, 90548754, 91009051, 91528267, 92085469, 92650104, 93191469, 93689787, 94142288, 94560909, 94963086, 95360762, 95753306, 96127665, 96464914, 96750033, 96979123, 97160304, 97308350, 97437286, 97555727, 97667491, 97774386, 97877705, 97976565, 98065937, 98137861, 98186082, 98210746, 98219287, 98222661, 98229969, 98245746, 98270476, 98302865, 98341489, 98384625, 98429972, 98474616, 98516095, 98553538, 98587573, 98619545, 98650354, 98679680, 98706371, 98729694, 98750418, 98770636, 98791796, 98812491, 98827451, 98829287, 98811805, 98772776, 98715121, 98646563, 98578715, 98525834, 98502284, 98518193, 98575228, 98664826, 98771161, 98877186]
1943.8I8877186R3239P5001N6982M1771L0028K1655J6659J4496J3882J3405J2809J3525
1968.3I9280638J7648K5869L6436M5759N0616N0098M5693L9523L2765K5076J5902N865
1992.7I9671888l016q845j1098j1015j0234r710r477r328r686j1069j3584j6444j8269
2019.2I9530113j8204j6093j2457q053l707l46J049%l272p665j1635j3656j2731q762
2047.8I9414581k629M101R942J4228J7077J8948K0063K0236J9419J7708J5051J0573
2072.3I9579298L273p284j9348k9623l4863l3527k6805j7339p867j02N621R918J3870
2098.8I9435222J8513K3991K9385L2890L2771K8187K0128J0705K885p93J121Q178J8269
2125.3I9661452K8240L5215L7682L5768L0613K3842J6958J1045O657L612J371j43o14
$$ y = [98877186, 98970425, 99045426, 99102408, 99144179, 99174207, 99195862, 99212521, 99227017, 99240899, 99254304, 99267113, 99280638, 99298286, 99324155, 99360591, 99406350, 99456966, 99507064, 99552757, 99592280, 99625045, 99650121, 99666023, 99671888, 99668872, 99660027, 99648929, 99637914, 99627680, 99617970, 99608493, 99599165, 99589479, 99578410, 99564826, 99548382, 99530113, 99511909, 99495816, 99483359, 99475306, 99471599, 99471253, 99472302, 99472302, 99469030, 99461365, 99449730, 99436074, 99423343, 99414581, 99411952, 99416053, 99425995, 99440223, 99457300, 99476248, 99496311, 99516547, 99535966, 99553674, 99568725, 99579298, 99582571, 99575287, 99555939, 99526316, 99491453, 99457926, 99431121, 99413782, 99405915, 99405813, 99411434, 99421352, 99435222, 99453735, 99477726, 99507111, 99540001, 99572772, 99600959, 99621087, 99631792, 99634677, 99633884, 99635005, 99643183, 99661452, 99689692, 99724907, 99762589, 99798357, 99828970, 99852812, 99869770, 99880815, 99887472, 99891084, 99892455, 99892312, 99891698]
2151.8I9891698O50L684P498J0615J1915J1212Q857N079k81p075j4478k0879k4796
2178.3I9883699k5403k2751j7584j0913l970J979O455R686J2583J5634J8591K0438
2202.8I9888444K0289J7566J2421N061l958j3548k2328k8771l2049l2032k9057k3669
2227.3I9758369j6475q178M29Q643J6010K1773K4891K4629K0957J5312R555N031J764
2253.8I9882710j061m065p361j0789j4197j7423j9717j9795j6910j1223m173K695Q726
2280.3I9767417J3983J8579K1952K3115K1416J6981J0699L761k563p301r787j0187
2304.8I9868065r584r251j0085j2034j4597j7083j9068k0265k0296j9228j7542j6087
2329.3I9682945j5432j5276j4335j1194n037L255J0758J3376P462p409k7006m3637
$$ y = [99891698, 99892348, 99896032, 99903530, 99914145, 99926060, 99937272, 99946129, 99951208, 99950927, 99943852, 99929374, 99908495, 99883699, 99858296, 99835545, 99817961, 99807048, 99803078, 99805057, 99811512, 99821198, 99833781, 99849415, 99868006, 99888444, 99908733, 99926299, 99938720, 99943781, 99939823, 99926275, 99903947, 99875176, 99843127, 99811095, 99782038, 99758369, 99741894, 99733716, 99734145, 99742788, 99758798, 99780571, 99805462, 99830091, 99851048, 99866360, 99875915, 99880946, 99882710, 99881649, 99877584, 99870223, 99859434, 99845237, 99827814, 99808097, 99788302, 99771392, 99760169, 99755996, 99758691, 99767417, 99781400, 99799979, 99821931, 99845046, 99866462, 99883443, 99894142, 99897903, 99895340, 99888039, 99878252, 99868065, 99858481, 99849230, 99839145, 99827111, 99812514, 99795431, 99776363, 99756098, 99735802, 99716574, 99699032, 99682945, 99667513, 99652237, 99637902, 99626708, 99621671, 99624926, 99635684, 99649060, 99656522, 99649113, 99622107, 99578470]
2353.7I9578470m9639m1479k1809K432K3854L8063M4638M5920M4786M3101M1198L8398
2378.2I9787933L3795K7109J9073J1045M053j657o330r775j1444j0735p886l993k63
2404.7I9830925K814N156O449N549J442n692j4037k0718k3479k1559j5616p254J675
2431.2I9745655R465J4764J6934J6201J3452R859O622M900N412P897J1069J3083J2475
2457.8I9887788Q911K867m905j3620k2221k8675l0965k8276k1744j4353q911o610o849
2484.3I9712437p820q183p326n621l892k938l094m142n389o026n877n227m709m804
2512.8I9637389n549o610p427p337n615j979L308R400J5426K0480K3657K3901K0039
2539.3I9719083J1856M53j1713k1815k7668k8009k2530j1873K181J6940K9242L7127
$$ y = [99578470, 99528831, 99487352, 99465543, 99467975, 99491829, 99529892, 99574530, 99620450, 99665236, 99708337, 99749535, 99787933, 99821728, 99848837, 99867910, 99878955, 99883008, 99881351, 99875021, 99865246, 99853802, 99843067, 99835181, 99831188, 99830925, 99833739, 99838895, 99845344, 99850893, 99852335, 99846643, 99832606, 99811888, 99788409, 99766850, 99751234, 99743980, 99745655, 99755120, 99769884, 99786818, 99803019, 99816471, 99826330, 99832952, 99837852, 99843264, 99851161, 99862230, 99875313, 99887788, 99896699, 99899566, 99894661, 99881041, 99858820, 99830145, 99799180, 99770904, 99749160, 99734807, 99725896, 99719286, 99712437, 99704617, 99696434, 99689108, 99683487, 99679595, 99676657, 99673563, 99669421, 99664032, 99658006, 99652129, 99646902, 99642193, 99637389, 99631840, 99625230, 99617803, 99610466, 99604851, 99602872, 99606180, 99615580, 99631006, 99651486, 99675143, 99699044, 99719083, 99730939, 99731392, 99719679, 99697864, 99670196, 99642187, 99619657, 99607784, 99609965, 99626905, 99656147, 99693274]
2563.8I9693274M0031L8916L5232L0363K5338K0921J7619J5402J3876J2714J1938J1582
2588.3I9967206J1354J0425Q059M410L22l189n805p910r882j1730j3095j3739j3870
2614.8I9922556j4049j4979j7202k0665k4372k6256k4044j6928o586L308Q964Q625
2639.3I9778372K950n584j4598k2250k7335k8860k6185j9264q964K890J4073K2066
2663.7I9667311K5075K2650J5968P254j514r388j6266k1982k5713k6465k3925j8954
2688.2I9594051j2875p063k253Q94K068J180j144m035p046j0055j2964j5169j5551
2714.7I9510038j3727j0622p909o676o670o586n490l546j585o92j216l099n478o825
2743.3I9429917n144J139J1849K4563L5489M1288M0513L4064K4456J4740P254K659
$$ y = [99693274, 99733305, 99772221, 99807453, 99837816, 99863154, 99884075, 99901694, 99917096, 99930972, 99943686, 99955624, 99967206, 99978560, 99988985, 99997044, 100001454, 100001776, 99998587, 99992782, 99984872, 99974990, 99963260, 99950165, 99936426, 99922556, 99908507, 99893528, 99876326, 99855661, 99831289, 99805033, 99780989, 99764061, 99757475, 99760783, 99769747, 99778372, 99781322, 99775738, 99761140, 99738890, 99711555, 99682695, 99656510, 99637246, 99628282, 99631172, 99645245, 99667311, 99692386, 99715036, 99731004, 99738258, 99736744, 99727356, 99711090, 99689108, 99663395, 99636930, 99613005, 99594051, 99581176, 99574113, 99571860, 99572754, 99574822, 99576002, 99574858, 99570823, 99563777, 99553722, 99540758, 99525589, 99510038, 99496311, 99485689, 99477780, 99471104, 99464434, 99457848, 99452358, 99448812, 99447227, 99446535, 99445319, 99442220, 99436742, 99429917, 99424773, 99425912, 99437761, 99462324, 99497813, 99539101, 99579614, 99613678, 99638134, 99652874, 99660128, 99662787]
2767.8I9662787m8k801o962j2410j8096k3317k8515l4314l9852m2510l9816l1853k2524
2794.3I9359769j7327j9616k8754m0340m9585n3853n3334n0086m6056m2791m1371m2671
2818.8I8873985m7004n3347n8794n9592n3490m2009l1078k8974m2533p3660j17999
2841.2I8265505j66351k06798k27761k20895j84572j27154o6919k7674k9677p9799
2861.6I6927905j66219k60783l28904l42923k93482j93149p0744M1079J18637J53852
2882I5585269J52242J25146Q2898L2359k0957p0601j09172j31113j35165j25188j08790
2904.4I5276928r5499r4741j13505j54102k12920k81203l47989m02970m37831m46022
2924.8I2690146m22108l61890k64203j32913K0772J77730L13311M03333M32718M01670
$$ y = [99662787, 99662739, 99659938, 99652976, 99640566, 99622470, 99599153, 99570638, 99536324, 99496472, 99453962, 99414146, 99382293, 99359769, 99342442, 99322826, 99294072, 99253732, 99204147, 99150294, 99096960, 99046874, 99000818, 98958027, 98916656, 98873985, 98826981, 98773634, 98714840, 98655248, 98601758, 98559749, 98528671, 98499697, 98457164, 98383504, 98265505, 98099154, 97892356, 97664595, 97443700, 97259128, 97131974, 97065055, 97037381, 97007704, 96927905, 96761686, 96500903, 96171999, 95829076, 95535594, 95342445, 95271701, 95312780, 95431417, 95585269, 95737511, 95862657, 95945555, 95977914, 95956957, 95886356, 95777184, 95646071, 95510906, 95385718, 95276928, 95181429, 95086688, 94973183, 94819081, 94606161, 94324958, 93976969, 93573999, 93136168, 92690146, 92268038, 91906148, 91641945, 91509032, 91529804, 91707534, 92020845, 92424178, 92856896, 93258566]
2945.2I3258566L25203K25371J21045K1517p1698j58602k35540k95234l30770l38691
2965.6I2521167l19511k75844k12527j37865o3956l642L4946N1761N3138M6944L9369
2988I1733980L5858M3971P1984J22595J87528K49213K92576L17043L38053L74598M31513
3010.5I4198912M91721N26064N13232M54468L71510K91127K29227J86366J54519J27357
3030.9I7544503J04010Q6153P3504O2818N1057L8010K6029J7250J1456P009L130Q70
3055.3I8025799K032O640J1558J2445O622l838j3024j5003q428J651O873J556j3233
3081.9I8021650l0648m2963m6522m2736l5131k6232j7077q720l070j597l159l887l51
3108.4I7759557P105J3452J2196l6k0588m2540n8138o3085n7817m6402l4356k6191
$$ y = [93258566, 93583769, 93809140, 93930185, 93951702, 93880004, 93721402, 93485862, 93190628, 92859858, 92521167, 92201656, 91925812, 91713285, 91575420, 91511464, 91507822, 91542768, 91594529, 91647667, 91694611, 91733980, 91769838, 91813809, 91885793, 92008388, 92195916, 92445129, 92737705, 93054748, 93392801, 93767399, 94198912, 94690633, 95216697, 95729929, 96184397, 96555907, 96847034, 97076261, 97262627, 97417146, 97544503, 97648513, 97734666, 97808170, 97870988, 97922045, 97960055, 97986084, 98003334, 98014790, 98021799, 98024929, 98025799, 98027831, 98034471, 98046029, 98058474, 98065096, 98061258, 98048234, 98033231, 98024803, 98026454, 98033327, 98034883, 98021650, 97991002, 97948039, 97901517, 97858781, 97823650, 97797418, 97780341, 97771621, 97768551, 97766954, 97763795, 97759908, 97759557, 97766662, 97780114, 97792310, 97792274, 97771686, 97729146, 97671008, 97607923, 97550106, 97503704, 97469348, 97443157]
3132.8I7443157k4724l0326m0931n2041n8460n7000m9329m1920m2039n2458o8724q2141
3157.3I6843064q6296q1599p4136p0137p1257p4732p6980p7271p7218p8189p9859q0990
3181.8I5914400q1331q2123q4526q8191r1707r3866r4741r4766r3919r2029q9425q7279
3206.3I4840497q6701q7667q9466r1875r5486j00381j04636j04689r8515q8036p9053
3228.7I3813992p7230q3828r4736j02961j03813r7692q9371q4097q4102q7297q9973
3251.1I2818892q9949q8174q6784q5944q3148p5800o5255n7381n8508p0024q6873j01567
3275.6I1869485j09380j10620j07730j02275r4873q7965q6790r5630j12921j30337
3296I0830964j38652j35303j27113j25146j36310j58608j83153k00361k05332k00009
$$ y = [97443157, 97418433, 97388107, 97347176, 97295135, 97236675, 97179675, 97130346, 97088426, 97046387, 96993929, 96925205, 96843064, 96756768, 96675169, 96601033, 96530896, 96459639, 96384907, 96307927, 96230656, 96153438, 96075249, 95995390, 95914400, 95833069, 95750946, 95666420, 95578229, 95486522, 95392656, 95297915, 95203149, 95109230, 95017201, 94927776, 94840497, 94753796, 94666129, 94576663, 94484788, 94389302, 94288921, 94184285, 94079596, 93981081, 93893045, 93813992, 93736762, 93652934, 93558198, 93455237, 93351424, 93253732, 93164361, 93080264, 92996162, 92908865, 92818892, 92728943, 92640769, 92553985, 92468041, 92384893, 92309093, 92243838, 92186457, 92127949, 92057925, 91971052, 91869485, 91760105, 91649485, 91541755, 91439480, 91344607, 91256642, 91169852, 91074222, 90961301, 90830964, 90692312, 90557009, 90429896, 90304750, 90168440, 90009832, 89826679, 89626318, 89420986, 89220977]
3316.4H9220977j90932j86091j90741k04444k21288k33186k35575k30587k25454k27189
3336.8H7075490k37602k52515k65545k72918k75570k77579k82585k90406k96736k95937
3357.2H4328097k85745k69979k57116k54929k64514k79689k91461k94333k88952k79063
3377.6H1562316k66814k51370k31517k09290j90037j78701j76179j79291j84238j89179
3398G9505700j94174j98537j99926j96004j87165j77318j71113j70290j72985j76876
3418.4G7661312j83785k00385k33102k79444l22986l38084l03232k15626r5767K1762
3438.8G5510663J05989J44380J45447J29235J14024J08409J11937J20783J32209J45364
3459.2G6768440J59192J70553J75720J72800J63961J54852J51033J54197J60968J65576
$$ y = [89220977, 89030045, 88843954, 88653213, 88448769, 88227481, 87994295, 87758720, 87528133, 87302679, 87075490, 86837888, 86585373, 86319828, 86046910, 85771340, 85493761, 85211176, 84920770, 84624034, 84328097, 84042352, 83772373, 83515257, 83260328, 82995814, 82716125, 82424664, 82130331, 81841379, 81562316, 81295502, 81044132, 80812615, 80603325, 80413288, 80234587, 80058408, 79879117, 79694879, 79505700, 79311526, 79112989, 78913063, 78717059, 78529894, 78352576, 78181463, 78011173, 77838188, 77661312, 77477527, 77277142, 77044040, 76764596, 76441610, 76103526, 75800294, 75584668, 75488901, 75510663, 75616652, 75761032, 75906479, 76035714, 76149738, 76258147, 76370084, 76490867, 76623076, 76768440, 76927632, 77098185, 77273905, 77446705, 77610666, 77765518, 77916551, 78070748, 78231716, 78397292]
3479.6G8397292J64288J58376J52653J51700J56563J64843J72824J77467J77389J72603
3500H0045998J64747J57011J52546J52308J54584J56880J59216J64169J73652J85448
3520.4H1666559J93471J93071J85263J76406J73146J77842J88470K01672K15084K26688
3540.8H3597672K33430K32368K23548K11334K01881J99496K05285K18659K39033K64198
3561.1H5826904K88170L01820K98715K80541K57683K43044K44552K61592K86878L10909
3581.5H8600808L25543L26914L16518L01081K88671K83480K83337K82699K78300K72512
3601.9I1559863K70885K76548K87592K98489L03405K98119K80803K53946K26587K12240
3622.3I4268477K20478K46983K72340K73120K38788J81050J27565J05441J25760J78420
$$ y = [78397292, 78561580, 78719956, 78872609, 79024309, 79180872, 79345715, 79518539, 79696006, 79873395, 80045998, 80210745, 80367756, 80520302, 80672610, 80827194, 80984074, 81143290, 81307459, 81481111, 81666559, 81860030, 82053101, 82238364, 82414770, 82587916, 82765758, 82954228, 83155900, 83370984, 83597672, 83831102, 84063470, 84287018, 84498352, 84700233, 84899729, 85105014, 85323673, 85562706, 85826904, 86115074, 86416894, 86715609, 86996150, 87253833, 87496877, 87741429, 88003021, 88289899, 88600808, 88926351, 89253265, 89569783, 89870864, 90159535, 90443015, 90726352, 91009051, 91287351, 91559863, 91830748, 92107296, 92394888, 92693377, 92996782, 93294901, 93575704, 93829650, 94056237, 94268477, 94488955, 94735938, 95008278, 95281398, 95520186, 95701236, 95828801, 95934242, 96060002, 96238422]
3642.7I6238422K38538K78235K78788K38866J74671J11408O8992N2142N2297N9796
3663.1I7792155P4243J02091J43045J79953J85328J43057O6609l750k7042Q434P5370
3685.6I8739493J26576J28699Q4316K5756j2082j6171J985K3693M0519N5319O9153
3708I9267256P2664N4014J5181k3430l9536k9963j2923p259j0258q65L3439P5084Q7589
3734.5I9480993N1134j2594n5069m2504J4860P3331R3687O9493K3508j7202l9852m4352
3759I9595433l3932j1981J3286K8461K4510O830p951p045P164K0242K0027N460j5551
3785.5I9644953l4356m5228m3589k5910N811M0585O2412O0040L3617o265m4012o3639
3810I9584419n3406j3054L9870P4577O6269J5729m8303q9669q9235n2732O32N2053
$$ y = [96238422, 96476960, 96755195, 97033983, 97272849, 97447520, 97558928, 97627920, 97680062, 97732359, 97792155, 97866398, 97968489, 98111534, 98291487, 98476815, 98619872, 98686481, 98682731, 98655689, 98664123, 98739493, 98866069, 98994768, 99079084, 99104840, 99092758, 99076587, 99078572, 99102265, 99142784, 99198103, 99267256, 99339920, 99393934, 99409115, 99385685, 99346149, 99316186, 99303263, 99296004, 99285746, 99284881, 99318320, 99393404, 99480993, 99532127, 99519533, 99464464, 99421960, 99436820, 99510151, 99603838, 99673331, 99696839, 99679637, 99639785, 99595433, 99561501, 99549520, 99562806, 99591267, 99615777, 99622607, 99614656, 99607611, 99614775, 99635017, 99655044, 99660504, 99644953, 99610597, 99565369, 99521780, 99495870, 99501681, 99542266, 99604678, 99664718, 99698335, 99692070, 99648058, 99584419, 99531013, 99517959, 99557829, 99632406, 99698675, 99714404, 99666101, 99576432, 99487197, 99434465, 99435097, 99487150]
3834.4I9487150Q5330Q3738L6884m2963j15949j36614r0110p284N8764P4607M8334
3856.9I9481887J3524k724L433K0451L5649M0436K8735J216k7436l3599n943L8207
3881.4I9593836O3986N0670J0484k6333m2677m4215l9732k2483J8233O9105R1219N8365
3905.8I9780458o586m6182k6518K5225N0658K5385j6629k7514l242J7661J0520l10
3930.3I9782926K2852P0405Q5777L6216l5292n4478j0658K1243k5272j08928j13987
3952.7I9670804N066J45370J63513N6040k1874M4751J49405O2716k56634n22804m06111
3975.2I9090242L0619L08579J02091j84202L41714J63453Q0133K5558k44K712L4428
3997.6I9995083
$$ y = [99487150, 99572480, 99656218, 99693102, 99650139, 99534190, 99397576, 99307466, 99300182, 99358946, 99433553, 99481887, 99495411, 99492687, 99496120, 99516571, 99552220, 99592656, 99621391, 99622607, 99595171, 99561572, 99555629, 99593836, 99657822, 99708492, 99718976, 99692643, 99649966, 99605751, 99566019, 99543536, 99561769, 99630874, 99722093, 99780458, 99773872, 99727690, 99701172, 99726397, 99777055, 99802440, 99785811, 99758297, 99755055, 99772716, 99783236, 99782926, 99805778, 99876183, 99961960, 99998176, 99962884, 99908406, 99897748, 99918991, 99893719, 99784791, 99670804, 99675870, 99821240, 99984753, 100040793, 100018919, 100063670, 100213075, 100275791, 100019157, 99496353, 99090242, 99120861, 99429440, 99531531, 99347329, 99689043, 99852496, 99932629, 99958187, 99957943, 99960655, 99995083]
##END=$$ End of the data block
