##TITLE=CLEAN 5828 $$ Begin of the data block
##JCAMP-DX=5.00 $$ ACD/SpecManager v 10.08
##SPECTROMETER/DATA SYSTEM=Alpha
##DATE=12 May 2016 08:35:42
##DATA TYPE=INFRARED SPECTRUM
##DATA CLASS=XYDATA
##ORIGIN=
##OWNER=
##NPOINTS=1667
##FIRSTX=599.64648438
##LASTX=3997.64306641
##MAXX=3997.64306641
##MINX=599.64648438
##MAXY=1.09757555
##MINY=0.25579923
##XFACTOR=1.0000000000
##YFACTOR=0.000000010000000
##FIRSTY=0.96292448
##DELTAX=2.03961372
##XUNITS=1/CM
##YUNITS=ARBITRARY UNITS
##XYDATA=(X++(Y..Y))
599.6I6292448J73008J54716J74082J98358K05248J97483J75470J56116J54007J42800
$$ 96292448 96465456 96620172 96794254 96992612 97197860 97395343 97570813 97726929 97880936 98023736
620I8023736J22893J21498R7198N4246P6413J43623J60432J17255O7526N2446P4065
$$ 98023736 98146629 98268127 98365325 98419571 98495984 98639607 98800039 98917294 98984820 99037266 99111331
642.5I9111331Q8548O5327N0908P1234Q9764J02508J02806Q9556P2790M2480K5081
$$ 99111331 99199879 99265206 99316114 99387348 99477112 99579620 99682426 99771982 99844772 99887252 99912333
664.9I9912333P0090J38121Q2863L1900N8627J03021J03390P0477N3549O7102Q1969
$$ 99912333 99982423 100120544 100203407 100235307 100293934 100396955 100500345 100570822 100624371 100691473 100773442
687.3A00773442Q5175P6485N7590M1675K2674m232k7597m6683p3468j14036j76251
$$ 100773442 100858617 100935102 100992692 101034367 101057041 101052809 101025212 100978529 100905061 100791025 100614774
709.8A00614774k54369l28719m14837n24562n19610k18671K27660N02288N43231M76634
$$ 100614774 100360405 100031686 99616849 99092287 98572677 98354006 98581666 99083954 99627185 100103819
730.2A00103819L89576L08943K40135J91117J74057J58703J32072J21606J13296Q0312
$$ 100103819 100493395 100802338 101042473 101233590 101407647 101566350 101698422 101820028 101933324 102013636
750.6A02013636M6801K6524J2255R072r155n2095q1873r0158j04236j25277j28675
$$ 102013636 102060437 102086961 102099216 102108288 102099133 102047038 101965165 101875007 101770771 101645494 101516819
773A01516819j12224q4304n1928l7456n3477q3065j01733j03569j11425j49620k10034
$$ 101516819 101404595 101320291 101268363 101230907 101177430 101094365 100992632 100889063 100777638 100628018 100417984
795.4A00417984k70355l02184l02869k91711k74682k72852k65610k31654k18737k63119
$$ 100417984 100147629 99845445 99542576 99250865 98976183 98703331 98437721 98206067 97987330 97724211
815.8I7724211l37803l84796m22364n02497o04582o79571p08198o99711o67214o14924
$$ 97724211 97386408 97001612 96579248 96076751 95472169 94792598 94084400 93384689 92717475 92102551
836.2I2102551n43123m61113l70151k56264j21773Q291R4217J21135J16229R5254N7507
$$ 92102551 91559428 91098315 90728164 90471900 90350127 90358418 90452635 90573770 90689999 90785253 90842760
858.7I0842760J6713l70K7967R1433J46669J51629Q9937k1630j47367k48909k81846
$$ 90842760 90859473 90859103 90887070 90978503 91125172 91276801 91366738 91345108 91197741 90948832 90666986
881.1I0666986k01774j6874K14058M20761N23961N09965M21214K75350R9724p3069
$$ 90666986 90465212 90448338 90662396 91083157 91607118 92117083 92538297 92813647 92913371 92840302
901.5I2840302k35111l81231n05447n94282o43194o65003o62041o36256n99706n48672
$$ 92840302 92605191 92223960 91718513 91124231 90481037 89816034 89153993 88517737 87918031 87369359
921.9H7369359m73106l97259l54576l60775m12822m77207n25337n59926n78362n58430
$$ 87369359 86896253 86498994 86144418 85783643 85370821 84893614 84368277 83808351 83229989 82671559
942.3H2671559m80664l23743p6758K50154O20246R61477J202667J298528J240027J059801
$$ 82671559 82190895 81867152 81790394 82040548 82660794 83622271 84824938 86123466 87363493 88423294
962.7H8423294Q16637N64796L22604Q0073j55789l49056m79496n45269n55134n45466
$$ 88423294 89239931 89804727 90127331 90207404 90051615 89702559 89223063 88677794 88122660 87577194
983.1H7577194n47957n46998m82685l13806o7496J91742L92169M88138M88513M15558
$$ 87577194 87029237 86482239 85999554 85685748 85618252 85809994 86202163 86690301 87178814 87594372
1003.5H7594372K76077P4577j68985m12035o29300q15940r75841j138002j302755j451873
$$ 87594372 87870449 87945026 87776041 87364006 86734706 85918766 84942925 83804923 82502168 81050295
1023.9H1050295j577682j629948j564563j399964j161891q71867n77253l35360j78462
$$ 81050295 79472613 77842665 76278102 74878138 73716247 72844380 72267127 71931767 71753305
1042.2G1753305j05268j20109k26372m05139o40881r17977j208031j485700j714516
$$ 71753305 71648037 71527928 71301556 70896417 70255536 69337559 68129528 66643828 64929312
1060.6F4929312j842939j863295j806307j714921j639217j620680j676083j789296
$$ 64929312 63086373 61223078 59416771 57701850 56062633 54441953 52765870 50976574
1076.9E0976574j927328k048281k130198k175689k191156k167627k103949k003506
$$ 50976574 49049246 47000965 44870767 42695078 40503922 38336295 36232346 34228840
1093.2C4228840j854145j652500j409468j150653q97044o65074m59144k96387j82408
$$ 34228840 32374695 30722195 29312727 28162074 27265030 26599956 26140812 25844425 25662017
1111.6B5662017q2094K5496J37571K59721M00937N39726O57338P38039P64302P33238
$$ 25662017 25579923 25605419 25742990 26002711 26403648 26943374 27600712 28338751 29103053 29836291
1132B9836291O71446O27193O28692P01034Q81082J193747J640666K226641K951423
$$ 29836291 30507737 31134930 31763622 32464656 33345738 34539485 36180151 38406792 41358215
1150.3D1358215L765300M561248N208075N568868N552781N180418M570192L871048
$$ 41358215 45123515 49684763 54892838 60461706 66014487 71194905 75765097 79636145
1166.7G9636145L198295K623141K174998J826709J532906J288671J093715R32777P99233
$$ 79636145 82834440 85457581 87632579 89459288 90992194 92280865 93374580 94307357 95106590
1185I5106590O82694N75017M74763L81744L02506K26432J45709P8184J7446o3831j75339
$$ 95106590 95789284 96364301 96839064 97220808 97523314 97749746 97895455 97973639 97991085 97927254 97751915
1207.5I7751915l04508m14932m66454m60285m34625m25154m60314n53394o92558q63200
$$ 97751915 97447407 97032475 96566021 96105736 95671111 95245957 94785643 94232249 93539691 92676491
1227.9I2676491j060123j262760j424646j519871j562399j556706j480633j307368
$$ 92676491 91616368 90353608 88928962 87409091 85846692 84289986 82809353 81501985
1244.2H1501985j011336n81736n7637M84097R70453J340973J533389J506537J284415
$$ 81501985 80490649 79908913 79851276 80335373 81305826 82646799 84180188 85686725 86971140
1262.5H6971140R59998O08915K55609p6395l76857o35618q26293r24808r34308q77899
$$ 86971140 87931138 88540053 88795662 88719267 88342410 87706792 86880499 85955691 85021383 84143484
1282.9H4143484p80613o79248n90319n20724m59903l69233k20853P51L13687O96594
$$ 84143484 83362871 82683623 82093304 81572580 81112677 80743444 80522591 80523342 80837029 81533623
1303.3H1533623J079857J372635J467622J355672J096058P13628K35504k49857m94021
$$ 81533623 82613480 83986115 85453737 86809409 87905467 88619095 88854599 88604742 88110721
1321.7H8110721l03084J65582N77134P75224P90745O52349L09509l50320j484436k929986
$$ 88110721 87807637 87973219 88550353 89325577 90116322 90768671 91078180 90727860 89243424 86313438
1342.1H6313438m102093m218357k874387q66365P74938J726448K096904K022469J814705
$$ 86313438 82211345 77992988 75118601 74252236 75027174 76753622 78850526 80872995 82687700
1360.4H2687700J683879J437562J110608R32139P41446M72408K35004J89107N14424
$$ 82687700 84371579 85809141 86919749 87851888 88593334 89065742 89300746 89489853 90004277
1378.8I0004277R86153J169014J039225Q94600P17598M61603L14372K75785K37709
$$ 90004277 90990430 92159444 93198669 94093269 94810867 95272470 95586842 95862627 96100336
1397.1I6100336K18636K02459J67823J82009J85317J51008J23018R1165M3804K8306
$$ 96100336 96318972 96521431 96689254 96871263 97056580 97207588 97330606 97421771 97465575 97493881
1417.5I7493881N3096r328j42384l07327n44501q93563j201695j399535j781249j946813
$$ 97493881 97546977 97537649 97395265 97087938 96543437 95649874 94448179 93048644 91267395 89320582
1437.9H9320582j485365j228518j284379j547032j949662k055508j886821j653212
$$ 89320582 87835217 86606699 85322320 83775288 81825626 79770118 77883297 76230085
1454.3G6230085j370734q73733m78440l62975j08689N27269J389539K661491M342019
$$ 76230085 74859351 73985618 73507178 73144203 73035514 73562783 74952322 77613813 81955832
1472.6H1955832M290688K876872J947022J406407J108831R48060J035314J480991J861930
$$ 81955832 86246520 89123392 91070414 92476821 93585652 94533712 95569026 97050017 98911947
1491I8911947J593846J283777J163184Q41332M94897K94638J98066J99497K10691J72138
$$ 98911947 100505793 101789570 102952754 103794086 104288983 104583621 104781687 104981184 105191875 105364013
1511.4A05364013J25551R2375Q7691O9403O6364P2861N5992Q1349Q8000M1640J8799
$$ 105364013 105489564 105581939 105669630 105739033 105805397 105878258 105934250 106015599 106103599 106145239 106164038
1533.8A06164038M2963K2197l0434l9232l064L0744J1003k6917l2115l3450o1214r2351
$$ 106164038 106207001 106229198 106198764 106159532 106156468 106187212 106198215 106171298 106139183 106105733 106044519 105952168
1558.3A05952168l4130P856k7180n1343o1787n8448l4153l3796l3486k623K0492K8170
$$ 105952168 105918038 105925894 105898714 105847371 105785584 105727136 105692983 105659187 105625701 105623078 105643570 105671740
1582.8A05671740K8204J9694J0919P272L517j3006l8218n9271q4365j10650j38747
$$ 105671740 105699944 105719638 105730557 105737829 105741346 105728340 105690122 105630851 105546486 105435836 105297089
1605.2A05297089j73152k05338k24590k41816k98166l65532l21436l09980l61609l38900
$$ 105297089 105123937 104918599 104694009 104452193 104154027 103788495 103467059 103157079 102795470 102456570
1625.6A02456570l07584k98250k69377k57468k41185j46782p6604o0594n3096J0968
$$ 102456570 102148986 101850736 101581359 101323891 101082706 100935924 100859320 100798726 100745630 100756598
1646A00756598J27255J33026K23768M81403M03464L27694L64768M25458M21274L23129
$$ 100756598 100883853 101016879 101240647 101722050 102125514 102453208 102817976 103243434 103664708 103987837
1666.4A03987837L13163L69489L24786L02720K97641K21444J63769J56391K26784K19309
$$ 103987837 104301000 104670489 104995275 105297995 105595636 105817080 105980849 106137240 106364024 106583333
1686.8A06583333J63901J51753J13404P3564N7447P2396R2995O5029M9042O2180N4836
$$ 106583333 106747234 106898987 107012391 107085955 107143402 107215798 107308793 107373822 107422864 107485044 107539880
1709.2A07539880L8243K2399K384J1754O0523O6292L2354J1396O187R513J6117K0099
$$ 107539880 107578123 107600522 107602906 107614660 107675183 107741475 107773829 107785225 107791412 107800925 107817042 107837141
1733.7A07837141K9969L0803K2901J2970J9550J7798j2338r811M7815N6219K2304J9192
$$ 107837141 107867110 107897913 107920814 107933784 107953334 107971132 107958794 107948983 107996798 108053017 108075321 108094513
1758.2A08094513K3807K4580M3333L9077J3327M030L874J0645K8921L2174J8907O389
$$ 108094513 108118320 108142900 108186233 108225310 108238637 108242667 108246541 108257186 108286107 108318281 108337188 108343577
1782.6A08343577J2064L5060L0267J621L803K5809L4332K4235L279J6892L9076K9803
$$ 108343577 108355641 108390701 108420968 108422589 108426392 108452201 108486533 108510768 108514047 108530939 108570015 108599818
1807.1A08599818J6010J4424J6355J6463J8084J4508M137O425J6534M685j2338O580
$$ 108599818 108615828 108630252 108646607 108663070 108681154 108695662 108699799 108706224 108722758 108727443 108715105 108721685
1831.6A08721685K1172Q154Q440J7130P522j4674j8883K897J4758P391r18o485j4913
$$ 108721685 108742857 108751011 108759451 108776581 108784103 108769429 108750546 108753443 108768201 108775592 108774674 108768189 108753276
1858.1A08753276j7178r632n067k0718l8040j6832L564j0502k3723j9586j4412j8537
$$ 108753276 108736098 108726466 108721399 108700681 108662641 108645809 108649373 108638871 108615148 108595562 108581150 108562613
1882.6A08562613k8658l8338m4382l4415k1697l1375m1843l7038l8374n0008n6505
$$ 108562613 108533955 108495617 108451235 108416820 108395123 108363748 108321905 108284867 108246493 108196485 108139980
1905A08139980n6648n0378m2427m7886o3801p4720p3564p2396p2336o4791n9008n9343
$$ 108139980 108083332 108032954 107990527 107942641 107878840 107804120 107730556 107658160 107585824 107521033 107462025 107402682
1929.5A07402682o6864p7176p9382p6639p3684o5159n2023m9127n1069m1854l3772
$$ 107402682 107335818 107258642 107179260 107102621 107028937 106963778 106911755 106862628 106811559 106769705 106735933
1951.9A06735933l2044k2304j1098m530N13O79J121J0073K1863K2745J7810K2554L0196
$$ 106735933 106703889 106681585 106670487 106665957 106666470 106667149 106668270 106678343 106700206 106722951 106740761 106763315 106793511
1978.5A06793511K9266L1149L7265M0472M4202M7613N6374O0355N1511N0008N2059
$$ 106793511 106822777 106853926 106891191 106931663 106975865 107023478 107079852 107140207 107191718 107241726 107293785
2000.9A07293785M7934M7910M8721M3237L8576L6001K9254K8658L7384L4654K5523
$$ 107293785 107341719 107389629 107438350 107481587 107520163 107556164 107585418 107614076 107651460 107686114 107711637
2023.3A07711637L0208L7479L1030J8621J4603K2638K5677J5664Q488J1862K0313J8620
$$ 107711637 107741845 107779324 107810354 107828975 107843578 107866216 107891893 107907557 107916045 107927907 107948220 107966840
2047.8A07966840N782j371J109N400M053m029j1552j1396o032n412j1492j7703k1243
$$ 107966840 107972622 107971251 107972360 107977760 107981813 107977784 107966232 107954836 107948804 107943392 107931900 107914197 107892954
2074.3A07892954k1124k0587k0552k0337k1922j6082m673k658r775j4568j1599m625
$$ 107892954 107871830 107851243 107830691 107810354 107788432 107772350 107767677 107765019 107755244 107740676 107729077 107724452
2098.8A07724452K384Q786J3411J1337L564j609j097J168K969K956J097J228O91J025
$$ 107724452 107726836 107735622 107749033 107760370 107763934 107762325 107761228 107762396 107765365 107768321 107769418 107770646 107771337 107772362
2127.3A07772362M149j347q774p51J1504R238l099l755Q809R203J967M852R680J7774
$$ 107772362 107776511 107775164 107766390 107765639 107777143 107786381 107783282 107779527 107788336 107797539 107799506 107804358 107814038 107831812
2155.9A07831812K4819J8478J2207J3518J3054J6748K6024L0005L0517K7931K1243
$$ 107831812 107856631 107875109 107887316 107900834 107913888 107930636 107956660 107986665 108017182 108045113 108066356
2178.3A08066356K2328L1161K8170J4841J2899K2983L3176L2795K0170J1646J3853
$$ 108066356 108088684 108119845 108148015 108162856 108175755 108198738 108231914 108264709 108284879 108296525 108310378
2200.8A08310378J2254N853R370J4341L767n638L254J2291R989R370J1253N270k480
$$ 108310378 108322632 108328485 108337855 108352196 108355963 108350325 108353579 108365870 108375859 108385229 108396482 108401752 108399272
2227.3A08399272l827l016n84L720O139Q678R799K563j79J1337J6558R132O902J1158
$$ 108399272 108395445 108392429 108391845 108395565 108401704 108410382 108420181 108422744 108422565 108433902 108450460 108459592 108466494 108477652
2255.8A08477652J1540R703J1492J1790O497O914J3172J3507J2648J2982J0133J1575
$$ 108477652 108489192 108498895 108510387 108522177 108528674 108535588 108548760 108562267 108574915 108587897 108598030 108609605
2280.3A08609605J4794J4054J9062K2757J2696N913J0335J2457J3888J1969M041R513
$$ 108609605 108624399 108638453 108657515 108680272 108692968 108698881 108709216 108721673 108735561 108747530 108751571 108761084
2304.8A08761084J9014R859O294K3758K7597J0061J431k480n638J0788K2853J5878
$$ 108761084 108780098 108789957 108796251 108820009 108847606 108857667 108859098 108856618 108850980 108861768 108884621 108900499
2329.3A08900499M316m077M828Q023j1504l2723m8459m8005l8386j3971M5192R0480
$$ 108900499 108904815 108900738 108905566 108913589 108902085 108869362 108820903 108772898 108734512 108720541 108765733 108856213
2353.7A08856213O5100L2044N698m5073n6899k3961l3879o7651m9007j7488j4127j1718
$$ 108856213 108921313 108953357 108959055 108913982 108857083 108833122 108799243 108731592 108682585 108665097 108650970 108639252
2378.2A08639252l195N162R203O342M816N174N531N150K348J455J836k873p415j085
$$ 108639252 108636057 108641219 108650422 108656764 108661580 108666754 108672285 108677435 108679783 108681238 108683074 108680201 108672786 108671701
2406.8A08671701P176O104l588j1957j848J5319J4448L254k02j181j990L755O663K587
$$ 108671701 108678877 108684981 108681393 108669436 108667588 108682907 108697355 108700609 108700407 108699226 108697236 108700991 108707654 108710241
2435.3A08710241j096q47J097L93J538O509N758j073l040Q82N01k182k646n841n460
$$ 108710241 108709145 108708298 108709395 108709788 108711326 108717835 108723593 108722520 108719480 108720362 108720863 108718681 108716035 108710194 108704734
2465.9A08704734K277M673o259j4591p307k981o592o390p701j6045j9598j0538n269
$$ 108704734 108707011 108711684 108705425 108690834 108683527 108680546 108673954 108667564 108659863 108643818 108624220 108613682 108608413
2492.4A08608413q190n543o592j4019j2160p665q964j5533k6417l3081l1304k4367
$$ 108608413 108600223 108594680 108588088 108574069 108561909 108554244 108545280 108529747 108503330 108470249 108438945 108414578
2516.9A08414578j9037j4091j0896j2254j1611j0777r274n377m303p772j1707j0180
$$ 108414578 108395541 108381450 108370554 108358300 108346689 108335912 108326638 108321261 108316958 108309186 108297479 108287299
2541.4A08287299p725l541K361P39m637j2243k1243k2996k2745k7037l1948l2591k8921
$$ 108287299 108279574 108276033 108278394 108279133 108274496 108262253 108241010 108218014 108195269 108168232 108136284 108103693 108074772
2567.9A08074772l4189n1010n8352m8244l8863m3654n0295m8244m3547m0209m4799
$$ 108074772 108040583 107989573 107931221 107882977 107844114 107800460 107750165 107701921 107658374 107618165 107573366
2590.3A07573366m9591l7026k4903k4963k2053k0278k6917k9505k5582k3055k4247
$$ 107573366 107523775 107486749 107461846 107436883 107414830 107394552 107367635 107338130 107312548 107289493 107265246
2612.8A07265246l8016m9353l7658l2842m8482n2238m2236l4761l3307m5526o0964
$$ 107265246 107227230 107177877 107140219 107107377 107058895 107006657 106964421 106929660 106896353 106850827 106789863
2635.2A06789863o3074n4049m4858m3440m6647n7316p5209q4340p9906q3530r6298
$$ 106789863 106726789 106672740 106627882 106584442 106537795 106480479 106405270 106320930 106241024 106157494 106061196
2657.6A06061196r5439r6857j13809j30534j42968j57523j79708j99890k12670k26617
$$ 106061196 105965757 105868900 105755091 105624557 105481589 105324066 105144358 104944468 104731798 104505181
2678A04505181k34937k41781k64763k84112k80762k72667k61760k38228k14195j96052
$$ 104505181 104270244 104028463 103763700 103479588 103198826 102926159 102664399 102426171 102211976 102015924
2698.4A02015924j79755j71030j78420k05887k34604k40564k40588k47419k45571k46740
$$ 102015924 101836169 101665139 101486719 101280832 101046228 100805664 100565076 100317657 100072086 99825346
2718.8I9825346k58010k54929k40916k11144j65766j50472j54150j40589j14530q6654
$$ 99825346 99567336 99312407 99071491 98860347 98694581 98544109 98389959 98249370 98134840 98048186
2739.2I8048186o6375n2309n1707o3080n6571l6764n0062j00529j43391j75226k18934
$$ 98048186 97981811 97929502 97877795 97814715 97758144 97721380 97671318 97570789 97427398 97252172 97033238
2761.6I7033238k73454l28654l73679m16768m70024n12314n31054n57863o09303o57838
$$ 97033238 96759784 96431130 96057451 95640683 95170659 94658345 94127291 93569428 92960125 92302287
2782I2302287o97947p48438p89839q01849q05634q25978q55958q66407q56525q56918
$$ 92302287 91604340 90855902 90066063 89264214 88458580 87632602 86776644 85910237 85053712 84196794
2802.4H4196794q67540q66019q54397q41254q32635q34442q46135q70818r15015r86999
$$ 84196794 83329254 82463235 81608838 80767584 79934949 79100507 78254372 77383554 76468539 75481540
2822.8G5481540j097208j253558j463419j734268k062047k451575k932769l518039
$$ 75481540 74384332 73130774 71667355 69933087 67871040 65419465 62486696 58968657
2839.1E8968657m137224m623794m816067m663384m187650l374398k285391j164680
$$ 58968657 54831433 50207639 45391572 40728188 36540538 33166140 30880749 29716069
2855.5B9716069k54232K90581M68231M42621L30907J99541J92049L73343N99322P50708
$$ 29716069 29461837 29752418 30220649 30663270 30994177 31193718 31385767 31759110 32358432 33109140
2875.9C3109140Q48583Q76039Q03971O69951N12844L55583K15325J12212L3685p2154
$$ 33109140 33957723 34833762 35637733 36307684 36820528 37176111 37391436 37503648 37537333 37465179
2896.3C7465179j99714k90865l57589m52078n79670p34302r25946j164231j423529
$$ 37465179 37265465 36974600 36617011 36164933 35585263 34850961 33925015 32760784 31337255
2914.6C1337255j601884j577007j293648p74139j38652M87685J022706J418897J753524
$$ 31337255 29735371 28158364 26864716 26090577 25951925 26439610 27462316 28881213 30634737
2933C0634737K083337K344182K494392K540618K432380K123621J673811J223004R07237
$$ 30634737 32718074 35062256 37556648 40097266 42529646 44653267 46327078 47550082 48457319
2951.3D8457319P96777R38195J320987J852292K431381K964419L380805L629065L690481
$$ 48457319 49254096 50192291 51513278 53365570 55796951 58761370 62142175 65771240 69461721
2969.7F9461721L627324L514380L379386L210408K986967K727235K438169K107764
$$ 69461721 73089045 76603425 79982811 83193219 86180186 88907421 91345590 93453354
2986I3453354J758456J432580J174676R90272Q28904O85709N83053M95541M25088L79575
$$ 93453354 95211810 96644390 97819066 98809338 99638242 100323951 100907004 101402545 101827633 102207208
3006.4A02207208L22163K55286K32316K47633K50888K38693K20143J88756J63103J48296
$$ 102207208 102529371 102784657 103016973 103264606 103515494 103754187 103974330 104163086 104326189 104474485
3026.8A04474485J18208Q6176O8987Q3053J10674Q2552L8791M7064P5531Q2194O0070
$$ 104474485 104592693 104678869 104747856 104830909 104941583 105024135 105062926 105109990 105185521 105267715 105327785
3049.2A05327785M3261N2249N6422N9521O6078L7730r537k9051n531L8170N2822K2280
$$ 105327785 105371046 105423295 105479717 105539238 105605316 105643046 105633509 105604458 105598927 105637097 105689919 105712199
3073.7A05712199k6321m8018k4974L457J4639J9240N842j276K4915L6323K456l8541
$$ 105712199 105685878 105637860 105612886 105616343 105630982 105650222 105656064 105654788 105679703 105716026 105718482 105679941
3098.2A05679941l7396K62Q262m0508p0357l7289l1113q0598q9860n0222m948L1889
$$ 105679941 105642545 105642807 105651069 105610561 105540204 105502915 105471802 105391204 105301344 105251122 105246174 105278063
3122.6A05278063J9729l4344o4516m7171l2413o3885j02198q6438k8253j2481n7519
$$ 105278063 105297792 105263448 105198932 105151761 105119348 105055463 104953265 104866827 104838574 104826093 104768574
3145.1A04768574q2659r2423j18208r1732k5392j2540m9222p8809q4066p7057p6437
$$ 104768574 104685915 104593492 104475284 104383552 104358160 104345620 104296398 104217589 104133523 104056466 103980029
3167.5A03980029q2755q6475r4736j02424r7454r1922r4616r3365r8801j18363j18708
$$ 103980029 103897274 103810799 103716063 103613639 103516185 103424263 103329647 103236282 103137481 103019118 102900410
3189.9A02900410j04249j01352j04570j08552j14238j16992j19341j18982j09137j07574
$$ 102900410 102796161 102694809 102590239 102481687 102367449 102250457 102131116 102012134 101902997 101795423
3210.3A01795423j23465j30415j22166j28090j33216j19007j13785j16945j23369j50764
$$ 101795423 101671958 101541543 101419377 101291287 101158071 101039064 100925279 100808334 100684965 100534201
3230.7A00534201j68169j33479q8882q7321j16771j45686j66750j63346j24830j06734
$$ 100534201 100366032 100232553 100143671 100056350 99939579 99793893 99627143 99463797 99338967 99232233
3251.1I9232233j35321j52081j18941r6262j20169j36566j37257j62971j95372j69445
$$ 99232233 99096912 98944831 98825890 98729628 98609459 98472893 98335636 98172665 97977293 97807848
3271.5I7807848j07055p7367q0830j03527j22667j21379j20908j33627j63061j79672
$$ 97807848 97700793 97623426 97542596 97439069 97316402 97195023 97074115 96940488 96777427 96597755
3291.9I6597755j57309j23500r8408j04212j53852j99717j90360j43367j17290j29926
$$ 96597755 96440446 96316946 96218538 96114326 95960474 95760757 95570397 95427030 95309740 95179814
3312.3I5179814j52403j66619j81949j99443k14481k20967k00140j79392j96314k20013
$$ 95179814 95027411 94860792 94678843 94479400 94264919 94043952 93843812 93664420 93468106 93248093
3332.7I3248093k30414k38573k31034k10893k08866k21402k27672k43634k54833k38514
$$ 93248093 93017679 92779106 92548072 92337179 92128313 91906911 91679239 91435605 91180772 90942258
3353.1I0942258k30021k44319k61587k54232k30407k32828k47008k43771k30574k23607
$$ 90942258 90712237 90467918 90206331 89952099 89721692 89488864 89241856 88998085 88767511 88543904
3373.5H8543904k25336k23290k29556k41601k32864k20406k20674k16895k13552k10339
$$ 88543904 88318568 88095278 87865722 87624121 87391257 87170851 86950177 86733282 86519730 86309391
3393.9H6309391j92433j82724j86396j87820j93906j93924j84321j81437j90615j97184
$$ 86309391 86116958 85934234 85747838 85560018 85366112 85172188 84987867 84806430 84615815 84418631
3414.3H4418631j83487j56921j42587j43218j41984j43123j48880j50842j36703j15162
$$ 84418631 84235144 84078223 83935636 83792418 83650434 83507311 83358431 83207589 83070886 82955724
3434.7H2955724j21558j39665j35386j34826j35583j09446q7797q9902r0587p7069
$$ 82955724 82834166 82694501 82559115 82424289 82288706 82179260 82091463 82001561 81910974 81833905
3455.1H1833905o6322o8188p1466n8710l0285j8293m3595o6566m2791o717R400J5860
$$ 81833905 81767583 81699395 81627929 81569219 81538934 81520641 81477046 81410480 81367689 81360972 81370372 81386232
3479.6H1386232J6678K2518M4817O1900O1434O2150P6443R5469R3245R7370J48690
$$ 81386232 81402910 81425428 81470245 81532145 81593579 81655729 81732172 81827641 81920886 82018256 82166946
3502H2166946J80131J48529J57589K14892K31129K16675K12461K27529K53284K74479
$$ 82166946 82347077 82495606 82653195 82868087 83099216 83315891 83528352 83755881 84009165 84283644
3522.4H4283644K83837L07679L40045L37088L17526L35771L69417L49951K93672K83224
$$ 84283644 84567481 84875160 85215205 85552293 85869819 86205590 86575007 86924958 87218630 87501854
3542.8H7501854L56894M01259L47596L22652L52001L39300K95502K79861K73180K52533
$$ 87501854 87858748 88260007 88607603 88930255 89282256 89621556 89917058 90196919 90470099 90722632
3563.2I0722632L01868M27950L96537K79647K64645K86073K99936L27826L27867K88111
$$ 90722632 91024500 91452450 91848987 92128634 92393279 92679352 92979288 93307114 93634981 93923092
3583.6I3923092L36516M88978M74513L46953L72886M51559M49282M48102M60321M24224
$$ 93923092 94259608 94748586 95223099 95570052 95942938 96394497 96843779 97291881 97752202 98176426
3604I8176426M06062M63361M82261M47655M26161M01485M38702M86922M09925L12961
$$ 98176426 98582488 99045849 99528110 99975765 100401926 100803411 101242113 101729035 102138960 102451921
3624.4A02451921L04365M20439M40860L10194K86353K98440K79975K60818K43879K22683
$$ 102451921 102756286 103176725 103617585 103927779 104214132 104512572 104792547 105053365 105297244 105519927
3644.8A05519927K13360K25866K46132K42400K04718J60134J39749J68109J87683J53315
$$ 105519927 105733287 105959153 106205285 106447685 106652403 106812537 106952286 107120395 107308078 107461393
3665.2A07461393J27852J37865J15443O6936O6149P4971O5195P1609Q4186P8153P0858
$$ 107461393 107589245 107727110 107842553 107909489 107975638 108050609 108115804 108187413 108271599 108349752 108420610
3687.6A08420610J38939K04182J48212R2805R1147Q4782N5611K8360K0802K7931L2580
$$ 108420610 108559549 108763731 108911943 109004748 109095895 109180677 109236288 109264648 109285450 109313381 109345961
3710A09345961K6643L1173L0971J4507J0109J5402K1422K4343J9824J9038m125o8927
$$ 109345961 109372604 109403777 109434748 109449255 109459364 109474766 109496188 109520531 109540355 109559393 109555268 109486341
3734.5A09486341p8761P653P6997Q9896M9925P522J884j3435j5915M77J931J0526L1817
$$ 109486341 109407580 109415233 109492230 109582126 109632051 109639573 109641457 109628022 109612107 109612584 109614515 109625041 109656858
3761A09656858K5833j609j0419k062L957J4603J6547o247k1005k646Q583P713L481
$$ 109656858 109682691 109681082 109670663 109668601 109672558 109687161 109703708 109697461 109676456 109673810 109682393 109690106 109693587
3787.5A09693587r66K1684L7289N961j4878j263K062m53p272j3935M267J8502k993
$$ 109693587 109692621 109714305 109751594 109757555 109742677 109741414 109743476 109743023 109735751 109721816 109726083 109744585 109741592
3814.1A09741592k1183K670O795Q500J5247q393j2648M387o914m2534n1093l707L9303
$$ 109741592 109720409 109723079 109729874 109738374 109753621 109745228 109732580 109736967 109730053 109687519 109636426 109632719 109672022
3840.6A09672022J7643j1647m637Q488K7215M0090j8382n0747j8525J2826J7572N674
$$ 109672022 109689665 109678018 109673381 109681869 109709084 109749174 109730792 109680045 109661520 109674346 109691918 109697592
3865A09697592j3435l1268j1564J2136j2m41p451m4131n7840l0160K2924L8397Q559
$$ 109697592 109684157 109652889 109641325 109653461 109653449 109653008 109645557 109601426 109543586 109513426 109536350 109574747 109583306
3891.6A09583306j4269j2696j4961k9146k9958k0849o914p093j7333r883j1825k1279
$$ 109583306 109569037 109556341 109541380 109512234 109482276 109461427 109454513 109447420 109430087 109420204 109408379 109387100
3916A09387100m876l767l1209l7670k0349r441l1448n7077l0232P081Q452j5986l2866
$$ 109387100 109382224 109378457 109347248 109309578 109289229 109279788 109248340 109191263 109161031 109168112 109176564 109160578 109127712
3942.5A09127712k5880l2759m4071k0576o425l3093n3859m4143k9731k3591j4544j1515
$$ 109127712 109101832 109069073 109025002 109004426 108998001 108964908 108911049 108866906 108837175 108813584 108799040 108787525
3967A08787525k6667l7253l4833m5276n0151k3783j1730l3915m1425k2352j2004j6165
$$ 108787525 108760858 108723605 108688772 108643496 108593345 108569562 108557832 108523917 108482492 108460140 108448136 108431971
3991.5A08431971r561R78l052
$$ 108431971 108422410 108423388 108420336
3997.6A08420336
$$ 108420336
##END=$$ End of the data block
