##TITLE=$$ Begin of the data block
##JCAMP-DX=5.00 $$ ACD/SpecManager v 10.08
##SPECTROMETER/DATA SYSTEM=Varian
##DATE=15 Jan 2013 11:17:10
##DATA TYPE=INFRARED SPECTRUM
##DATA CLASS=XYDATA
##ORIGIN=
##OWNER=
##NPOINTS=3735
##FIRSTX=399.26403809
##LASTX=4000.35498047
##MAXX=4000.35498047
##MINX=399.26403809
##MAXY=79.84875488
##MINY=46.13187408
##XFACTOR=1.0000000000
##YFACTOR=0.000000100000000
##FIRSTY=68.92495728
##DELTAX=0.96440572
##XUNITS=1/CM
##YUNITS=TRANSMITTANCE
##XYDATA=(X++(Y..Y))
399.3F89249573O138763j5112457j3982239K890396R309540q246536l387909P351761
407F74210892M102936J225051j428985J864776M402619n032501j6504288n527802K402649
415.7F59715347K934799K93961j0854797Q906021O098022N324707L249665p502060
423.4F68165665m885559p671967j428757N619355O787948N925064L451081J8158l427659
432.1F72553329j392669l914948r89380k778854n342178N32226O12259N716171N902100
440.7F70898056O508865O031189l451461o492691l676606k778091o255493j890335
448.4F58893433O58264K668228O121139M368592L308334l92914n00869j244431m999466
457.1F68880310q280106k079544K054139K652740L388977j37329J488571M575958k370071
$$ plain form
399.3 689249573 695388336 680275879 666293640 669184036 678493576 670247040 666859131 674210892
407 674210892 678313828 679538879 678109894 679974670 684377289 679344788 662840500 657312698 659715347
415.7 659715347 662650146 662944107 652089310 660995331 667093353 672418060 675667725 668165665
423.4 668165665 663280106 655608139 654179382 659798737 666586685 672511749 675962830 675980988 672553329
432.1 672553329 671160660 667245712 666256332 663477478 658135300 658667526 659279785 664995956 670898056
440.7 670898056 677406921 683438110 679986649 673493958 669817352 667039261 660783768 658893433
448.4 658893433 659551697 662219925 668341064 672709656 676017990 675625076 675124207 673879776 668880310
457.1 668880310 660600204 658520660 660574799 663227539 666616516 666479187 667967758 672543716 670173645
465.8F70173645m109039l771820o607590l070450l16009m520646K250367J2958908
473.5F62987366M645996p56607p59201J93100l621903n192642n527496m989701J758423
482.2F48737335P401276O437912P89032j098252j172790K70309q06198l375854l954621
490.9F53228149o535263k273025J056671M043198O696472J794357J074905J107483
498.6F60192947j252136k769012l643647m249496l238144J031189L133392K776261
506.3F51981354L690338J396789o99234k615585k385025l526916p263565l162385K955704
515F40371475L140564K723007J146164J470871L28903j425399p48215j947937k342148
523.7F42717285k553940k799186j290703R21593K207145K867356K472763J972274J29013
$$ plain form
465.8 670173645 666064606 662292786 655685196 652614746 652298737 647778091 650028458 662987366
473.5 662987366 667633362 666876755 666117554 666310654 662688751 657496109 651968613 646978912 648737335
482.2 648737335 656138611 662576523 663365555 662267303 661094513 661364822 660558624 657182770 653228149
490.9 653228149 646692886 644419861 645476532 649519730 656216202 658010559 659085464 660192947
498.6 660192947 658940811 656171799 652528152 648278656 645040512 646071701 649205093 651981354
506.3 651981354 655671692 657068481 656369247 653753662 651368637 647841721 640578156 637415771 640371475
515 640371475 643512039 646235046 647381210 648852081 649180984 647755585 647007370 645059433 642717285
523.7 642717285 640163345 637364159 636073456 636995049 639202194 642069550 644542313 646514587 646643600
532.4F46643600l844223l379592k000847j091500K064553P94029J277008K882767K045517
541F45391312O67038n54123p94297m161682n417480k865715o84967J353721K404976
549.7F35338783J378250r9868L93142n0659q4381k049904m369469m186744m163285
558.4F22105865P77512L167839K168465L822365L386840J116372j584626k634201l568611
567.1F28757820l803673n48057K58941j557617k0180J837006K904663L528938K355767
575.8F33713608P14531l716164m955025j503372j464004j004753K76832K303581M454232
584.4F28819466M037857K112961q94013j868820k831650k782860j740112l453331j370811
593.1F20028687J513557K655907L917656M264640K301140o41517j298104k997398m698448
$$ plain form
532.4 646643600 642799377 639419785 637418938 636327438 638391991 639186020 640463028 643345795 645391312
541 645391312 646058350 645504227 644709930 640548248 635130768 632265053 631580086 632933807 635338783
549.7 635338783 636717033 636617165 637010307 636959648 636875267 634825363 630455894 626269150 622105865
558.4 622105865 622883377 626051216 628219681 632042046 635428886 636545258 634960632 632326431 628757820
567.1 628757820 624954147 624406090 624665031 623107414 623087234 624924240 627828903 631357841 633713608
575.8 633713608 634428139 630711975 625756950 624253578 622789574 621784821 622061653 624365234 628819466
584.4 628819466 632857323 634970284 634076271 632207451 629375801 626592941 624852829 621399498 620028687
593.1 620028687 621542244 624198151 628115807 632380447 634681587 634040070 632741966 629744568 625046120
601.8F25046120k627411r75151p55883J149636K149925K066155L434600L177758n03273
610.5F32162476l138276k921981k030564j897239k349282j313476K087669M266815
618.2F24866142L015633J873474K124672L92609j339684j281052j266746p07398l31497
626.9F27346153K1248J701927K706986L190269L056183J209488J32256p48444j892967
635.5F36723099k700043k689590r346J972274K256585L051910L884888L174972N70221
644.2F46234970p39593k506409k524490m40979j384545j203003J926003L384170J257706
652.9F44003830L76358O30341m82102j115188k671967k364082j644822k135696J94664
661.6F34791336J204605J476784J156387L80898J415329K396621Q2398k210388j070786
$$ plain form
601.8 625046120 622418709 621443558 620687675 621837311 623987236 626053391 629487991 632665749 632162476
610.5 632162476 629024200 626102219 624071655 622174416 619825134 618511658 620599327 624866142
618.2 624866142 627881775 629755249 631879921 632272530 630932846 629651794 628385048 627677650 627346153
626.9 627346153 627367401 629069328 631776314 634966583 638022766 639232254 639364510 638616066 636723099
635.5 636723099 634023056 631333466 631324120 633296394 635552979 638604889 642489777 645664749 646234970
644.2 646234970 645495377 642988968 640464478 640023499 638638954 637435951 639361954 642746124 644003830
652.9 644003830 644380188 645010529 644528427 643413239 640741272 638377190 636732368 634596672 634791336
661.6 634791336 635995941 637472725 638629112 639010010 640425339 642821960 642904358 640693970 639623184
670.3F39623184m47655K082329L527375L747024M172516L821335K854690N63126m27322
678.9F59516602n44129q92410P9803M75540J859589K991943K756119K634049J417999
687.6F70295105P55539l85437k530518l115158j759948J84783J48392J297302L917923
696.3F68807983K582474K302323L135757l95660k602539k988587l885651k668533l93906
705F63893661J603623K055740K548828L181458K646942J518784k25602j547393k304154
713.7F73371887j761856j621170p22122K121200K458649L504105M367141K076264J125488
722.3F84919586J43128j378556k757797l055725k112045r40552J158752K803650K987747
731F81768188K960587L447037K347183j65329k050018l053665k561646k687302j730423
$$ plain form
670.3 639623184 639175529 641257858 644785233 648532257 652704773 656526108 659380798 659943924 659516602
678.9 659516602 658972473 658080063 658159866 658635406 660494995 663486938 666243057 668877106 670295105
687.6 670295105 671050644 670665207 668134689 665019531 663259583 663444366 663592758 664890060 668807983
696.3 668807983 671390457 673692780 676828537 676432877 673830338 670841751 666956100 664287567 663893661
705 663893661 665497284 667553024 670101852 673283310 675930252 677449036 677223434 675676041 673371887
713.7 673371887 671610031 669988861 669266739 671387939 673846588 677350693 681717834 683794098 684919586
722.3 684919586 685062714 683684158 680926361 677870636 675758591 674818039 675976791 678780441 681768188
731 681768188 684728775 688175812 690522995 690357666 688307648 685253983 682692337 680005035 678274612
739.7F78274612J311570K762680L286514L100510K059936J924591l47137k967758j724320
748.4F87681198j120911j545410j013717K82669K514572L758316L412781J135177k29797
757.1F94874878l21274j208267j676178j798935j185303j272964J89590K875443L052215
765.7F93529205K446823J660386J183242r91j903458k553711j232452L80783L21197
774.4F93831024M47617Q62884K264328K199555O21338L33252q76999j392289j171264
783.1F97119446j005707j005249o77719N12771K044144L274765J799240J34659q78754
791.8G01317596j022338L6697n31464j415558l15704J671143J284866J455841J684342
800.5G04165421Q39996R4986k070694j683197j156235n97305j2207l41263J822052
$$ plain form
739.7 678274612 679586182 682348862 685635376 688735886 690795822 692720413 692373276 689405518 687681198
748.4 687681198 686560287 685014877 684001160 684283829 686798401 690556717 693969498 695104675 694874878
757.1 694874878 694553604 693345337 691669159 689870224 688684921 687411957 687601547 690476990 693529205
765.7 693529205 695976028 697636414 698819656 698818665 696915207 694361496 693129044 693509827 693831024
774.4 693831024 694278641 695141525 697405853 699605408 700226746 700559998 699682999 698290710 697119446
783.1 697119446 696113739 695108490 694430771 694943542 696987686 700262451 702061691 702196350 701317596
791.8 701317596 700295258 700331955 699800491 698384933 698069229 699740372 701025238 702481079 704165421
800.5 704165421 705005417 705100403 703029709 701346512 700190277 699592972 699580765 699239502 701061554
809.1G01061554K255402J653976J565552Q22906r54132k371826j655960r68552o08291
817.8G00800629j372300o7062K040024K558899K056885J39465P48672l54766l348084
826.5G03202362k718277q37936j336365j218643J818313K114029J573029K648926J835556
835.2G07080994j76468j377182k411576l236541j828308q02765O485N24978J142273
843.9F98921890K711258J517945L32717Q3390j527863l281631l030167j206589n43976
852.5F93976974q89129m33273J034011J714325K117310J233368o35300j543503k859802
861.2F93714981l162002l117753k332305m75693R24759J420135J179276J185150n3940
869.9F89282608j462173k371598l393860l684845l440017k786179j511993r766o02569
$$ plain form
809.1 701061554 703316956 704970932 706536484 707359390 706405258 704033432 702377472 701408920 700800629
817.8 700800629 699428329 699361267 701401291 703960190 706017075 706156540 706905212 706550446 703202362
826.5 703202362 700484085 699646149 698309784 697091141 698909454 701023483 702596512 705245438 707080994
835.2 707080994 706904526 705527344 703115768 699879227 698050919 697248154 697254639 697779617 698921890
843.9 698921890 701633148 703151093 703483810 703567200 702039337 698757706 695727539 694520950 693976974
852.5 693976974 693087845 692654572 693688583 695402908 697520218 698753586 698118286 696574783 693714981
861.2 693714981 690552979 687435226 685102921 684627228 685551987 686972122 688151398 689336548 689282608
869.9 689282608 687820435 685448837 682054977 678370132 674930115 672143936 670631943 670622177 670019608
878.6F70019608r78470J87835q1558j710510l265076l348007l549423m062042k718964
887.3F50493393j298981r57107k4185N57327L38058k12860q41675j653442k481537
895.9F43918991j759338j122284j282349k75307J780358K261581J597748K727203K628937
904.6F50475540J077042Q48465L46679k97927J1520K15454M6845R50317J767502J547317
914.3F56988754J392975J65329j205215j158905r44138j752396j990890q11539j132889
922.9F49551086j405639m55857L14103L63998j144485j686936j192322k273788k911148
931.6F39159012k015190j171341k25220k46315j018982j202965j048889q59108j473312
940.3F29897690j641274j124992p09381q22258j282654l14674Q91609J255379R95025
$$ plain form
878.6 670019608 669041138 669228973 669147415 667436905 664171829 660823822 657274399 653212357 650493393
887.3 650493393 649194412 648237305 648213120 648770447 649108505 648895645 648053970 646400528 643918991
895.9 643918991 642159653 641037369 639755020 639479713 641260071 643521652 645119400 647846603 650475540
904.6 650475540 651552582 652401047 652747726 652449799 652461319 652676773 652723618 653673935 655441437 656988754
914.3 656988754 658381729 658547058 657341843 656182938 655238800 653486404 651495514 650683975 649551086
922.9 649551086 648145447 647689590 648003693 648367691 647223206 645536270 644343948 642070160 639159012
931.6 639159012 637143822 635972481 635747261 635500946 634481964 633278999 632230110 631371002 629897690
940.3 629897690 628256416 627131424 626422043 625599785 624317131 624002457 624894066 626149445 627144470
949F27144470m35486j903381j480789n98984n55038j043435j149559L00370M62799
957.7F20740967J45645K45247n73883q96454j504402j542664j841621k774086j900139
966.3F10098610o27251r39064j690788p23152o00090j442566k412567l862877l866730
975E93933525l107567k766189l380547k869377j700096j231880r52874j327514k368660
983.7E74228821l009224j972695k486610k911301k338638j675911q68492j298447K01149
992.4E57868652J353264J413117K97012m98581p80945k138519j153946j347961j091118
1001.1E53920975j77994j38550M43840N04456P76939j252899j770363j324005k117043
1009.7E48865356k451324k400932q90084p72819q89282j073761J57280M32968r48639
$$ plain form
949 627144470 626708984 624805603 623324814 622725830 622170792 621127357 619977798 620278168 620740967
957.7 620740967 620886612 621131859 620557976 619661522 618157120 616614456 614772835 611998749 610098610
966.3 610098610 609471359 608532295 606841507 606118355 605518265 604075699 601663132 597800255 593933525
975 593933525 590825958 588059769 584679222 581809845 580109749 578877869 577924995 576597481 574228821
983.7 574228821 571219597 569246902 566760292 563848991 561510353 559834442 558965950 557667503 557868652
992.4 557868652 559221916 560635033 560932045 560433464 559652519 557514000 556360054 555012093 553920975
1001.1 553920975 553742981 553604431 554048271 554552727 555329666 554076767 552306404 550982399 548865356
1009.7 548865356 546414032 544013100 543123016 542350197 541460915 540387154 540544434 540977402 540028763
1018.4E40028763o02837k060089k804336k259636j185723j733551j478500P39937K78206
1027.1E28922234L41377M9400N49355j99738q56781m19769j172638m21181r53789O98472
1036.7E26536942J367797Q72841J731072J596679J609421j11236k5826j12610l19519
1045.4E33145561m95682r26055r1210k96860R64852L01666l02086j159706j945190
1054.1E29195290j183777j883965j089172j993294j265945k58980p73201l45039L6201
1062.8E20438118O50940r86214j169472j526718l77617L33329j007004o63452o61965
1071.5E15029945M27781l80326R21326M35409j094360J4610j119957l6010l44086K58903
1081.1E14113235j2779j92833J381188O01692J368370n5923j98594k41508n68657m34532
$$ plain form
1018.4 540028763 539425926 537365837 534561501 532301865 531116142 529382591 527904091 528644028 528922234
1027.1 528922234 529263611 529313011 529862366 529662628 528805847 528386078 527213440 526792259 525838470 526536942
1036.7 526536942 527904739 528777580 530508652 532105331 533714752 533603516 533577690 533465080 533145561
1045.4 533145561 532649879 531723824 531632614 531335754 532300606 532602272 532300186 531140480 529195290
1054.1 529195290 528011513 526127548 525038376 523045082 521779137 521520157 520746956 520401917 520438118
1062.8 520438118 521089058 520102844 518933372 517406654 517029037 517362366 516355362 515691910 515029945
1071.5 515029945 515457726 515077400 515998726 516434135 515339775 515354385 514234428 514198418 513854332 514113235
1081.1 514113235 514100456 513907623 515288811 515890503 517258873 517202950 517004356 516762848 516194191 515759659
1090.7E15759659o45371J155053M89997J242714Q24776N19676J502953P04536p2403
1099.4E21481590R537J428452k98958P02171J825256J064263J778297J664810K727280
1108.1E32382698J687164J608620J483727P98988N41687k93884R11522J468887K401466
1116.8E42990875J596260J657257K482033J625366J611100Q87794J601563J432266
1124.5E55884514O77185N09834J098252K235984K515564L881111L645821L257332K433243
1133.2E76138840J331062Q64487J5983O34919M31747m1618N9967M09279J71890r21631
1142.8E79094925j254158j568031j687012k731629l250770k987366k258949j245804
1150.5E62111206j105385Q698M56543Q08258N52253Q55294J295357J451454J543655
$$ plain form
1090.7 515759659 515114288 516269341 516759338 518002052 518826828 519346504 520849457 521553993 521481590
1099.4 521481590 521491127 522919579 522620621 523322792 525148048 526212311 527990608 529655418 532382698
1108.1 532382698 534069862 535678482 537162209 537961197 538502884 538209000 539120522 540589409 542990875
1116.8 542990875 544587135 546244392 548726425 550351791 551962891 552850685 554452248 555884514
1124.5 555884514 556561699 557071533 558169785 560405769 562921333 566802444 570448265 573705597 576138840
1133.2 576138840 577469902 578334389 578350372 578985291 579417038 579375420 579435387 579844666 580016556 579094925
1142.8 579094925 577840767 576272736 574585724 571854095 568603325 565615959 563357010 562111206
1150.5 562111206 561005821 561014519 561471062 562279320 562831573 563686867 564982224 566433678 567977333
1159.2E67977333K98119J108131J503105K442856L257141L357506L393326K895126
1166.9E86232643M993897M881553L813591L149109K856789L269272K648315L332253
1174.6F15177422L770599M282379M286575L925400M332848L562431K481117K484436
1182.4F44303207K878342K432022J995011J789093J760940K203674K253113J648560
1190.1F61263962J093063P58591O44989P85446M82254L95660K59247M04587J212540
1198.8F67300339J180420J353836J516342J613235K002564J815567J818848J548004
1206.5F80149155J590194J946564R92737N77698J313247J273728J051712O29730K33917
1215.1F89758682J95008M09927P12509K18735M28314L39203m75311l63312j29089Q2855
$$ plain form
1159.2 567977333 568275452 569383583 570886688 573329544 576586685 579944191 583337517 586232643
1166.9 586232643 591226540 596108093 599921684 603070793 605927582 609196854 611845169 615177422
1174.6 615177422 618948021 623230400 627516975 631442375 635775223 639337654 641818771 644303207
1182.4 644303207 647181549 649613571 651608582 653397675 655158615 657362289 659615402 661263962
1190.1 661263962 662357025 663115616 663760605 664546051 665028305 665423965 665683212 666087799 667300339
1198.8 667300339 668480759 669834595 671350937 672964172 674966736 676782303 678601151 680149155
1206.5 680149155 681739349 683685913 684678650 685256348 686569595 687843323 688895035 689524765 689758682
1215.1 689758682 689953690 690363617 691076126 691294861 691723175 692062378 691587067 691223755 691094666 691177521
1224.8F91177521L40118k6321o50711l96195N4398M94385M36172O4545L24859J49536
1234.4F91968307p3547o10809o98471m41056n11474l19367o50253l97339k41775k1515
1244.1F88002701L65906k42920q33207j250000j263885j319504r08356n38330m71725
1252.8F81540680l11890m28543j4038k64969o35834j67007k16370q18405p78351j79367
1262.4F77725906k60162L42407J266938J117172J120300J047058N75638L48511N42679
1271.1F83826447L11889M959q6441k7466M69513N6610j79290K83432K67334k82288
1280.7F84644699o90079r44900j545944j467667j540298k032395j944961j437455r75036
1289.4F72065964q38471j326065j510696j604309j930008j856537k310715k204132
$$ plain form
1224.8 691177521 691517639 691491318 690840607 690444412 690498810 690993195 691429367 691493912 691818771 691968307
1234.4 691968307 691894760 691283951 690585480 690144424 689632950 689313583 688663330 688265991 688024216 688002701
1244.1 688002701 688368607 688125687 687292480 686042480 684778595 683459091 682550735 682012405 681540680
1252.8 681540680 681228790 680800247 680786209 680521240 679885406 679718399 679502029 678683624 677905273 677725906
1262.4 677725906 677465744 677808151 679075089 680192261 681312561 682359619 682935257 683283768 683826447
1271.1 683826447 684138336 684143295 684056854 684029388 684498901 684555511 684376221 684659653 684926987 684644699
1280.7 684644699 683954620 683009720 681463776 679996109 678455811 676423416 674478455 673041000 672065964
1289.4 672065964 671227493 669901428 668390732 666786423 664856415 662999878 660689163 658485031
1297.1F58485031j785049j615372j260223p85675k73362m09698n01099m78134m16489
1305.8F50959930o83899p65380j056214j121139n57556r56345k19116N14679J01776
1314.5F46216736l67966o49338l69873o15234n23682k69012J32446l9825j67389O06537
1324.1F43953400J085434J322860P78046N01404J02539N58700J453934J011353J251602
1332.8F52019272J021805R58938J160279L87802K83279L96652M76685K80609L14484
1341.5F57299805M23584L64303O89621M47312J49231r232j97601m87671n22995j60980
1351.1F57995377o71921p29828l80859l18299k06146j22528m97055j414719j414184
1359.8F52239838j449585k007218k575531k406616j768722j881638j868973k083320
$$ plain form
1297.1 658485031 656699982 655084610 653824387 653038712 652765350 652355652 651854553 651376419 650959930
1305.8 650959930 650276031 649510651 648454437 647333298 646775742 645819397 645600281 646114960 646216736
1314.5 646216736 645848770 645199432 644829559 644214325 643690643 643421631 643554077 643514252 643346863 643953400
1324.1 643953400 645038834 646361694 647139740 647641144 647743683 648302383 649756317 650767670 652019272
1332.8 652019272 653041077 654000015 655160294 655548096 655831375 656228027 656704712 656985321 657299805
1341.5 657299805 657723389 658087692 658777313 659224625 659373856 659364624 659167023 658679352 658156357 657995377
1351.1 657995377 657323456 656593628 656212769 655894470 655688324 655565796 655068741 653654022 652239838
1359.8 652239838 650790253 648783035 646207504 643800888 642032166 640150528 638281555 636198235
1367.5F36198235j918259j871834j667671j974297k146301k076416k627678k002067
1375.2F19913712j138459l23410j66549O21147N89294N84564J120873P63359M71191
1383.9F22435722M01612J485328J527748J869240J926880J957512K581787K415505
1391.6F36601334L041610K697525K710724K154694J197510J168594J128693P77816
1399.3F51478500K96250L40500K88696J073913M71726o02951o2866k46888q72879j571273
1409F50592728j921234j778870j667557j612778q95767n67627m53949J19934j94473
1417.7F41620407l12805k241554p25403N43403l91540K99797L98216P83615J241837
1426.3F41215973J174469J666336J262817J282959Q28400J098175N26886J66397J120148
$$ plain form
1367.5 636198235 634279976 632408142 630740471 628766174 626619873 624543457 621915779 619913712
1375.2 619913712 618775253 618451843 618285294 618906441 619495735 620080299 621201172 621964531 622435722
1383.9 622435722 622837334 624322662 625850410 627719650 629646530 631604042 634185829 636601334
1391.6 636601334 639642944 642340469 645051193 647205887 648403397 649571991 650700684 651478500
1399.3 651478500 651774750 652115250 652403946 653477859 653949585 653346634 653283768 653036880 652164001 650592728
1409 650592728 648671494 646892624 645225067 643612289 642716522 642148895 641694946 641814880 641620407
1417.7 641620407 641307602 639066048 638340645 638884048 638492508 638792305 639190521 639974136 641215973
1426.3 641215973 642390442 644056778 645319595 646602554 647430954 648529129 649056015 649222412 650342560
1435F50342560O58798J483994J629028K078476J516800R90677J430359J108551J469039
1443.7F62708282N3177J29013P94754M42658N59845O92978J086578J89514R60694J184768
1453.3F68802261P08924O73523K59933M20227j272583J525192J283112J427994P72094
1462F74600677M53949J418610M11759J772079J501846J504822J507492J435471J674728
1470.7F86281433Q93784J958770J288300K345963J759338O79092J965714J889496J811370
1479.4G00873260J366883J709900J673660J467438J039505L00598N96466o7902P90100
1488.1G09749908J464234L84216Q48541J941910J887665R02405Q76999J12915r48563
1496.7G17220230J626282J61285n66482M51202L33786K60849O09970J476975Q28476
$$ plain form
1435 650342560 651001358 652485352 654114380 656192856 657709656 658700333 660130692 661239243 662708282
1443.7 662708282 662761459 662890472 663685226 664127884 664687729 665380707 666467285 666656799 667617493 668802261
1453.3 668802261 669511185 670184708 670444641 670864868 669592285 671117477 672400589 673828583 674600677
1462 674600677 675054626 676473236 676884995 678657074 680158920 681663742 683171234 684606705 686281433
1470.7 686281433 687175217 689133987 690422287 692768250 694527588 695206680 697172394 699061890 700873260
1479.4 700873260 702240143 703950043 705623703 707091141 708130646 708431244 709027710 708959808 709749908
1488.1 709749908 711214142 711598358 712446899 714388809 716276474 717178879 718055878 718168793 717220230
1496.7 717220230 718846512 719007797 718441315 718892517 719226303 719487152 720097122 721574097 722402573
1505.4G22402573l206864m054718K905197J422577r24301o00738j903382p06558j41907
1514.1G15191879j061477o51093j829529k1591P82013Q60672l787231n789338k98996
1522.8G03395309o790m90265l641357n13763l46756k34757l8605j101226j345520k350846
1532.4F93325424k661514m235230j16577j132278j639481R2850k402725K74582j744309
1541.1F79760742O88782o14624j049042j553650l429413n68695k101745j191712j691589
1549.8F68249054q56247J046371J80665M22058k042008L79715l509j252823n228424
1558.5F60894852o576310M294205J005860J625595J1444L28750J32523o72684j11770
1567.1F60932465j127320j316452l873825Q57620j9607o85578j80053n59006o10l083878
$$ plain form
1505.4 722402573 719195709 715140991 718046188 719468765 718544464 717943726 716040344 715333786 715191879
1514.1 715191879 714130402 713479309 711649780 711628189 712410202 713270874 709483643 703694305 703395309
1522.8 703395309 703388519 702898254 699256897 698743134 698396378 698161621 698123016 697021790 695676270 693325424
1532.4 693325424 690663910 686428680 686312103 685179825 683540344 683633194 681230469 681505051 679760742
1541.1 679760742 680449524 679834900 678785858 677232208 673802795 673234100 671132355 669940643 668249054
1549.8 668249054 667392807 668439178 668619843 669041901 666999893 667379608 667376099 666123276 660894852
1558.5 660894852 654318542 658612747 659618607 661244202 661255646 661584396 661716919 661044235 660932465
1567.1 660932465 659805145 658488693 654614868 655472488 655452881 654767303 654587250 654028244 654027634 650943756
1576.8F50943756J559067k57187j134949j257629j850357n20325j237030l44391r70917
1585.5F44930038k20642j19247j117172j60523p32651n46798j732407l46680J22605
1594.1F40076523m15917k80304o21452R43871N34K97966j31569Q9111N03349k87246
1603.8F40174866O42929j65024O43921N61447Q69980J132355N35278O91757m55170
1612.5F44632339L50571j83639Q3618q65555k424545K482910O44302L65296o00510
1621.1F44484787l8681m23965k576523p83234j536179k34146j292610r53789n88379
1629.8F36057281j352310q11729j103096L1433r14383m141808k578048l94097q64830
1638.5F23928413j045608j44920j085778J87950q49342K1019N29442j968689j004868
$$ plain form
1576.8 650943756 652502823 652245636 651110687 649853058 648002701 647482376 646245346 645900955 644930038
1585.5 644930038 644709396 644590149 643472977 643312454 642579803 642033005 640300598 639953918 640076523
1594.1 640076523 639660606 639380302 638758850 639702721 639703255 640001221 639869652 639958763 640462112 640174866
1603.8 640174866 640817795 640652771 641296692 641858139 642728119 643860474 644395752 645087509 644632339
1612.5 644632339 644982910 644799271 644882889 644017334 641592789 644075699 644720001 645085297 644484787
1621.1 644484787 644446106 644022141 641445618 640662384 639126205 638892059 637599449 636645660 636057281
1629.8 636057281 634704971 633893242 632790146 632821579 631907196 627765388 625187340 624793243 623928413
1638.5 623928413 622882805 622737885 621652107 621840057 620990715 621011734 621541176 619572487 618567619
1647.2F18567619k833023J59607r36088L11317M66118m557762j7548Q75664L800392
1655.9F15836296P85828J51825n08881m7951M04167j43432J673546N69572K500305
1664.5F21221275J796303K199173K400971J430778K552185P34940K956733J693612
1672.3F36985970K289199K598458K280044M175720L606034M723434L795853M207458
1680F64662170L261338L150406L844528P09533K920456N017548N095673L930587L964615
1688.6F96556854M918976M561310M368515L330231K607727K890701K346573P5531K952576
1697.3G24608994L071823K479095n28488L695221N260925L416748J823578L38287Q39844
1706G45006027J200638J364212J314087J240005J427536J595078J570282J497955J317520
$$ plain form
1647.2 618567619 615734596 615894203 614958115 615269432 615735550 611177788 611160240 612035904 615836296
1655.9 615836296 616622124 616773949 616265068 616217117 616621284 616477852 618151398 618720970 621221275
1664.5 621221275 623017578 625216751 627617722 629048500 631600685 632335625 635292358 636985970
1672.3 636985970 639275169 641873627 644153671 648329391 651935425 656658859 660454712 664662170
1680 664662170 667923508 671073914 674918442 675627975 678548431 683565979 688661652 692592239 696556854
1688.6 696556854 701475830 706037140 710405655 713735886 716343613 719234314 721580887 721656418 724608994
1697.3 724608994 727680817 730159912 729631424 733326645 738587570 742004318 743827896 744166183 745006027
1706 745006027 746206665 747570877 748884964 750124969 751552505 753147583 754717865 756215820 757533340
1714.7G57533340P24869J731720P34711j965256J210022J375504J183471Q36258J171570
1723.4G64536209J638489J662598J039276N22079M94919P7133n51681N3558J857605
1732G71330185J297531k267761j167069K871323K342606J072464J682739q3237j688080
1740.7G75390701Q43506L51181m3258j32218J300736J248855P55387q1406q3466J541443
1750.4G81091461j382141M3488J223144K97699O39038M94309J5030M42581J085663
1759G83950272K20413M57687o01196k89917J280594Q468Q7967K29035l1739k69317
1768.7G85042267J106109J435624k14081j107330p91932J487122J86691o78634P45163
1777.4G87210999K56958O60018L12806N69992P34100N45731L67050r68628p38449k56272
$$ plain form
1714.7 757533340 758258209 759989929 760724640 758759384 759969406 761344910 762528381 763364639 764536209
1723.4 764536209 766174698 767837296 768876572 769398651 769893570 769970703 769419022 769472580 771330185
1732 771330185 772627716 770359955 769192886 772064209 774406815 775479279 777162018 777078781 775390701
1740.7 775390701 776234207 776585388 776542130 776409912 777710648 778959503 779714890 779633484 779550018 781091461
1750.4 781091461 779709320 779752808 780975952 781273651 781912689 782406998 782422028 782864609 783950272
1759 783950272 784170685 784628372 784027176 783737259 785017853 785026321 785114288 785343323 785311584 785042267
1768.7 785042267 786148376 787584000 787369919 786262589 785470657 786957779 787144470 786465836 787210999
1777.4 787210999 787467957 788127975 788440781 789010773 789744873 790290604 790657654 789689026 788950577 788694305
1787G88694305j35803K54975P02514L29209R03778Q25271k34375J155548k47650j036224
1796.7G91211548o6910K79541j1749q09326L58200L36914R57947J142501Q46558M26712
1806.3G94671936k34146n72968j034774q27790j159210L82385R24378M66995J131897
1815G93748703Q28857Q79364L45917r8114m18243r65882r23385j134186K33536M50973
1824.6G92947540K25601P20063J211471J565781L61481j505204n52902O01731m81720
1833.3G95093842r59321k85110J2436N31921Q59223J516418J046677N93109k9221n67855
1842.9G97812119p59888k583924N723J64871J82571J216583J011124N37109M46244
1851.6G98032532L83606l94669k07367k88391n89905o17523m01306L21121P8125M01077
$$ plain form
1787 788694305 788558502 788813477 789515991 789845200 790748978 791574249 791339874 792495422 792247772 791211548
1796.7 791211548 791144638 791424179 791412430 790603104 790961304 791298218 792256165 793398666 794245224 794671936
1806.3 794671936 794437790 793864822 792830048 792002258 790843048 791225433 792149811 792616806 793748703
1815 793748703 794577560 795456924 795802841 795704727 795286484 794320602 793397217 792263031 792496567 792947540
1824.6 792947540 793173141 793893204 795104675 796670456 797031937 795526733 794973831 795575562 795093842
1833.3 795093842 794134521 793849411 793861847 794393768 795252991 796769409 797816086 798409195 798379974 797812119
1842.9 797812119 797052231 794468307 794474030 794638901 794821472 796038055 797049179 797586288 798032532
1851.6 798032532 798416138 798021469 797814102 797525711 796935806 796318283 795916977 796238098 796316223 796717300
1861.3G96717300O13251P07169K84958q6136M3716m24652k9755j141510q74633L31802
1870.9G96141510K35291N99365P30438P80945j01776l72391j69678J22605J1749o39191
1880.6G97338867l55224l39432J25961K26059M07028M32511k7085L15705k55967q33511
1890.2G97034912k67944J49536M6005Q240m4937o6529M57077j28402j46408q2093n8136
1900.8G96901321k9373l28903R6817j60141K04926M11834K31400j0834o46591o81000
1910.4G95989456n39932O5384k3270J06049L24631M44793M24195q91419k79159J01776
1920.1G95722504j26877m58527j084671l28293J80970L73382J48087M72336N74035
1928.8G95472946K82059Q7967n69992o83670p56073o35529m06570O3324L7918L23944
$$ plain form
1861.3 796717300 797330551 798037720 798322678 798236542 798280258 797855606 797825851 796684341 795809708 796141510
1870.9 796141510 796376801 796976166 797706604 798487549 798385773 798013382 797843704 797966309 797978058 797338867
1880.6 797338867 796983643 796644211 796770172 796996231 797403259 797835770 797808685 798124390 797868423 797034912
1890.2 797034912 796766968 796916504 796962509 796970749 796925812 796859283 797316360 797187958 797041550 796959457 796901321
1900.8 796901321 796871948 796543045 796639862 796479721 796684647 797096481 797327881 797317047 796670456 795989456
1910.4 795989456 795449524 795514908 795491638 795597687 795922318 796367111 796791306 795899887 795620728 795722504
1920.1 795722504 795595627 795137100 794052429 793724136 793905106 794278488 794426575 794898911 795472946
1928.8 795472946 795755005 795842972 795272980 794589310 793833237 793197708 792791138 792854462 792892380 793216324
1938.4G93216324R52072K22244O4011l15094o16303j59759n00870q34274q32596m32434
1948.1G90763321j37177O58570P05337N07126O20041M7913r1477n64194r08279j198730
1957.7G90402451j075211n31693n8898P94982O49415N06668M23889M30755J29776r07745
1967.3G90764389r12933p42798p11441m27551Q3541M60053O94885N50461J00098J83334
1977G90042038j15967m45938o98318q50373o68792l84675l22189m0512P50122O24695
1986.6G87890091O10504L29437l11126m19312q41370p67593k50626L3951k11944J49536
1996.3G86211548N69839M39148Q17719J23062m18015n79681q19778q31299o50711j297
2005.9G84860535J99661M27704L76434K57645J81427O5994k72903p10373j99967l58581
$$ plain form
1938.4 793216324 794168396 794390640 794454651 794139557 793523254 793363495 792862625 792028351 791195755 790763321
1948.1 790763321 790626144 791284714 791990051 792497177 793117218 793165131 793073654 792509460 791601181 790402451
1957.7 790402451 789327240 788795547 788736649 789531631 790181046 790687714 791111603 791542358 791672134 790764389
1967.3 790764389 789851456 789108658 788397217 787969666 788053207 788513260 789208145 789758606 789858704 790042038
1977 790042038 789926071 789480133 788781815 787931442 787262650 786877975 786555786 786515274 787265396 787890091
1986.6 787890091 788500595 788830032 788518906 788099594 787258224 786490631 786240005 786273956 786062012 786211548
1996.3 786211548 786781387 787220535 788038254 788161316 787743301 787163620 786343842 785512543 784861832 784860535
2005.9 784860535 785060196 785487900 785864334 786121979 786303406 786369400 786096497 785386124 785186157 784827576
2015.6G84827576n24216l94287k28882L66974M98123M05426j76315l50876l76740n85937
2025.2G83460846n34515m74015k79312K09503Q94471O04248L12957j8005k14767k69013
2034.9G83692398q34427l76434o09436r14002j98288M01993P09305Q57162J125718
2043.5G83853989J81274p92694j038818q44498p50961r65500l55530K47421O68259
2052.2G80202942N78384O88782O54755J87912p1106p83310j009522j332855j020508
2060.9G78095474p7667M96292P21665Q23745J280365N56946L52402N8288r98993j231384
2070.5G80077133j390991r91669m24423K69012P52488R16671R78852J018829P80945
2079.2G81986847m51737p70034j219941j473617q92258o87103Q4991M83780Q74787
$$ plain form
2015.6 784827576 784303360 783909073 783680191 784047165 784545288 784950714 784774399 784423523 784046783 783460846
2025.2 783460846 782926331 782452316 782173004 782382507 783276978 783881226 784194183 784176178 783961411 783692398
2034.9 783692398 782857971 782481537 781872101 780958099 780759811 781161804 781871109 782728271 783853989
2043.5 783853989 784035263 783242569 782203751 781359253 780608292 779642792 779287262 779534683 780202942
2052.2 780202942 780781326 781470108 782124863 782312775 782241669 781458359 780448837 779115982 778095474
2060.9 778095474 778017807 778514099 779235764 780059509 781339874 781896820 782249222 782307510 781308517 780077133
2070.5 780077133 778686142 777694473 777270050 777539062 778291550 779208221 780187073 781205902 781986847
2079.2 781986847 781535110 780765076 779545135 778071518 777179260 776492157 776577148 777060928 777935715
2087.9G77935715J452179J094970J83792l21578p22199j235123j347274j335144q43812
2096.6G74861526l52935Q09097J556778J300278J051941P0724r1553m66766j204758
2105.2G77534332j323089j537934j229858l13034P97882R49554J213379J246109O89316
2113.9G78026657J09177r11637j059265j284637j027756p17163m14734P65457J237564
2122.6G74723663J335755P16934M02527J77688p58056j221619j232681p23572n12009
2131.3G72908630l7536M88434O60553J077804R55429L43704N4703l39279j142960j037750
2140.9G73931732q75778n61218J01547M94385Q23974N98984Q32443M30222j62125m73251
2150.6G75140915j013260p31964o10809J70288N29709M59365P36618M76151M57230
$$ plain form
2087.9 777935715 779387894 780482864 780666656 780345078 779622879 778387756 777040482 775705338 774861526
2096.6 774861526 774508591 775317688 776874466 778174744 779226685 779297409 779205856 778739090 777534332
2105.2 777534332 776211243 774673309 773443451 773130417 773928299 774877853 776091232 777337341 778026657
2113.9 778026657 778135834 777224197 776164932 774880295 773852539 773135376 772720642 773486099 774723663
2122.6 774723663 776059418 776776352 777178879 777356567 776598511 775376892 774144211 773420639 772908630
2131.3 772908630 772871094 773359528 774020081 775097885 776053314 776397018 776451721 776112442 774969482 773931732
2140.9 773931732 773055954 772494736 772596283 773090668 773914642 774513626 775346069 775776291 775614166 775140915
2150.6 775140915 774127655 773395691 772784882 772955170 773484879 773944244 774680862 775157013 775614243
2159.3G75614243N6457j58157l63159o80924r83276n26047L36990M3793P63245J155548
2168.9G75258713P78732N68237k33307o96792p62100m32663p26471p11823J145N72662
2178.5G73616333J181946J163025Q40759J45798m46625p83691q93174q13446o46286
2187.2G73364639k46277J20469O87103P49206J014252J019745J93787m55933p73163
2195.9G75673828o90536j091767q90503l43017M15954J174927J146469J339569N12772
2204.6G77247696K0981r4223q56629j328964j631851q85391r4147O70700J377716J267853
2214.2G75693741R91134Q73642O08368m22821j282501j438827o88401n75180p40204
2222.9G73018951N34363J091538J050262J310883J152191L93219l72467r57337j384811
$$ plain form
2159.3 775614243 775670700 775512543 775149384 774468460 773485184 772959137 773296127 773339920 774103165 775258713
2168.9 775258713 776037445 776605682 776372375 775675583 774913483 774480820 773754349 773042526 773043671 773616333
2178.5 773616333 774798279 775961304 776802063 776947861 776501236 775717545 774824371 774010925 773364639
2187.2 773364639 773118362 773238831 773925934 774675140 775689392 776709137 776902924 776446991 775673828
2195.9 775673828 774983292 773891525 773001022 772658005 773073959 774248886 775395355 776734924 777247696
2204.6 777247696 777268677 777174454 776317825 774988861 773357010 772471619 772377472 773048172 774425888 775693741
2214.2 775693741 776684875 777558517 778166885 777744064 776461563 775022736 774334335 773759155 773018951
2222.9 773018951 773553314 774644852 775695114 777005997 778158188 778551407 778178940 777221603 775836792
2231.6G75836792j413498j354217l62320P09991J241531J650925J613770Q52203o7444
2240.3G78707733k57797r15985j362381j419602j127319k25067K65198J056747J350784
2248.9G76072311J266327J273575N80444n81283j078720j051254j529160p75375m3564
2257.6G74133301L11889R35440J091767J328201O84967L64838l1586r81369j190491
2266.3G76646957j300888r63134k47345L03344O28891J347123J218338O14852M75769
2275G78723907k46276o59027j227723j177826o36520j94015Q0795J34888J179351J496353
2284.6G77473907J051331K09656l38669n68161j487885r36126m90036k49329K05231
2293.3G74869919O67724J237107P72934O33621K56882l64075p76520j003876r49707
$$ plain form
2231.6 775836792 774423294 773069077 772706757 773416748 774658279 776309204 777922974 778775177 778707733
2240.3 778707733 778449936 777533951 776171570 774751968 773624649 773399582 773664780 774721527 776072311
2248.9 776072311 777338638 778612213 779192657 778611374 777532654 776481400 774952240 774176865 774133301
2257.6 774133301 774445190 775380630 776472397 777800598 778485565 778850403 778818817 777837448 776646957
2266.3 776646957 775346069 774382935 774135590 774438934 775067825 776414948 777633286 778248138 778723907
2275 778723907 778477631 777818604 776590881 775413055 774776535 774582520 774663315 774798203 775977554 777473907
2284.6 777473907 778525238 778734894 778396225 777828064 776340179 775404053 774914017 774664688 774869919
2293.3 774869919 775537643 776774750 777547684 778181305 778438187 778074112 777297592 776293716 775344009
2302G75344009j025695J01471N34668L10974P10144Q84475N55115j29166o30111q46863
2311.6G75809021l03802p71332j098633R1782N55954J105728J302642Q31681O76346
2320.3G78199387M77295n09110j555481j101608r44443o73065O83365R76257L81088
2329G75933685M44947P75833P08694k21939j505814j311798j21231p8582p80411q5373
2338.6G73758011J887512J810684L2349L26309M04129r22088j900635j896591r91745
2347.3G72507935j091233l25851P75757P07779O94885M55704J216735N13764k25754
2356G75229721L68271k076340q10318r00802j387940R96323J208877J934586O8054
2364.7G74630432l42941P44171o73904j411820j398773j582718r98993j72424l55377
$$ plain form
2302 775344009 774318314 774419785 774954453 775265427 775975571 776860046 777415161 777285995 776655884 775809021
2311.6 775809021 775505219 774733887 773635254 773727036 774282990 775388718 776691360 777523041 778199387
2320.3 778199387 778676682 778167572 776612091 775510483 774566040 773892975 774576340 775552597 775933685
2329 775933685 776378632 777154465 777863159 777641220 776135406 774823608 774702377 774623795 773843384 773758011
2338.6 773758011 775645523 777456207 777488556 777814865 778218994 777296906 775396271 773499680 772507935
2347.3 772507935 771416702 771090851 771866608 772574387 773269272 773724976 774941711 775455475 775229721
2356 775229721 775597992 773521652 772711334 771810532 770422592 771418915 772627792 774562378 774630432
2364.7 774630432 774287491 775031662 774357758 772945938 771547165 769964447 768965454 768793030 768437653
2373.3G68437653M86679J006469P99408N44052n69305j035919j320801j521149j323700
2382G65503387r43450n02396J33362R64813J105118P18078J19477J13830l49350j213531
2391.7G65649338r91669j264648j169663n4855O20498N54352O38886J080398Q35495
2400.3G65898132K02408q18405j367187j257401j164474m83628N4550K30027P60574
2409G62054596P62176J67618L82233R0790n48554m78439r35593j064911p88955l74070
2418.7G59266891K75040Q62656Q10852O1798J92718J35422p10907j291199j189346
2427.3G58413925r40704o09741K60086M49371N30624O67725O12946K60009p46307j187363
2437G57710571j015701o37894q19320o19202M0283J79520O79169P23266K73361k16293
$$ plain form
2373.3 768437653 768924332 769930801 770730209 771274261 770704956 769669037 768348236 766827087 765503387
2382 765503387 764559937 764057541 764190903 765155716 766260834 766978912 767098389 767212219 766862869 765649338
2391.7 765649338 764657669 763393021 762223358 762168503 762789001 763343353 763982239 765062637 765898132
2400.3 765898132 766100540 765282135 763914948 762657547 761493073 761009445 761063995 761294022 762054596
2409 762054596 762816772 762984390 763366623 763457413 762908859 762430420 761494827 760429916 759640961 759266891
2418.7 759266891 759541931 760404587 761215439 761277237 761469955 761605377 760894470 759603271 758413925
2427.3 758413925 757473221 756863480 757123566 757572937 758103561 758771286 759384232 759644241 758897934 757710571
2437 757710571 756694870 756056976 755237656 754618454 754658737 754838257 755517426 756240692 756514053 756297760
2446.6G56297760m81033q26264r55581n32761p54700n66940k84195J07117O45599L83530
2456.3G53032532K73132q5602l71322p41654j231918q09632l02429l89557m72030K60772
2465.9G49162292O45371L62701J83640k85492m79736n89066j104050r10492m80346
2474.6G46504822m81491K0141M90723O05011L45001j02005k06985p66907j236878j121215
2484.2G44050217p66526n81665l13873J65558J54266O01349P60727K23541j90811r11941
2493.9G43190842j217728j051178o88477m59136l88947J32904M50897L39127L14865
2502.6G40623169K44675j97602q55255j005325o77643r91974r41696j52740K29110
2511.2G36274719M26407J74179L43704M07029m85993p66067r07898j154633j004333
$$ plain form
2446.6 756297760 755816727 754990463 754034882 753502121 752747421 752180481 751896286 752003403 752649002 753032532
2456.3 753032532 753305664 753220062 752848740 752107086 750875168 750065536 749763107 749373550 748901520 749162292
2465.9 749162292 749807663 750170364 750354004 750068512 749588776 748999710 747895660 746985168 746504822
2474.6 746504822 746023331 746043472 746534195 747139206 747484207 747382202 747175217 746408310 745171432 744050217
2484.2 744050217 743283691 742702026 742388153 742553711 742707977 743309326 744070053 744293594 744102783 743190842
2493.9 743190842 741973114 740921936 740233459 739774323 739385376 739518280 739969177 740308304 740623169
2502.6 740623169 740867844 740670242 739814987 738809662 738132019 737140045 736198349 736045609 736274719
2511.2 736274719 736701126 736875305 737219009 737626038 737140045 736373978 735466080 734311447 733307114
2519.9G33307114p36313l12882L18985Q13523P72552L6011n48325m23050m41589l91312
2529.6G32394714q46176j192779o38123k71988L91312N07889L96576M81414p248l79409
2539.2G30836182q47168j020813p87659p24182p95441j52588N54428M69971J94702
2547.9G27727432p9574M33197N0125r82514j177826j186447p08999n83496n8899L23486
2557.5G23756485J21078N14603N22308M7684p78580j260528j036530l58581k45896
2566.2G21282043n19409J5183L27606M19693J14746m2801j07727o50940q64715r71222
2575.9G19002457p46994n58854k10037r3307J32675P44171L67889m8675n89600p31887
2585.5G17267838n69535p54547p20749n44739O3019J15052K25524L88489J94016o8207
$$ plain form
2519.9 733307114 732570801 732257919 732576904 733390427 734162979 734198990 733650665 733227615 732786026 732394714
2529.6 732394714 731548538 730355759 729717636 729445648 729836960 730344849 730741425 731222839 731215591 730836182
2539.2 730836182 729989014 728968201 728180542 727456360 726660919 726508331 727062759 727532730 727727432
2547.9 727727432 727647858 728081055 728131180 727148666 725970840 724784393 724075394 723491898 723432999 723756485
2557.5 723756485 723877563 724392166 724914474 724962158 724183578 722923050 721886520 721527939 721282043
2566.2 721282043 720762634 720777817 721105423 721525116 721639862 721597061 721489334 720838394 719973679 719002457
2575.9 719002457 718255463 717696609 717486572 717393265 717525940 718270111 718638000 718589325 717999725 717267838
2585.5 717267838 716698303 715943756 715223007 714678268 714741287 714856339 715081863 715470352 715664368 715596161
2595.1G15596161o78940o05087p13654q50448n82276l25088j64871o5842L63159K32468
2604.8G12205582J75018j68228o62995n01251o93054r85565j062241k27051L97873
2613.5G08478088J64490K72904K35748j8997k16370m24805q66012r36661p99561q17489
2623.1G05071335l39356J81198L97950J96457k1286j34507k99377l70483o70929q44803
2632.8G03166199q57086j017533o75430K42538N07431J87989M043l3951k30255o08062
2642.4G00685883o96717r92431j000672q65173p77359j78604n0202L7232J56479K09350
2652F96527786J62277m33731r39483j023560q80127j090469o29578R842M6311L48739
2661.7F92098007J83869j32294l32718m80728q80432j308975j057435p47222k89078
$$ plain form
2595.1 715596161 714917221 714312134 713598480 712748032 712165756 711840668 711675797 711609955 711973114 712205582
2604.8 712205582 712380600 712212372 711549377 711048126 710355072 709369507 708307266 708080215 708478088
2613.5 708478088 708642578 708915482 709151230 709132233 708915863 708491058 707625046 706688385 705888824 705071335
2623.1 705071335 704731979 704913177 705311127 705507584 705486298 705351791 705052414 704681931 704011002 703166199
2632.8 703166199 702309113 701291580 700616150 700858688 701366119 701554108 701558151 701524200 701293945 700685883
2642.4 700685883 699989166 698996735 697996063 697130890 696353531 696174927 696124725 696161957 696318436 696527786
2652 696527786 696690063 696256332 695316849 694293289 693413162 692322693 691693115 691702957 691749268 692098007
2661.7 692098007 692281876 692149582 691816864 691336136 690455704 689146729 688089294 687342072 687052994
2670.4F87052994j07498n9815J52359K00348o561n18189n59311l64608p87964j382981
2680F83618774o21490L1128m18701k50855j65176q6365J1978k92892o32782j040573
2689.6F80153046q77304n01404n50766n81207R9639N34668K77405J87225j80892n91202
2699.3F77969208n98450q02078j116638p04728n85784p72858j34506L30886M14582
2708F73999634J88370J5335j18180n70526r65500r25979m69590p61489n09415K87781
2717.6F70170441J83868P9804K96554M92783k82822q87299r28497j078186n36041r5596
2727.3F67415009j42212k36817M8523J49460m2648J4267k15531m93774m70734l05023
2736.9F65720520n14145o48498m34647J70593N24140n0660j07650l13874n34973l128
$$ plain form
2670.4 687052994 686945496 686885681 687038040 687238388 687231827 686713638 686154327 685789719 685001755 683618774
2680 683618774 682997284 683028412 682609711 682358856 682193680 682107315 682119293 681826401 681193619 680153046
2689.6 680153046 679275742 678774338 678223572 677642365 677742004 678276672 678554077 678741302 678560410 677969208
2699.3 677969208 677370758 676568680 675452042 674747314 674161530 673388672 673254166 673585052 673999634
2708 673999634 674188004 674203339 674085159 673514633 672549133 671623154 671153564 670392075 669882660 670170441
2717.6 670170441 670354309 670434113 670730667 671223450 670940628 670053329 669124832 668046646 667510605 667415009
2727.3 667415009 667272797 667035980 667084503 667233963 667191315 667205582 666990051 666496277 666025543 665720520
2736.9 665720520 665206375 664557877 664123230 664293823 664817963 664767303 664659653 664345779 663810806 663807678
2746.5F63807678M0894q29621j088409J08871J65482l29514j17263L02505N61600n19180
2756.2F62103043r69773l93600m49372p37075n83725o52924o69174n9586J2513K37197
2765.8F57837524K01569n0812j71051o76193o50101q71200m49829q8425m21295J31225
2775.5F54791412J52970j79825k67105l49884m93698q31375j081467p46689q3008k26517
2785.1F50684814m41207l19901J62277K31324m48151m43726l80630q23899j170654
2793.8F47050247p52258m90952m50821j12381m41665m58908l82843k72827j87149r56574
2803.4F42543869j141205r40704q62007p22695n91736k40860j85546l44010n22728
2812.1F36992378o37932k99148n76363j314468r72138m64325k67486p16057j027069
$$ plain form
2746.5 663807678 663848572 663018951 661930542 662039413 662204895 661875381 661758118 662060623 662622223 662103043
2756.2 662103043 661133270 660739670 660290298 659553223 658969498 658316574 657647400 657587814 657600327 657837524
2765.8 657837524 658039093 657988281 657817230 657141037 656490936 655619736 655169907 655081482 654660187 654791412
2775.5 654791412 654944382 654764557 654497452 654147568 653653870 652822495 651741028 650994339 650911331 650684814
2785.1 650684814 650243607 649923706 650085983 650317307 649869156 649425430 649044800 648220901 647050247
2793.8 647050247 646297989 645807037 645356216 645243835 644802170 644343262 643960419 643687592 643500443 642543869
2803.4 642543869 641402664 640461960 639599953 638877258 638285522 638044662 637859116 637515106 636992378
2812.1 636992378 636354446 636055298 635478935 634164467 633192329 632728004 632460518 631744461 630717392
2820.8F30717392p7782j76582p79724r09805q76008m55589r05266j283416j140023
2829.5F24113197j107025o32629k40669m29268n02587q45566j692733j329270q37059
2838.2F16496391j155395j200180j422234j413421j156388j137733r97963j071396
2845.9F06941681r04656n99250j400338j618423j319580j899529j672706j361618j021767
2854.6E95143814o66428p41958l83377q16231j031303q26188q64830j141891j318131
2863.2E87353477n29327o19621p85561p83119p72667K44980L26233l43590o38046l94478
2872.9E83058281m52461o52504j69068J63193J26267J10855N93147J43852n07393L8224
2882.5E82452393M04663L03878n7411R3575k8458j83143M98962O22330O19773O39916
$$ plain form
2820.8 630717392 630639610 630463028 629683304 628773499 627897491 627441902 626536636 625253220 624113197
2829.5 624113197 623006172 622373543 622132874 621703606 621201019 620355453 618662720 617333450 616496391
2838.2 616496391 615340996 614140816 612718582 611305161 610148773 609011040 608013077 606941681
2845.9 606941681 606037025 605437775 604037437 602419014 601099434 599199905 597527199 596165581 595143814
2854.6 595143814 594477386 593735428 593352051 592535820 591504517 590678329 589813499 588671608 587353477
2863.2 587353477 586824150 586204529 585418968 584635849 583863182 584108162 584434395 584090805 583452759 583058281
2872.9 583058281 582605820 581953316 581784248 581947441 582073708 582184563 582777710 582921562 582414169 582452393
2882.5 582452393 582857056 583160934 583103523 583197098 583168640 582985497 583484459 584106789 584726562 585366478
2892.2E85366478M97322M75464K05917q6250J72996J85738m45671j87111N54085O76308
2901.8E87415276N08995M03289K29149k00500l97759n2833N8517j88713j74484k94685
2911.4E87306252R5405L04108j33515L2082j30615P1411O7978q98667r26437k11983
2921.1E85576019N28069N83725K34756M05464Q67119P73964M16413M96482N69230N52597
2930.7E91003838L5705j12266O27365R79080R87778J437225J417809P02819Q48580
2939.4E97927933J123924Q13141J88141M24461R45168P15255J267968R01794M92058
2948.1F04799843R84573R31320R42498L89480M17633N49240L55187O12564O15845Q50296
2957.7F11448479J004944J103096P92846O78444R84306N56717J90163J66931L39318
$$ plain form
2892.2 585366478 585863800 586339264 586545181 586458931 586631927 586817665 586371994 586184883 586738968 587415276
2901.8 587415276 587924271 588327560 588556709 588356209 587958450 587905617 587964134 587775421 587600937 587306252
2911.4 587306252 587401657 587705765 587572250 587604332 587473717 587545128 587613106 586714439 585788002 585576019
2921.1 585576019 586104088 586687813 586922569 587328033 588195152 588969116 589385529 589882011 590451241 591003838
2930.7 591003838 591039543 590927277 591554642 592533722 593521500 594958725 596376534 597079353 597927933
2939.4 597927933 599051857 599864998 600053139 600477600 601422768 602138023 603405991 604307785 604799843
2948.1 604799843 605784416 606715736 607658234 608047714 608465347 609014587 609369774 609982338 610598183 611448479
2957.7 611448479 612453423 613556519 614349365 615027809 616012115 616568832 616758995 616925926 617265244
2966.4F17265244P09190Q17947M09813N71404J280212J394005Q01201K64854K04697
2975.1F23718567k19650J71623N09605M8676N03502Q87832O57387J15051R0905J21460
2984.7F26604958J73950M00009l08800k17018K00310R231J23101K55012r4719l03879
2994.4F26842155L31917M37966P7934k22626l39737o32362r45206k92702N1232M539
3004F25313110j24817J57700J83106n93224l11661k92740q09936p03736l55796j96267
3013.7F22265739n59806m08821K72064L25699k42920o24733n66674l22723p58133j083794
3023.3F18295898m37049l74756m79431l57247l05137l23525l75481k32849m18396o24656
3033F14367371p64542q18825r18579m17061j14135n99175k09770l21083r6321J29318
$$ plain form
2966.4 617265244 617974434 618792381 619202194 619773598 621053810 622447815 623249016 623513870 623718567
2975.1 623718567 623498917 623670540 624180145 624228821 624732323 625620155 626277542 626392593 626483498 626604958
2984.7 626604958 626778908 627178917 626870117 626653099 626853409 626862640 626985741 627240753 627146034 626842155
2994.4 626842155 627174072 627612038 627689972 627467346 627127609 626495247 625550041 625257339 625308571 625313110
3004 625313110 625188293 625345993 625529099 624935875 624624214 624331474 623521538 622817802 622462006 622265739
3013.7 622265739 621705933 621297112 621569176 621894875 621651955 621027222 620460548 620137825 619379692 618295898
3023.3 618295898 617858849 617484093 617004662 616647415 616342278 616018753 615643272 615410423 614992027 614367371
3033 614367371 613602829 612784004 611865425 611448364 611334229 610735054 610525284 610204201 610107880 610237198
3042.6F10237198o98357n28106o18859j047592j157112q67767l30353o9351k4720j01127
3052.2F04793854Q3580o26793o82335m10042j193962r34524q80280q06541M653J02616
3061.9E99450226j06926j23558l39318n07087n75447j019707q87985r29909j002655
3070.6E93957634j76468j71013l91083J4725j60675o58035n92117m33732k31895k14729
3080.2E90942612q81958j088677m83246j32026l76473k75078k69394k32162L23830
3088.9E87527428o2981q89778j136971n79185m88968n79262R1438l07464l00980J10588
3098.5E83383865j80778q2092m16527r65004q41408l67584k02942j77689p0114K84081
3108.2E80363808N45845k77672r61342p01790k80266l34968m63753k70843l61290m38881
$$ plain form
3042.6 610237198 609538841 609010735 608391876 607344284 606187172 605319405 604989052 604919701 604894981 604793854
3052.2 604793854 604877434 604250641 603568306 603158264 601964302 601029778 600149498 599342957 599347610 599450226
3061.9 599450226 599343300 599219742 598880424 598373337 597797890 596778183 595890198 594960289 593957634
3070.6 593957634 593781166 593610153 593219070 593233795 593073120 592415085 591822968 591389236 591157341 590942612
3080.2 590942612 590060654 588971977 588488731 588356705 587980232 587705154 587435760 587203598 587527428
3088.9 587527428 587464447 586574669 585437698 584858513 584369545 583790283 583881721 583574257 583273277 583383865
3098.5 583383865 583203087 583120995 582704468 581739464 580898056 580530472 580327530 580149841 580079727 580363808
3108.2 580363808 580909653 580631981 579670639 578968849 578688583 578353615 577889862 577619019 577257729 576818848
3117.8E76818848k72942l4866K31361J46217n78537p51724k74467k70386n54962r39789
3127.5E73518753o70357j44424M0321l7231l48244l80096k66610j39083o40564p90635
3137.1E70141830l08265l26958m80766o65818o7367J06850l82309k12860l86658p02477
3146.8E66715202o11686j96801l76167q98666n47028q5258k83814o09550m67568k91443
3156.4E62347221j28822l30658r38644j214714o57006n0850p15484r16977j68343K05345
3166E57431068K175k57874k21328l48893m82635j083107j260719p30286n16281l62473
3175.7E52169647l81965Q4686L42483m36325q69636l14484p2403p34749q20541q12264
3185.3E48154449j027374k82364M41361l87802m66767L79563j38436n01289q95615
$$ plain form
3117.8 576818848 576545906 576511040 576742401 576888618 576310081 575558357 575283890 575013504 574458542 573518753
3127.5 573518753 572848396 572703972 572744293 572707062 572358818 571978722 571712112 571573029 570932465 570141830
3137.1 570141830 569833565 569506607 569025841 568360023 568292656 568399506 568017197 567804337 567417679 566715202
3146.8 566715202 566103516 565906715 565530548 564631882 564084854 563999596 563715782 563106232 562638664 562347221
3156.4 562347221 562218399 561887741 560949097 559734383 559077377 559026527 558311043 557394066 557225723 557431068
3166 557431068 557433243 557175369 556954041 556605148 556122513 555039406 553778687 553048401 552532120 552169647
3175.7 552169647 551787682 551872368 552214851 551778526 550908890 550594406 550522003 549787254 548966713 548154449
3185.3 548154449 547127075 546844711 547286072 546898270 546431503 546811066 546672630 546171341 545275726
3194E45275726q96606m97933r10720o05889P7K40821l1356m24500n26886j27106K41089
3204.6E41736717k96974o40907j230278q40836k76260o03829J92948J2626l13034J49689
3214.3E37889862j93443m57878q34923j037216o70052l96728k13242l57819m63447
3222.9E33265114J26152L9329l68843m87289p57141k00234k54516q12950m91372j81732
3232.6E29876518k43110l70255l50418o89697p06787k53792l02353o71692m75044k83432
3242.2E25529938l70980Q6098m69780q08220l0174j38473o53649o25191k80685m55780
3251.9E21783104m44527p59964p74307k50969n68466k86713k15988j63612k34680m27361
3261.5E17656517j35269r12666j077538o39801n31654k24648l5133k41204o0539L03765
$$ plain form
3194 545275726 544379120 543881187 542970467 542364578 542364655 542605476 542574120 542149620 541622734 541495628 541736717
3204.6 541736717 541439743 540798836 539568558 538727722 538451462 537847633 538040581 538053207 537740173 537889862
3214.3 537889862 537696419 537238541 536403618 535366402 534696350 534299622 534086380 533728561 533265114
3222.9 533265114 533391266 533430595 533061752 532574463 531817322 531617088 531362572 530549622 530058250 529876518
3232.6 529876518 529633408 529263153 528912735 528223038 527516251 527262459 526960106 526288414 525813370 525529938
3242.2 525529938 525158958 525245056 524775276 523967056 523936882 523798409 523144760 522519569 522238884 521783104
3251.9 521783104 521338577 520578613 519804306 519553337 518984871 518698158 518482170 518318558 518083878 517656517
3261.5 517656517 517521248 516608582 515531044 514891243 514359589 514134941 514099808 513858604 513798065 514101830
3271.2E14101830l89901o95495r34296o13060l03612q16421n36308o87409l95164j45035
3280.8E08585129j79825L395m11110l62053n68352m92706l98216r31854q37860j15929
3290.4E04290619L5438k97546j16157k48147K9908q6174n77851n03845n93643m84390
3300.1E01448212n84069J72921M12445R2964P2861n54886J0872K64968n95779j265182
3309.7D99475327q75206l95012l95813J38168k17896k70195K44790J03607m13361l99895
3319.4D96994514j86004l06664k10876j455574j153031J44120j54801J85471J22337
3328.1D93979492j755m25262q28438n64041o76880p30705p78504j06048Q2931o02035
3337.7D89348755j118813q99696l357K6932p36542j131287m58374n54580r07936m47274
$$ plain form
3271.2 514101830 513711929 513016434 512082138 511469078 511165466 510349045 509812737 509125328 508730164 508585129
3280.8 508585129 508405304 508408699 507997589 507635536 507067184 506574478 506176262 505244408 504406548 504290619
3290.4 504290619 504326057 504028511 503912354 503664207 503694115 503607941 503030090 502526245 501932602 501448212
3300.1 501448212 500864143 501037064 501449509 501542473 501615334 501060448 501071320 501336288 500740509 499475327
3309.7 499475327 498600121 498205109 497809296 497947464 497729568 497459373 497704163 497807770 497394409 496994514
3319.4 496994514 496808510 496501846 496290970 494835396 493682365 493826485 493671684 493857155 493979492
3328.1 493979492 493977737 493552475 492724037 492159996 491483116 490752411 489973907 489867859 489950790 489348755
3337.7 489348755 488229942 487330246 487326889 487353821 486617279 485485992 485027618 484473038 483565102 483117828
3347.3D83117828l47633k73247o48002o11267j67275k31628n81704q39576m60282l52935
3357D78604279q49343o32438J28936k41661l84521j60141k80075l82920m89425J79252
3366.6D75491943m14314q04176l01209n09453p05490j032219p057M44679j57699k27203
3376.3D71777802k3461J75171m15115l62625l75748j92299k90947p10144K86026L13797
3385.9D70182457r2392M2648K17705m78897r13429k22740q09517o55060M56505L58047
3395.6D68085327l22876k1782L91426m13894o47621k87629j62201l76777j41220l82347
3405.2D65720406n82085L89862L87115k4642m34075l204J80053p31010p92770n26657
3414.8D63582993N01365K77443p79762l37486K0637q7433j62773L05939j3619m02031
$$ plain form
3347.3 483117828 482770195 482496948 481848946 481237679 481070404 480838776 480257072 479417496 478957214 478604279
3357 478604279 477754936 477122498 477251434 477009773 476625252 476465111 476185036 475802116 475312691 475491943
3366.6 475491943 475077629 474273453 473972244 473462791 472757301 471725082 471718025 472162704 472005005 471777802
3376.3 471777802 471754341 471929512 471514397 471151772 470776024 470583725 470292778 469582634 469868660 470182457
3385.9 470182457 470090065 470132713 470350418 469871521 468958092 468735352 467925835 467270775 467727280 468085327
3395.6 468085327 467762451 467740669 468132095 467718201 467070580 466782951 466620750 466243973 466102753 465720406
3405.2 465720406 465138321 465528183 465915298 465890656 465456581 465453377 465633430 464902420 464109650 463582993
3414.8 463582993 464084358 464361801 463582039 463244553 463265190 463177757 463014984 463320923 463307304 462905273
3424.5D62905273j62735k34756j1406q2550p4997O1569K7504J8692j24626J3924P858
3435.1D62343750j39847j03798k35405j57089p4539l14331J80855O38733K32772l22952
3444.7D62048149K5063R04464K49405J51291L09372J36910L56712l99361l84063j99433
3454.4D63198509q4266O73179R77631L49998n41649J49041O05163L00827J41182N8975
3464D65828590n2261J80473J082764M99115L08495P99141N47904K23008l17040J44882
3473.7D69245071P94602P03239K00119R6970L79257O58760Q35114N48935P98263M24423
3483.3D74684753K37885M21791L30315O58950J87340L03841J137695J507416J145325
3492D80615311O38733O56089N0660l05939N69458J245918O14586M13322L26081M96750
$$ plain form
3424.5 462905273 462742538 462507782 462496376 462413826 462338829 462400398 462427902 462446594 462321968 462335892 462343750
3435.1 462343750 462203903 462100105 461864700 461707611 461633072 461318741 461499596 462138329 462371101 462048149
3444.7 462048149 462073212 462977676 463227081 463378372 463687744 463824654 464181366 463782005 463397942 463198509
3454.4 463198509 463114243 463787422 464765053 465115051 464573402 464722443 465327606 465628433 465769615 465828590
3464 465828590 465776329 465956802 467039566 467538681 467847176 468646317 469194221 469417229 469100189 469245071
3473.7 469245071 470039673 470742912 470943031 471040001 471419258 472078018 472913132 473462067 474260330 474684753
3483.3 474684753 474922638 475344429 475674744 476333694 476521034 476824875 477962570 479469986 480615311
3492 480615311 481254044 481910133 481960793 481654854 482224312 483470230 484084816 484498138 484824219 485320969
3501.6D85320969J563758Q94661M88816Q76388M39415O50788J551132J180992L35312
3510.3D93302231M65050O2103R06525J317329R65843J121636R59625J103897L94173
3519E00598412N05867Q30497R39293R90067L53431J007500P51763J206932J630172
3527.7E08813934P56111N39361P51266J038818O64711J237564J015969Q08067O94580
3536.4E16320381J5869J485443J742707Q69522O04286J337357J132278P79533J165810
3545E25453186N09720J576614P46155O89659J285935J252327J974334M9706N24864
3553.7E34062500Q23135R00307J835098J041527J210899Q93212O71348J71318J229134
3562.4E42838478K012367J514511K965699J059608r2468m36592p9003K876282J910782
$$ plain form
3501.6 485320969 486884727 487779388 488268204 489144592 489584007 490234795 491785927 492966919 493302231
3510.3 493302231 493767281 493829384 494735909 496053238 497019081 498140717 499100342 500204239 500598412
3519 500598412 501104279 501934776 502874069 503864136 504217567 505225067 505976830 507183762 508813934
3527.7 508813934 509570045 510109406 510860672 511899490 512564201 513801765 514817734 515625801 516320381
3536.4 516320381 516336250 517821693 519564400 520433922 521038208 522375565 523507843 524287376 525453186
3545 525453186 525962906 527539520 528285675 528975334 530261269 531513596 533487930 533537636 534062500
3553.7 534062500 534885635 535785942 537621040 538662567 539873466 540766678 541438026 541609344 542838478
3562.4 542838478 544850845 546365356 549331055 550390663 550298195 549861603 549782600 552658882 554569664
3571.1E54569664J323128J423416J422615O45409L50265J673584J401405J692658J364441
3579.7E65866585O58645J169358J615524J160126R69238K746315P62482O7482L542747
3588.4E78558502N65300M92668J268387K340164K000847K08779J593895k19231J262894
3597.1E88072205K837944J196212K213784P61718N82695K270394J448440J391907K164230
3605.8F02939529K015267j26763K024994L72734l4751N254325J821480j521148K901153
3614.5F15646820J241264K106400K316704J095390J130142j86729J445083J971131
3622.2F26766205J789169K061691K131424K126503J720086L857345L369751n953674
3629.9F37868500J156616L316193L171081J438065j44043J565475J740113J773452
$$ plain form
3571.1 554569664 555892792 557316208 558738823 559384232 559734497 561408081 562809486 564502144 565866585
3579.7 565866585 566525230 567694588 569310112 570470238 571439476 574185791 574948273 575015755 578558502
3588.4 578558502 579123802 579616470 580884857 583225021 585225868 585434647 587028542 586809311 588072205
3597.1 588072205 590910149 592106361 594320145 595081863 595664558 597934952 599383392 600775299 602939529
3605.8 602939529 604954796 604828033 606853027 607225761 607191010 612445335 614266815 612745667 615646820
3614.5 615646820 616888084 618994484 621311188 622406578 623536720 623349991 624795074 626766205
3622.2 626766205 628555374 630617065 632748489 634874992 636595078 640452423 643822174 637868500
3629.9 637868500 639025116 642341309 645512390 646950455 646806412 648371887 650112000 651885452
3637.6F51885452J736527J682205J650009K102051J442413l0594J350556K255249M226455
3646.3F68300323K093049k338105L206406Q51593j343918m75616K777939K813186K316895
3655F78201752L320160l757935N50919K771682J338120K178421P88879J317978P67899
3663.6F87477875J203613J224136l51944K442704K193603m22134J27563k197342J282349
3672.3F92980423L974991M727249J452026j0415344J210480N679855K450943j311569
3680G00749054J35727J380539J228103P53479P58667j70135J092071L756104l396988
3688.7G06286621k318497M847031j905060j128387K788772O8817N44816R51309m59214
3697.4G09676208O17371N12924J126023J690673k788085j332474K781982R60388m48074
$$ plain form
3637.6 651885452 653621979 655304184 656954193 659056244 660498657 660468063 661818619 664073868 668300323
3646.3 668300323 670393372 668055267 671261673 672113266 670769348 670293732 673071671 675884857 678201752
3655 678201752 681521912 677763977 678314896 681086578 682424698 684603119 685391998 686709976 687477875
3663.6 687477875 688681488 689905624 689553680 691996384 694189987 693767853 693895416 691698074 692980423
3672.3 692980423 696955414 701682663 703134689 692719345 693929825 699609680 702060623 700749054
3680 700749054 700884781 702265320 703493423 704246902 705005569 704835434 705927505 709683609 706286621
3688.7 706286621 703968124 708815155 706910095 705781708 708570480 708639297 709184113 710135422 709676208
3697.4 709676208 710293579 710806503 711932526 713623199 710835114 709502640 712284622 713245010 712796936
3706.1G12796936k89993J683731L047561m510498O81153J869964p215957K904358K513275
3714.8G13480530K11181O36063J627197J692581j840896j59760K557755k428589k650528
3723.4G13125534L011322J192246l72239j558456l42636J442947L33100M270706o85883
3732.1G20416641o294784N632248J958465o128006r1705Q98666L0213J294861K064132
3740.8G19780731j794815R01871O008606o011200r754105O056290L079605K713394
3748.5G20980377j111679n377807O295318j426697m558410K555313K118225J820297
3756.2G21294937l325882L24173L671036l359604k443848J957093J292038M32586K433319
3764.9G22275848q31070l110427L58276J621017L08915l774033J543427J575698k06070
$$ plain form
3706.1 712796936 712506943 714190674 717238235 712727737 713408890 715278854 708062897 710967255 713480530
3714.8 713480530 713691711 714327774 715954971 717647552 715806656 715646896 718204651 715776062 713125534
3723.4 713125534 716136856 717329102 716956863 715398407 715055771 716498718 716831818 721102524 720416641
3732.1 720416641 714121857 719754105 721712570 715584564 715492859 716391525 716421738 717716599 719780731
3740.8 719780731 717985916 718887787 724896393 718885193 709131088 715187378 718266983 720980377
3748.5 720980377 719868698 714490891 720786209 719359512 714801102 717356415 719474640 721294937
3756.2 721294937 717969055 718293228 721964264 718604660 716160812 718117905 719409943 719842529 722275848
3764.9 722275848 721444778 718334351 718692627 720313644 720622559 716848526 718391953 719967651 719761581
3773.6G19761581J11313r5749O39420r04617J008072R91821l679276Q72193J150131
3782.3G19854889R14307J095275j451110p80106Q2703P41272O79855o34232m23736
3790.9G20079117N4626N91584o6834j3275J553497j438293k411194Q55331K017670
3799.6G21222229L675461j690064o297073J492386J084213J429291K771683l803330
3807.3G19884796k777557K263412Q66089j16806J120606Q88061k49329J913605R85489
3816G24778366o784668O77567K342453K559280J248169q613892L25089K507095O82221
3824.7G19721680J067199L85209k284241n1193J129226J939316J845322n098877O62689
3833.4G19316330M012833l613892l54538M342728o116486l796692N571823l31421q09631
$$ plain form
3773.6 719761581 719872894 719777145 720416565 719511948 720520020 721511841 717832565 718704758 719854889
3782.3 719854889 720769196 721864471 720413361 719633255 719715958 720457230 721137085 720502853 720079117
3790.9 720079117 720133743 720725327 720658493 720645218 722198715 720760422 718349228 719204559 721222229
3799.6 721222229 724897690 723207626 716910553 718402939 719487152 720916443 723688126 719884796
3807.3 719884796 717107239 719370651 720236740 720119934 721240540 722128601 721879272 723792877 724778366
3816 724778366 717993698 718671265 721013718 723572998 724821167 716207275 716532364 719039459 719721680
3824.7 719721680 720788879 721174088 718889847 718838654 719967880 721907196 723752518 718653641 719316330
3833.4 719316330 723329163 719715271 719360733 723703461 717586975 713790283 719362106 719030685 718221054
3842.1G18221054L013687j033096j708679J339416L27301r17129L48205k82211O23703
3850.7G19932251K495956k284774K584838p173080j192856N669556j52512j612167
3858.4G18267212L91235P53250J246643k646484n63202L002472k419433l126450K018127
3867.1G16923370K744828L598480k978974o603927J132049K786560K013550l928985
3874.8G15686951O33773K600403o09512L10822K436141k257843l387985L166580J37406
3883.5G18716736k0371L219910n976334r88159J113739R9869K351990P14569l307724
3892.2G15924225l30353J372910m74854L28064N90973J393890J155167n078964K248382
3900.9G17129440R35517l773804K500076j064605j487427Q9721m20074O72989P87887
$$ plain form
3842.1 718221054 721234741 720201645 718492966 719832382 720159683 719242554 719590759 719308548 719932251
3850.7 719932251 722428207 720143433 722728271 715555191 714362335 720031891 719879379 718267212
3858.4 718267212 718658447 719411697 720658340 718011856 717448654 720451126 718031693 714905243 716923370
3867.1 716923370 719668198 723266678 720287704 713683777 714815826 717602386 719615936 715686951
3874.8 715686951 716320724 718921127 718311615 718622437 721058578 718800735 715412750 718579330 718716736
3883.5 718716736 718696365 721916275 715939941 714951782 716065521 716165390 718517380 719231949 715924225
3892.2 715924225 715593872 716966782 716491928 716819992 717410965 718804855 719960022 714881058 717129440
3900.9 717129440 718064957 714291153 716791229 715726624 714239197 714328918 713908844 714581833 715369720
3909.6G15369720L08228k23770M89578K80686p00989l31421J009064q27332k279129
3918.2G13094635J784668K48947k159653M88968N36347J227264J07269j663284K16065
3926.9G13881226O33850K37121j027679j74027J381455q28171j270828p9727m28620
3935.6G12324600j6784J006698K57263o38199m39224M97513J148453j717148r81979
3944.3G11441193O38656M38614J197662q27255l50113K58408j058579M66767K73666
3953G12479019k98996o71692j35040M85382p0114L9902l96576M11453J58997o63987
3962.6G11338348K05460j11542k32467j67695j41525o332L75900P86743q3542j001739
3972.2G10961609k74506N29785L28904J61209r75571m36783Q22449J30844K12708n0812
$$ plain form
3909.6 715369720 715677948 715454178 715943756 716224442 715523453 715192032 716201096 715373764 713094635
3918.2 713094635 714879303 715128250 712968597 713457565 713993912 715221176 715328445 713665161 713881226
3926.9 713881226 714515076 714752197 713724518 713550491 714931946 714103775 712832947 712753220 712324600
3935.6 712324600 712307816 713314514 713571777 712933578 712494354 712991867 714140320 712423172 711441193
3944.3 711441193 712079849 712518463 713716125 712888870 712538757 712797165 711738586 712205353 712479019
3953 712479019 712180023 711508331 711373291 711858673 711788559 711828461 711431885 711843338 712002335 711338348
3962.6 711338348 711543808 711432266 711199799 711032104 710890579 710884247 711260147 712046890 711963348 710961609
3972.2 710961609 710687103 711216888 711545792 711707001 710731430 710294647 711117096 711247940 711460648 711409836
3981.9G11409836n24292j6251J45493n13382l57590L68271l7231J26495l77350l29895
3991.5G09894104M83932j67007K15073K05612n90592l45230n7373n20706k54059
4000.2G08863754
$$ plain form
3981.9 711409836 710885544 710869293 711014786 710501404 710143814 710512085 710474854 710601349 710223999 709894104
3991.5 709894104 710378036 710211029 710426102 710631714 710041122 709695892 709638519 709117813 708863754
4000.2 708863754
##END=$$ End of the data block
