##TITLE=$$ Begin of the data block
##JCAMP-DX=5.00 $$ ACD/SpecManager v 10.08
##SPECTROMETER/DATA SYSTEM=16PC
##DATE=Fri Sep 13 14:43:46 2013
##DATA TYPE=INFRARED SPECTRUM
##DATA CLASS=XYDATA
##ORIGIN=
##OWNER=
##NPOINTS=3601
##FIRSTX=400.00000000
##LASTX=4000.00000000
##MAXX=4000.00000000
##MINX=400.00000000
##MAXY=42.25753784
##MINY=11.62489223
##XFACTOR=1.0000000000
##YFACTOR=0.000000100000000
##FIRSTY=23.35121536
##DELTAX=1.00000000
##XUNITS=1/CM
##YUNITS=TRANSMITTANCE
##XYDATA=(X++(Y..Y))
400B33512154N7270126M4407959K8276024J3773804M133796j08948o61392m921J05782
$$ 233512154 290782280 335190239 363466263 377240067 381373863 381264915 380603523 380598602 380704384
409C80704384o70357j607094j839752j144104o4735N85365L94325l24440p62138k04926
$$ 380704384 380034027 378426933 376587181 375443077 375378342 375963707 376358032 376033592 375271454 375066528
419C75066528J452523L603057N272065N657196M529419K295379k40974k242928l135910
$$ 375066528 376519051 380122108 385394173 391051369 395580788 397876167 397635193 395392265 392256355
428C92256355k758026j371689M17328J826973K150650J050987j227531l872948n811424
$$ 392256355 389498329 388126640 388543968 390370941 392521591 393572578 392345047 388472099 382660675
437C82660675o196899m845467k354469J78909J710281J764412O34575q33816j730652
$$ 382660675 376463776 371618309 369263840 369442749 371153030 372917442 373552017 372718201 370987549
446C70987549j552811m09050J117783K325401K740974K287407J228486j8349j071739
$$ 370987549 369434738 369025688 370143471 372468872 375209846 377497253 378725739 378707390 377635651
455C77635651j690407j793633j439590q01926j36833K83623K77214j47171p65534j235466
$$ 377635651 375945244 374151611 372712021 371910095 371773262 372056885 372334099 372186928 371421394 370185928
465C70185928j283722q82339k99225K6398k71874j260833k630921l823051m287987
$$ 370185928 368902206 368019867 367720642 367747040 367475166 366214333 363583412 359760361 355472374
474C55472374l743858k288018l22532J652946L259812M357528N018311N404739N633583
$$ 355472374 351728516 349440498 349117966 350770912 354030724 358388252 363406563 368811302 374444885
483C74444885N707207N534019N012780M120559K958107J729889O75431j9646k92931
$$ 374444885 380152092 385686111 390698891 394819450 397777557 399507446 400182877 400163231 399870300
492C99870300k31704m1466L3722j86768p37266j485443k186890k601357k613983k297554
$$ 399870300 399638596 399597130 399630852 399444084 398706818 397221375 395034485 392433128 389819145 387521591
502C87521591j881103j629677j698036k034569k390747k436333j924515q26683O36025
$$ 387521591 385640488 384010811 382312775 380278206 377887459 375451126 373526611 372699928 373335953
511C73335953K076187L100929L474732L208313K540435J824417J376153J346588J673469
$$ 373335953 375412140 378513069 381987801 385196114 387736549 389560966 390937119 392283707 393957176
520C93957176K122841K398682K274666J692924P91664j48086q18673j016502p36313
$$ 393957176 396080017 398478699 400753365 402446289 403237953 403089867 402271194 401254692 400518379
529D00518379j81656L16506M46319O4583p20749j582107k112160k014008j255378j05362
$$ 400518379 400336723 400653229 401099548 401164131 400443382 398861275 396749115 394735107 393479729 393374367
539C93374367R70611J516228J295967M11797p35398j626587j862487j346283l26844
$$ 393374367 394344978 395861206 397157173 397568970 396833572 395206985 393344498 391998215 391671371
548C91671371P23343J330376J238823N20630m74510j298409j620636j372032p48062
$$ 391671371 392394714 393725090 394963913 395484543 395010033 393711624 392090988 390718956 389970894
557C89970894q1291L43017M24690K68708Q8844N9090K05078L95546M31862J75628l63617
$$ 389970894 389889603 390232620 390657310 390926018 391014862 391073952 391279030 391674576 392106438 392282066 391918449
568C91918449j026153j579552j824226j671562j165734m56390K51922P51381Q79975
$$ 391918449 390892296 389312744 387488518 385816956 384651222 384194832 384446754 385198135 386078110
577C86078110N71251j03951r28993j593819j810493j450997o33812K97585R15604R04235
$$ 386078110 386649361 386545410 385616417 384022598 382212105 380761108 380127296 380424881 381340485 382244720
587C82244720K15836q97026j990013k620926k534905j757659n66750O29044J440315
$$ 382244720 382460556 381563530 379573517 376952591 374417686 372660027 372093277 372722321 374162636
596C74162636J621856J136857J55143j005211j976127k452736k290230j545219m41704
$$ 374162636 375784492 376921349 377076492 376071281 374095154 371642418 369352188 367806969 367365265
605C67365265P25670J712188K403679K820130L049125L154297L121033K872353K346077
$$ 367365265 368090935 369803123 372206802 375026932 378076057 381230354 384351387 387223740 389569817
614C89569817J575012P19757K0523l07503j80778L02925R01031J332817J404114J091652
$$ 389569817 391144829 391864586 391885109 391577606 391396828 391699753 392600784 393933601 395337715 396429367
624C96429367N44891P363l05214l12500j06774R5902O9962k95029r23844j575584j946144
$$ 396429367 396974258 396981621 396676407 396363907 396257133 396353035 396422997 396127968 395204124 393628540 391682396
635C91682396j808853j123772o8855J025276J805687K036400J692085R62257J68763
$$ 391682396 389873543 388749771 388680916 389706192 391511879 393548279 395240364 396202621 396371384
644C96371384l74832m98810k48986J44043L88375K86979j57356p46498j207046j351166
$$ 396371384 395996552 395497742 395248756 395392799 395781174 396068153 395910797 395164299 393957253 392606087
654C92606087j181793q71048o25763n30968m88243k99874J50338P48367J155739R92470
$$ 392606087 391424294 390553246 389927483 389396515 388908272 388608398 388758736 389507103 390662842 391655312
664C91655312R4719j320839k710343l462410l218460k062569m66995R67636J815415
$$ 391655312 391750031 390429192 387718849 384256439 381037979 378975410 378508415 379476051 381291466
673C81291466J993294J714706J289253R21631O38542L68386Q4037j17683o8550L24325
$$ 381291466 383284760 384999466 386288719 387210350 387848892 388217278 388301315 388183632 388115082 388439407
683C88439407R52225J506538J624642J099777K4300j227951k173195k452393k001343
$$ 388439407 389391632 390898170 392522812 393622589 393646889 392418938 390245743 387793350 385792007
692C85792007j069450q9188N32532N95284J78299m15078q09555p31620j34316P79839
$$ 385792007 384722557 384633369 385165901 385761185 385939484 385524406 384714851 383983231 383848915 384628754
702C84628754J644210K086754J894379J113892L9787r07936j364327j178817m80690
$$ 384628754 386272964 388359718 390254097 391367989 391407776 390499840 389135513 387956696 387476006
711C87476006L81431R96056J073646N73998k78168j097145j511116j329880o32286
$$ 387476006 387857437 388853493 389927139 390501137 390222969 389125824 387614708 386284828 385652542
720C85652542K69928R73053J166039P72934j2475q18519j271134j168174n70870K31171
$$ 385652542 385922470 386895523 388061562 388834496 388822021 388003502 386732368 385564194 384993324 385224495
730C85224495Q61816J036263O88019j4115p59735j253776j355858j137963q35495p22274
$$ 385224495 386086311 387122574 387810593 387796478 387036743 385782967 384427109 383289146 382453651 381731377
740C81731377r66149j541252k230797k724991k764434k263718j359253l58353L87383
$$ 381731377 380765228 379223976 376993179 374268188 371503754 369240036 367880783 367522430 367909813
749C67909813O23588K88620m75349j396027k187042k654114k749443k560653k250595
$$ 367909813 368533401 368822021 368346672 366950645 364763603 362109489 359360046 356799393 354548798
758C54548798j980286j849022j869278j981583k098274k157516k162819k193146k369537
$$ 354548798 352568512 350719490 348850212 346868629 344770355 342612839 340450020 338256874 335887337
767C35887337k792435l476868m315261n098992n593204n632954n199471m432239l571949
$$ 335887337 333094902 329618034 325302773 320203781 314610577 308977623 303778152 299345913 295773964
776B95773964k858524k434655k297668k318974k316227k137527j719170j094150l58582
$$ 295773964 292915440 290480785 288183117 285864143 283547916 281410389 279691219 278597069 278238487
785B78238487L81565J052437J627007K112388K524796K869682L136521L308754L377304
$$ 278238487 278620052 279672489 281299496 283411884 285936680 288806362 291942883 295251637 298628941
794B98628941L348941L244267L090916K916851K751464K628384K583256K642841K806130
$$ 298628941 301977882 305222149 308313065 311229916 313981380 316609764 319193020 321835861 324641991
803C24641991L030128L235169L333397L270263L058129K777633K544022K447586K502403
$$ 324641991 327672119 330907288 334240685 337510948 340569077 343346710 345890732 348338318 350840721
812C50840721K629433K687225K538910K122803J491775Q02803K56806J6975J41297
$$ 350840721 353470154 356157379 358696289 360819092 362310867 363113670 363370476 363387451 363528748
821C63528748N59730J105042J586570J868973J923027J822014J686363J607743J589775
$$ 363528748 364088478 365193520 366780090 368649063 370572090 372394104 374080467 375688210 377277985
830C77277985J544304J345138R11102K77405l93867q70400r53407n76210J50986R77478
$$ 377277985 378822289 380167427 381078529 381355934 380962067 380091667 379138260 378562050 378713036 379690514
840C79690514J611137J840134J619835J088028N03196J32179J37864N13305J088715
$$ 379690514 381301651 383141785 384761620 385849648 386352844 386485023 386622887 387136192 388224907
849C88224907J609459J846962J694794J208076N69000l242l51715m46396l79982l05481
$$ 388224907 389834366 391681328 393376122 394584198 395153198 395149956 394798241 394351845 393971863 393666382
859C93666382l45612n24025p50770q66432p23534k64740M38957J204491J803093K046203
$$ 393666382 393320770 392796745 392045975 391179543 390456009 390191269 390630226 391834717 393637810 395684013
869C95684013J861611J324157O32287L5896k58942j69334K35138P64923J193809J356125
$$ 395684013 397545624 398869781 399502068 399537964 399279022 399109688 399344826 400109749 401303558 402659683
879D02659683J216049Q76656N26543L50456M42238P63206J160202J435051J438065
$$ 402659683 403875732 404752388 405278931 405629387 406071625 406834831 407995033 409430084 410868149
888D10868149J138496O46553J70937p2518L9444M68827J022834J430436J466446J062774
$$ 410868149 412006645 412653198 412824135 412751617 412791061 413259888 414282722 415713158 417179604 418242378
898D18242378L51601l84560q39576q25463l63388L25966R25407J169243R65042M29917
$$ 418242378 418593979 418209419 417369843 416544380 416180992 416506958 417432365 418601608 419566650 419996567
908D19996567j70746n51071n36156j37329M57954R75113J175499R59015M06532k58712
$$ 419996567 419825821 419274750 418738594 418601265 419059219 420034332 421209831 422168846 422575378 422316666
918D22316666p66831r17854o66809j40877M14543P44209O93398K75040l37258q85658
$$ 422316666 421549835 420631981 419965172 419824295 420238838 420983047 421676445 421951485 421614227 420728569
928D20728569j143723j014671n74074l3683L53851M10156J12000l97492q74519j086960
$$ 420728569 419584846 418570175 417996101 417962418 418316269 418726425 418838425 418440933 417566414 416479454
938D16479454r25598m59213R1095M51088M18129m2038p77626j516037j984520k027245
$$ 416479454 415553856 415094643 415185738 415636826 416054955 416012917 415235291 413719254 411734734 409707489
948D09707489j666260j078605n07622j48735o7368j78947l00751k42386J01090O95648
$$ 409707489 408041229 406962624 406455002 406306267 406238899 406059952 405759201 405516815 405617905 406313553
958D06313553J376343J910057K089843J824685J183548L77197l20778o84509o30226
$$ 406313553 407689896 409599953 411689796 413514481 414698029 415075226 414754448 414069939 413439713
967D13439713k51809K20337N24750M88739J09749m42658r06677j050491p82852j97258
$$ 413439713 413187904 413408241 413932991 414421730 414531479 414088821 413182144 412131653 411348801 411151543
977D11151543M67415R32235R98764O33621k0065p06634j166764j244354r46388m35028
$$ 411151543 411618958 412551193 413549957 414183578 414163513 413456879 412290115 411045761 410099373 409664345
987D09664345M6921K82058J69030k36855p53403j156654j282539j100464p24144l57170
$$ 409664345 409711266 409993324 410162354 409925499 409172096 408015442 406732903 405632439 404908295 404551125
997D04551125j96495l42179p51571j260529j659737j789741j612091j222115q04252
$$ 404551125 404354630 404012451 403260880 402000351 400340614 398550873 396938782 395716667 394912415
1006C94912415n45235n51148q02192j165886j460228j539803j360626r99451o14853
$$ 394912415 394367180 393816032 393013840 391847954 390387726 388847923 387487297 386487846 385872993
1015C85872993l71933l63006n62935q38432j008225r25178n46189M4594O67725J122970
$$ 385872993 385501060 385138054 384575119 383736687 382728462 381803284 381257095 381301689 381969414 383092384
1025C83092384J273117J103135P24258L26118R1897J16577L63731O80351Q67882P73773
$$ 383092384 384365501 385468636 386192894 386519012 386610909 386727486 387091217 387771568 388639450 389413223
1035C89413223L67737k37007q28247j184807j173325q08830k48833K74277N51529M86145
$$ 389413223 389780960 389543953 388715706 387530899 386357574 385548744 385299911 385574188 386125717 386611862
1045C86611862J30463l40691p10106q13293o11725k07596K00043M05235K85301j42669
$$ 386611862 386742325 386401634 385691528 384878235 384266510 384058914 384258957 384664192 384949493 384806824
1055C84806824p30171j265946j572914j590881j403237j195259j164818j427421j965180
$$ 384806824 384076653 382810707 381237793 379646912 378243675 377048416 375883598 374456177 372490997
1064C72490997k640953l269882l711281l934784m029693m159584m485360n097274n984269
$$ 372490997 369850044 366580162 362868881 358934097 354904404 350744820 346259460 341162186 335177917
1073C35177917p048263q151283r168053j0020866j0684853j1166973j1473103j1581554
$$ 335177917 328129654 319978371 310810318 300789452 290104599 278937626 267464523 255882969
1081B55882969j1435433j0957222j0079555q776302p082196n092182k943001p91263
$$ 255882969 244447536 233490314 223410759 214634457 207552261 202460079 199517078 198725815
1089A98725815J205349K894935M139233M831963M937019M533939L844452L207474K993431
$$ 198725815 199931164 202826099 206965332 211797295 216734314 221268253 225112705 228320179 231313610
1098B31313610L475533M713897O508847Q456192J0089111J1045093J1182995J0598584
$$ 231313610 234789143 239503040 246011887 254468079 264557190 275602283 286785278 297383862
1106B97383862R542999Q292789P046852N893479M852562L944664L234443K812577K732277
$$ 297383862 306926861 315219650 322266502 328159981 333012543 336957207 340191650 343004227 345736504
1115C45736504K945785L292389L555069L561401L271447K800674K362785K158013K269630
$$ 345736504 348682289 351974678 355529747 359091148 362362595 365163269 367526054 369684067 371953697
1124C71953697K617607K997628L177642L007737K485427J750679J016999M74319K11754
$$ 371953697 374571304 377568932 380746574 383754311 386239738 387990417 389007416 389481735 389693489
1133C89693489J89667K71034K92854J39695k08092o73714j126289j441231j554031
$$ 389693489 389883156 390154190 390447044 390586739 390378647 389704933 388578644 387137413 385583382
1142C85583382j480294j296157j091843r21288p75642n94025l04985J19324O29425
$$ 385583382 384103088 382806931 381715088 380793800 380018158 379424133 379119148 379238472 379867897
1151C79867897J100273J375199J332206R40628K82288m76074j149330j608963j834984
$$ 379867897 380968170 382343369 383675575 384616203 384898491 384422417 383273087 381664124 379829140
1160C79829140j918831k017708k276802k754555l381805l973236m289360m125634l396530
$$ 379829140 377910309 375892601 373615799 370861244 367479439 363506203 359216843 355091209 351694679
1169C51694679k180748p09266P03544J762238K288246K277145J890679J387558J018905
$$ 351694679 349513931 348804665 349508209 351270447 353558693 355835838 357726517 359114075 360132980
1178C60132980R33419J126670J457444J716919J721878J389351P66563M692p04040
$$ 360132980 361066399 362193069 363650513 365367432 367089310 368478661 369245224 369249916 368545876
1187C68545876j200142j409760j358108j144181q91494o99006o14051o35529p43141
$$ 368545876 367345734 365935974 364577866 363433685 362542191 361843185 361229134 360593605 359850464
1196C59850464r30252j222306j668586k308655l138886m096221n074501n968514o719780
$$ 359850464 358920212 357697906 356029320 353720665 350581779 346485558 341411057 335442543 328722763
1205C28722763p342567p912045q520946r230061j0033646j0861110j1605072j2160187
$$ 328722763 321380196 313468151 304947205 295717144 285683498 274822388 263217316 251057129
1213B51057129j2447720j2416095j2024041j1226768r981842q283749o208133l938485
$$ 251057129 238609409 226193314 214169273 202942505 192960663 184676914 178468781 174530296
1221A74530296j748180P0381J308174J929531K104683K158852K453575L247108M594880
$$ 174530296 172782116 172852497 174160671 176090202 178194885 180353737 182807312 186054420 190649300
1230A90649300O336345Q167973R766502J0902291J1493873J1591072J1311951J0776672
$$ 190649300 196985645 205153618 214920120 225822411 237316284 248907356 260219307 270995979
1238B70995979J0075703R276943Q453236P696018P098351O714096O521568O417007
$$ 270995979 281071682 290348625 298801861 306497879 313596230 320310326 326831894 333248901
1246C33248901O254425N909234N337333M596062L813400L122063K590980K188797J800080
$$ 333248901 339503326 345412560 350749893 355345955 359159355 362281418 364872398 367061195 368861275
1255C68861275J286049N60340l56559j335411k187081k742233k923355k773743k432785
$$ 368861275 370147324 370707664 370351105 369015694 366828613 364086380 361163025 358389282 355956497
1264C55956497k073135j830216j760406j842842k017250k234230k490387k831803l327636
$$ 355956497 353883362 352053146 350292740 348449898 346432648 344198418 341708031 338876228 335548592
1273C35548592m027558m924469n935745o912918p676506q062859p971210p391491o404038
$$ 335548592 331521034 326596565 320660820 313747902 306071396 298008537 290037327 282645836 276241798
1282B76241798n150795l789482k448654j200676o0577R95350K000579K973557L903160
$$ 276241798 271091003 267301521 264852867 263652191 263591614 264586964 266587543 269561100 273464260
1291B73464260M749146N453891N961247O238193O285820O133080N810299N315666M596500
$$ 273464260 278213406 283667297 289628544 295866737 302152557 308285637 314095936 319411602 324008102
1300C24008102L569832K182694M90684j294365k825012l717956l697167k715568r94053
$$ 324008102 327577934 329760628 330251312 328956947 326131935 322413979 318716812 316001244 315007191
1309C15007191J043510K914982M236526M826890M722747M112358L228035K249756J257973
$$ 315007191 316050701 318965683 323202209 328029099 332751846 336864204 340092239 342341995 343599968
1318C43599968K46391q19626j931266k986832l790932m107399l745613k643967r10301
$$ 343599968 343846359 343026733 341095467 338108635 334317703 330210304 326464691 323820724 322910423
1327C22910423J199532L352547N227088O579590P274781P283439O674843N610352M333686
$$ 322910423 324109955 327462502 332689590 339269180 346543961 353827400 360502243 366112595 370446281
1336C70446281L132821K264442J863861J884537K117233K290077K205124J833763J312447
$$ 370446281 373579102 375843544 377707405 379591942 381709175 383999252 386204376 388038139 389350586
1345C89350586Q42476N55420M33616L35350J07155k94418p58514j089859j150589r87778
$$ 389350586 390193062 390748482 391182098 391517448 391624603 391330185 390571671 389481812 388331223 387343445
1355C87343445q56743j113625k028083l610230n545311p276687q202286p904358o316605
$$ 387343445 386486702 385373077 383344994 379734764 374189453 366912766 358710480 350806122 344489517
1364C44489517l761062q45070J740722L445130M017982L554268K412567J051598j43967
$$ 344489517 340728455 339883385 341624107 345069237 349087219 352641487 355054054 356105652 355961685
1373C55961685r74846j438598j656189j765633j844177j894646j886940j811943j701584
$$ 355961685 354986839 353548241 351892052 350126419 348282242 346387596 344500656 342688713 340987129
1382C40987129j599273j503678j334610r59816k79693O76727J711197K510795K785874
$$ 340987129 339387856 337884178 336549568 335589752 335310059 335986786 337697983 340208778 342994652
1391C42994652K419891J546326N00603l33214p03049n94521k08244J70212L28598K17552
$$ 342994652 345414543 346960869 347461472 347128258 346425209 345830688 345622444 345792656 346121254 346338806
1401C46338806o9237l96881o91986r74197j302910j684151k022438k161712j996766
$$ 346338806 346269569 345872688 345180702 344206505 342903595 341219444 339197006 337035294 335038528
1410C35038528j583786j163139j064110j531067k565612l874436m962845n336456m720421
$$ 335038528 333454742 332291603 331227493 329696426 327130814 323256378 318293533 312957077 308236656
1419C08236656l195114j184406P03773J923504K217102J720886Q92926K85568K62604
$$ 308236656 305041542 303857136 304560909 306484413 308701515 310422401 311315327 311600895 311863499
1428C11863499Q04119J508541J806431J280307p8105j826249l274345l825512l268833
$$ 311863499 312667618 314176159 315982590 317262897 317184792 315358543 312084198 308258686 304989853
1437C04989853j866169k00672J107979J659965J381683M73462p20501j824913k497406
$$ 304989853 303123684 302923012 304030991 305690956 307072639 307546101 306825600 305000687 302503281
1446C02503281k481976j702347l77464R36604J487560O64863j610908m686546p351971
$$ 302503281 300021305 298318958 297941494 298878098 300365658 301030521 299419613 294733067 287381096
1455B87381096q373795p131290l989239j57833K917824M306469M044914L027878K407799
$$ 287381096 279007301 271876011 267886772 267728939 270646763 274953232 278998146 282026024 284433823
1464B84433823K869796M229126N581570N900650M697380K338562j55830j691036j690064
$$ 284433823 287303619 291532745 297114315 303014965 307712345 310050907 309895077 308204041 306513977
1473C06513977l53851J525821L052311L698101L506108K945060K554284K606201K971077
$$ 306513977 306160126 307685947 310738258 314436359 317942467 320887527 323441811 326048012 329019089
1482C29019089L231125K955818J981506N53436p38105j212960m45785J455421L792458
$$ 329019089 332250214 335206032 337187538 337740974 337002869 335789909 335344124 336799545 340592003
1491C40592003N524559N758705M261017J698074n93567j265983K63824L364144O377716
$$ 340592003 346116562 351875267 356136284 357834358 357240791 355974808 356238632 359602776 365980492
1500C65980492P419738N385399O11344n206490r813881j1487655r817696n780563j119767
$$ 365980492 373400230 378785629 379396973 374190483 364376602 352888947 343071251 337290688 336170921
1509C36170921K566071M505234M883041M452133L950730L696441L548775L168755K340927
$$ 336170921 338736992 343242226 348125267 352577400 356528130 360224571 363773346 366942101 369283028
1518C69283028J148414o9580q99010j039924m18205P91893K209243L346215L767776
$$ 369283028 370431442 370361862 369462852 368422928 368004723 368796616 371005859 374352074 378119850
1527C78119850L288880K123756Q65631K36206O83670K044487L501320L936348K532730
$$ 378119850 381408730 383532486 384398117 384634323 385317993 387362480 390863800 394800148 397332878
1536C97332878o97594m779319q154831r407425p953377m336166L1471L536491N101128
$$ 397332878 396635284 391855965 383701134 374293709 366340332 362004166 362035637 365572128 370673256
1545C70673256M623756K929421J286621P39441J579323L194008M360504L851623J088181
$$ 370673256 375297012 378226433 379513054 380252495 381831818 385025826 389386330 393237953 394326134
1554C94326134l467179q376655j1770210j2151986r110717l588143K459526O881485
$$ 394326134 390858955 382482300 370712090 358560104 349449387 345861244 348320770 355202255
1562C55202255Q260079O504974K822571r20830l111267l121033j502647M19502J314583
$$ 355202255 363462334 369967308 372789879 371869049 368757782 365636749 364134102 364553604 365868187
1571C65868187N50652j520539l813057n120430m744911k817154j70822K119179L263740
$$ 365868187 366418839 364898300 361085243 355964813 351219902 348402748 348231926 350351105 353614845
1580C53614845L079033J969032O30608l27225o44951m51965j06163L9063j85509p14455
$$ 353614845 356693878 358662910 359293518 358966293 358321342 357869377 357763214 357802277 357616768 356902313
1590C56902313j324348j768990j905708j752663j466789j256409j273079j537628j937866
$$ 356902313 355577965 353808975 351903267 350150604 348683815 347427406 346154327 344616699 342678833
1599C42678833k305832k531319k635307k748604k993202l348541l606110l477802k807274
$$ 342678833 340373001 337841682 335206375 332457771 329464569 326116028 322509918 319032116 316224842
1608C16224842j749916p71980m29077j032010k411212l948727m889240m759121l639088
$$ 316224842 314474926 313702946 313273869 312241859 309830647 305881920 300992680 296233559 292594471
1617B92594471k122135r81579p53403j476803k726478l881302m446774m247417l426743
$$ 292594471 290472336 289490757 288737354 287260551 284534073 280652771 276205997 271958580 268531837
1626B68531837k320785j318932p83271j007290k150174m133300o556588q741264r949894
$$ 268531837 266211052 264892120 264108849 263101559 260951385 256818085 250261497 241520233 231570339
1635B31570339r714813q107586n773945l681965k687206l134289m701194o564675p797966
$$ 231570339 221855526 213747940 207973995 204292030 201604824 198470535 193769341 187204666 179406700
1644A79406700p798996o539364m520244k469139r35717M435P78799K048864M276009
$$ 179406700 171607704 165068340 160548096 158078957 157143240 157147675 157926474 159975338 164251347
1653A64251347P358284J0562114J2829361J3319626J1891785R227390O495743M732189
$$ 164251347 171609631 182171745 195001106 208320732 220212517 229439907 235935650 240667839
1661B40667839M290791M707794N053139M548263L050346J099015m85249j157913r78642
$$ 240667839 244958630 249666424 254719563 259267826 262318172 263417187 262931938 261774025 260795383
1670B60795383m91523k68498m58183o82068l59554P70492K315159L347569K937011
$$ 260795383 260303860 260035362 259577179 258895111 258535557 259306049 261621208 264968777 267905788
1679B67905788P56474k626553n977535q013420q051758o320343l782272j614895o61983
$$ 267905788 268662262 266035709 260058174 252044754 243992996 237672653 233890381 232275486 231613503
1688B31613503j145230k732982m851342p007179q946877j0608196j1958256j2866745
$$ 231613503 230468273 227735291 222883949 215876770 206929893 196321697 184363441 171496696
1696A71496696j3101959j2448158j0855293q520117n844650l288126j189471L52230
$$ 171496696 158394737 145946579 135091286 126571169 120726519 117438393 116248922 116601152
1704A16601152J485205K497931L650112N019722O434927P523947P865505P179479N476895
$$ 116601152 118086357 120584288 124234400 129254122 135689049 143212996 151078501 158257980 163734875
1713A63734875L099613O25114j335125k360572k367592j606674n02711N79615J522770
$$ 163734875 166834488 167459602 166124477 163763905 161396313 159789639 159286928 159866543 161389313
1722A61389313K482109L732395N417004P361889R087066J0037041R909420Q882828
$$ 161389313 163871422 167603817 173020821 180382710 189469776 199506817 209416237 218299065
1730B18299065P583179O779842O969929Q092995R552479J0544204J0503960R415684
$$ 218299065 225882244 232662086 239632015 247725010 257277489 267821693 278325653 287741337
1738B87741337P798767O389065N706539N765781O096840O048584N191116L578263J726837
$$ 287741337 295540104 301929169 307635708 313401489 319498329 325546913 330738029 334316292 336043129
1747C36043129L37486p3318N74226J912727L338204M307060M553261M128571L287544
$$ 336043129 336380615 336307297 336881523 338794250 342132454 346439514 350992775 355121346 358408890
1756C58408890K316894J426468P46002L85781M68826J075859K123032L275795M000129
$$ 358408890 360725784 362152252 362898254 363284035 363752861 364828720 366951752 370227547 374227676
1765C74227676L781090K409401J71280k201424l826332m076957k879105p39403J505470
$$ 374227676 378008766 380418167 380589447 378388023 374561691 370484734 367605629 366866226 368371696
1774C68371696L074151L554878L004150J827889N53322l71285o75926k87819O73942
$$ 368371696 371445847 375000725 378004875 379832764 380386086 380014801 379338875 379051056 379724998
1783C79724998J898880K916489L216438K461625P10029j504478l332329l979569l115081
$$ 379724998 381623878 384540367 387756805 390218430 390928459 389423981 386091652 382112083 378997002
1792C78997002j082764J225395K793045K981186J841774O9046j376877j768150r60159
$$ 378997002 377914238 379139633 381932678 384913864 386755638 386824684 385447807 383679657 382719498
1801C82719498N75218K034531K712783K344513J192169j41143j049881j224099p57026
$$ 382719498 383294716 385329247 388042030 390386543 391578712 391437569 390387688 389163589 388406563
1810C88406563k8382N44587P37075O00434L72734K94723M55284P57332J006356J045036
$$ 388406563 388378181 388922768 389659843 390260277 390633011 390927734 391383018 392140350 393146706 394191742
1820C94191742Q34770M42085l7536n43518j046143j489525j751709j680259j200066
$$ 394191742 395026512 395468597 395431061 394887543 393841400 392351875 390600166 388919907 387719841
1829C87719841m08516M30374J021385J223488J149292J089478J288376J723442K055740
$$ 387719841 387311325 387741699 388763084 389986572 391135864 392225342 393513718 395237160 397292900
1838C97292900J816368P30171j032104k856484l969802l848877k513771n26047J304970
$$ 397292900 399109268 399839439 398807335 395950851 391981049 388132172 385618401 385092354 386397324
1847C86397324K332534K362366J674843P93915J69639l7155L9749J43814J09902k1286
$$ 386397324 388729858 391092224 392767067 393560982 393730621 393693466 393733215 393877029 393986931 393965645
1857C93965645n2948J99928P39899J329269J589165J205826J31225j342048k682991
$$ 393965645 393912697 394112625 394852524 396181793 397770958 398976784 399108009 397765961 395082970
1866C95082970l360062l094215j994706n02471Q27217J584053J664009J259041O99043
$$ 395082970 391722908 388628693 386633987 386131516 386958733 388542786 390206795 391465836 392164879
1875C92164879K57873L8987r232R117L4065P2174J42746K13547J94435J717l57094
$$ 392164879 392422752 392461739 392452507 392461624 392495689 392567863 392710609 392924156 393118591 393120308 392763214
1886C92763214p53860j002884r75380o86646k87056L5134J68304J30539K6131m6501
$$ 392763214 392009354 391006470 390031090 389344444 389057388 389092522 389260826 389391365 389417496 389370995
1896C89370995o1722n8480p5111r5024n7488P1602K34223K91633J20163k70004o92978
$$ 389370995 389309273 389250793 389175682 389080658 389023170 389094772 389328995 389620628 389740791 389470787 388777809
1907C88777809q72154o13899M5776Q24242J334152J298599P09915j68495r50088j331635
$$ 388777809 387905655 387291756 387337532 388161774 389495926 390794525 391504440 391335945 390385857 389054222
1917C89054222j231079p88498k52228J67313L85094M36821M10041L71933L38211K90299
$$ 389054222 387823143 387034645 386782417 386949730 387334824 387771645 388181686 388553619 388891830 389182129
1927C89182129K12288J16539M1618L1586J12228K76413M78821O44608O86683N36576
$$ 389182129 389394417 389510956 389552574 389584160 389696388 389972801 390451622 391096230 391782913 392319489
1937C92319489J80969l14675q13293j153412j217537r89036n61600r6054K57034M20532
$$ 392319489 392500458 392185783 391372490 390219078 389001541 388012505 387450905 387354851 387611885 388032417
1947C88032417M11606L09525J97677J17417N9585o561r3155j72691j90277j03493P8544
$$ 388032417 388444023 388753548 388951225 389068642 389128227 389121666 389028511 388855820 388665543 388562050 388640594
1958C88640594K83318L99513L30887N0621l72772p92885j043701j012344o93512j97220
$$ 388640594 388923912 389323425 389654312 389704933 389332161 388539276 387495575 386483231 385789719 385592499
1968C85592499K95372O11267O60133M72450J76087o9618j54419o6223J12609K60010
$$ 385592499 385887871 386499138 387159271 387631721 387807808 387738190 387583771 387517548 387630157 387890167
1978C87890167K85607J81961K4185p8812n3406Q9112K50053K96707J36071k23275o62498
$$ 387890167 388175774 388357735 388381920 388303108 388249702 388338814 388588867 388885574 389021645 388798370 388135872
1989C88135872j001663j084137q53577l83720J53274N64881P23228O14891L33519K6856
$$ 388135872 387134209 386050072 385196495 384812775 384966049 385530930 386254158 386869049 387202568 387229424
1999C87229424j77804k24990j43814j9112O0577M6997m9286j71966k52991k49100j62925
$$ 387229424 387051620 386826630 386682816 386663704 386724281 386771278 386721992 386550026 386297035 386047935 385885010
2010C85885010m0398N3444O8245p362j40534k72331l46832l38860k61612j54915o1760
$$ 385885010 385844612 385898056 385966301 385958939 385818405 385546074 385199242 384860382 384598770 384443855 384382095
2021C84382095p209O218r919m4403r1629j46560j93482k01683j40152L05J87760L52096
$$ 384382095 384374886 384381104 384371185 384326782 384235153 384088593 383895111 383693428 383553276 383553581 383741341 384093437
2033C84093437M13056L22952R5901j90391m26827n23529m51164k54059k6970J29509
$$ 384093437 384506493 384829445 384925346 384734955 384308128 383784599 383333435 383079376 383052406 383181915
2043C83181915J54038N0125j20545k69508l23410k59514j15089K9869R3117L3226j26686
$$ 383181915 383335953 383386078 383265533 382996025 382672615 382413101 382298012 382327881 382420998 382454224 382327538
2054C82327538l05520m04853l60718j79711N8060K38533K69852J29661j23443l79257
$$ 382327538 382022018 381617165 381256447 381076736 381134796 381373329 381643181 381772842 381649399 381270142
2064C81270142n29442n15251l48168r7351J47209L10364L55187K85949J39427l0174
$$ 381270142 380740700 380225449 379877281 379779930 379927139 380237503 380592690 380878639 381018066 380987892
2074C80987892j65024k18315j67618k7237J52550K99111L46298K65007P9613j40305
$$ 380987892 380822868 380604553 380436935 380409698 380562248 380861359 381207657 381472664 381552277 381411972
2084C81411972l09563l66172k98386j47705J3389J14594J18294L2005r9487k15912
$$ 381411972 381102409 380736237 380437851 380290146 380303535 380418129 380536423 380568428 380468941 380253029
2094C80253029k67296k33040j27945L739J07498J40571R1248j3886j20124j69335j28402
$$ 380253029 379985733 379752693 379624748 379628487 379735985 379876556 379967804 379953918 379833794 379664459 379536057
2105C79536057q431J38664K43149K51923J55296q469j71508k69204k68707j80473m7264
$$ 379536057 379527626 379666290 379909439 380161362 380316658 380308189 380136681 379867477 379598770 379418297 379371033
2116C79371033P7629J54342J67695J26724N3482k6665r4452j39427j59454j60446j51825
$$ 379371033 379448662 379603004 379770699 379897423 379950905 379924240 379829788 379690361 379530907 379370461 379218636
2127C79218636j41182j28975j06049n9051J7967J12953J93863K19078J59836K0141
$$ 379218636 379077454 378948479 378842430 378783379 378801346 378914299 379108162 379327240 379487076 379507217
2137C79507217j56555l02925l58505l00026j57051R15R6474Q2054l6773k05079l44657
$$ 379507217 379350662 379047737 378689232 378389206 378232155 378233070 378329544 378411598 378374825 378169746 377825089
2148C77825089l91770l23982j69678R155J44234J91269J44653L7537p5150j41143j32256
$$ 377825089 377433319 377109337 376939659 376948814 377093048 377284317 377428970 377466507 377391357 377250214 377117958
2159C77117958n5809M8637J26076J30921M7569r9030k52456l48168l42445k32353n8365
$$ 377117958 377062149 377110786 377236862 377367783 377415352 377316322 377063866 376715698 376373253 376140900 376082535
2170C76082535J13716K22549K36283J63841M6310o4354j28288j30234q0947o752O2026
$$ 376082535 376196251 376418800 376655083 376818924 376865234 376800880 376672592 376542358 376461411 376454659 376516685
2181C76516685J01052R7809N1841k3727j06468j70708j96838j80474j35460q8233o3973
$$ 376516685 376617737 376715546 376767387 376743660 376637192 376466484 376269646 376089172 375953712 375865479 375801506
2192C75801506p2632j04408j33591j35498j00708m2038J1864L1357K212o6757j46255
$$ 375801506 375728874 375624466 375490875 375355377 375254669 375212631 375224495 375255852 375258064 375191307 375045052
2203C75045052k00730k02637j46102m9172N1346J14059J09673L5324q1062j88561k33726
$$ 375045052 374844322 374641685 374495583 374446411 374497757 374611816 374721489 374756813 374675751 374487190 374253464
2214C74253464j86043n5237J07155K27966K45858J41449n0126k52456l83721l93982
$$ 374253464 374067421 374012184 374119339 374347305 374593163 374734612 374684486 374432030 374048309 373654327
2224C73654327k88353j22833K5253R3651O4202l4256j44158k09884k03705j34430l8643
$$ 373654327 373365974 373243141 373268394 373362045 373426247 373391991 373247833 373037949 372834244 372699814 372661171
2235C72661171L9368O7787L7384l6202j21269j80931j84708j20239L05J40343K49023
$$ 372661171 372700539 372768326 372805710 372769508 372648239 372467308 372282600 372162361 372162666 372303009 372552032
2246C72552032K80381K15301P3319r1324k12402k41166j69296l3836J01165J74408
$$ 372552032 372832413 373047714 373121033 373029709 372817307 372576141 372406845 372373009 372474174 372648582
2256C72648582J54305N2071q5869j99471k40745j92948p7629N4627J43165J42784M3335
$$ 372648582 372802887 372854958 372769089 372569618 372328873 372135925 372058296 372112923 372256088 372398872 372442207
2267C72442207j22871k93655m03672m13704l29017j94016o6986J0986L6698M1771P2517
$$ 372442207 372319336 372025681 371622009 371208305 370879288 370685272 370618286 370629272 370665970 370707741 370780258
2278C70780258J60942L08495M85229O45180P43523P50198O56357M75349K42729J2360
$$ 370780258 370941200 371249695 371734924 372380104 373123627 373873825 374530182 375005531 375248260 375260620
2288C75260620j55525k13242j47743Q965J89819L21579L60374L13912K37999K08053
$$ 375260620 375105095 374891853 374744110 374753075 374942894 375264473 375624847 375938759 376176758 376384811
2298C76384811K80915M63485P05300R12628R82704Q42323M79584l8566n75257r58633
$$ 376384811 376665726 377129211 377834511 378747139 379729843 380572166 381051750 381013184 380437927 379479294
2308C79479294j036492p38067j12839O68411J359177J719933J603164J015206J23062
$$ 379479294 378442802 377704735 377591896 378260307 379619484 381339417 382942581 383957787 384080849
2317C84080849p96624j455268j662712j407624q68721l42827j11923l05672q32328
$$ 384080849 383284225 381828957 380166245 378758621 377889900 377547073 377435150 377129478 376297150
2326C76297150j422348j768113j689987j228485o09207r9068J46447J39656j9112k95601
$$ 376297150 374874802 373106689 371416702 370188217 369579010 369479942 369626389 369766045 369746933 369451332
2336C69451332q15277j791649l298759n031662o247712o006736l636589Q07571O373215
$$ 369451332 368636055 366844406 363545647 358513985 352266273 346259537 342622948 343430519 349803734
2345C49803734J1473999J4499473J4481850J1482086O511460J044693l605385o739922
$$ 349803734 361277733 375777206 390259056 401741142 408252602 409297295 405691910 398951988
2353C98951988q363685q941422r012947q896828q614959q019600o992455n583763m015579
$$ 398951988 390588303 381646881 372633934 363737106 355122147 347102547 340110092 334526329 330510750
2362C30510750k580986j513443r01184o78025o74552o92177n71785k35710K98500R34944
$$ 330510750 327929764 326416321 325515137 324837112 324162560 323470383 322898598 322662888 322961388 323896332
2372C23896332J542587K010040K290764K416458K470932K540856K669220K838402K988700
$$ 323896332 325438919 327448959 329739723 332156181 334627113 337167969 339837189 342675591 345664291
2381C45664291L053742K991829K795524K481194K076225J612549J130371O82602L25279
$$ 345664291 348718033 351709862 354505386 356986580 359062805 360675354 361805725 362488327 362813606
2390C62813606R8648O638J1368N0201O4736K7809m7760j22795j55564j24779l9482
$$ 362813606 362912254 362918892 362930260 362980461 363045197 363073006 363025246 362902451 362746887 362622108 362582626
2401C62582626O6452J48163J67389J05515k8038j96495l46489m26484m07409k97661
$$ 362582626 362649078 362797241 362964630 363070145 363042107 362845612 362499123 362072639 361665230 361367569
2411C61367569j40152O142R2582J02845N7220j221l0174r689N0735J20468J64490J58692
$$ 361367569 361227417 361233559 361326141 361428986 361486206 361484985 361454811 361445122 361495857 361616325 361780815 361939507
2423C61939507J00173N417r6321j73874k03819j79214j13259l5400J9455K5139k1096
$$ 361939507 362039680 362045097 361948776 361774902 361571083 361391869 361278610 361243210 361262665 361287804 361266708
2434C61266708r7465j66245j93290j65711j00097l2921k251k6360r4490j73225k23770
$$ 361266708 361169243 361002998 360809708 360643997 360543900 360510979 360508728 360482368 360387878 360214653 359990883
2445C59990883k22893j73187r9640l6430r003k4071o8626j17531j45454j35041q3465
$$ 359990883 359767990 359594803 359495163 359458733 359449730 359425659 359357033 359239502 359094048 358959007 358875542
2456C58875542k404Q4382J46064J54953R6550j9645j59340k72942l16009k70577j55983
$$ 358875542 358873138 358957520 359103584 359258537 359355087 359335442 359176102 358903160 358587151 358316574 358160591
2467C58160591k4109O4888O9657j2360j44501k71301l44200l44772k87858k09312j44691
$$ 358160591 358136482 358201370 358271027 358258667 358114166 357842865 357498665 357153893 356866035 356656723 356512032
2478C56512032j12420j08108j12686j05629p5569k4681L4141Q4229J09024R8304M7837
$$ 356512032 356399612 356291504 356178818 356073189 355997620 355972939 356007080 356091309 356200333 356298637 356346474
2489C56346474l4867j31034k11335k45170k12937j18637P363J15509J59950J18942
$$ 356346474 356311607 356180573 355969238 355724068 355511131 355392494 355399857 355515366 355675316 355794258
2499C55794258R117j20849k11640k23922j58425n6953J9493K2430n7754j85280k99111
$$ 355794258 355803375 355682526 355470886 355246964 355088539 355031586 355051079 355073509 355015755 354830475 354531364
2510C54531364l44162l00674j93977p8850j0681j6938q4457j69754k22816k12174j38855
$$ 354531364 354187202 353886528 353692551 353613701 353603020 353586082 353501625 353331871 353109055 352896881 352758026
2521C52758026l1547O8550J28021J33667R4299L3150k2774n4130n3788k7580R384L9444
$$ 352758026 352726479 352795029 352923050 353056717 353151016 353184166 353161392 353107262 353053474 353025894 353035278 353074722
2533C53074722M8752L2883j717m1580p1411q3084p7706o5269n7564o1226p3356q3886
$$ 353074722 353123474 353156357 353154640 353113060 353041649 352958565 352880859 352815590 352758026 352696800 352623444 352539558
2545C52539558q2016o3438l4599r499l357k4757p1182j29395j80702k07024j96762
$$ 352539558 352457542 352394104 352359505 352350006 352346649 352321892 352250710 352121315 351940613 351733589 351536827
2556C51536827j47705o9962J6480Q4839J09482P6255r613j21994k21634k72140k57149
$$ 351536827 351389122 351319160 351335640 351420479 351529961 351606216 351596603 351474609 351252975 350980835 350723686
2567C50723686j87454r6970k5482p6k3003p4310j24207j50260j45951j20659r0027
$$ 350723686 350536232 350439262 350413780 350413704 350390701 350316391 350192184 350041924 349895973 349775314 349685287
2578C49685287o6070n2910m7951m7226m7645m7341m2533k8954m883K3384M1771L2730
$$ 349685287 349619217 349566307 349518356 349471130 349423485 349376144 349333611 349304657 349299774 349323158 349364929 349397659
2590C49397659j2932q8157j70098k28614k41394k05460j38054o8512k3918j7738m6006
$$ 349397659 349384727 349296570 349126472 348897858 348656464 348451004 348312950 348244438 348220520 348202782 348156776
2601C48156776r1972j34659j57623j54114j27525q9264n3444l0708k3880k5864k4528
$$ 348156776 348064804 347930145 347772522 347618408 347490883 347401619 347348175 347317467 347293587 347267723 347243195
2612C47243195j0949J3123L2043K3766k6627j15547k17056k92397l08380k54135j47629
$$ 347243195 347232246 347245369 347277412 347301178 347274551 347159004 346941948 346649551 346341171 346087036 345939407
2623C45939407k7389O4354J00288P7744J6899n0278r3231r4643n5656N569O0540Q1863
$$ 345939407 345912018 345976372 346076660 346154404 346171303 346121025 346027794 345933151 345877495 345883064 345943604 346025467
2635C46025467N4855j3313r5100j53580j61629j17531m8561L357M196n0201j30234
$$ 346025467 346080322 346067009 345971909 345818329 345656700 345539169 345490608 345493965 345498161 345447960 345317726
2646C45317726j86615j79367r9945K2545J36986J97181J84365J12304J6137o7444j18141
$$ 345317726 345131111 344951744 344851799 344874344 345011330 345208511 345392876 345505180 345521317 345453873 345335732
2657C45335732j32905j22184r8114p1602n1308m7226o8092j15051j74370k19612k22130
$$ 345335732 345202827 345080643 344982529 344910927 344859619 344812393 344744301 344629250 344454880 344235268 344013138
2668C44013138j68572p2631K6702Q3619O9160j1253j18332j98708k11830j50223m3754
$$ 344013138 343844566 343771935 343798637 343882256 343951416 343940163 343821831 343623123 343411293 343261070 343217316
2679C43217316N7106J05171Q0109n188j12038j93901k17781j74599q1367K7427J14594
$$ 343217316 343274422 343379593 343459702 343454514 343342476 343148575 342930794 342756195 342674828 342702255 342816849
2690C42816849J53236J34812P1716r880p9117j13869j08871p8240m9019m8561r1056
$$ 342816849 342970085 343104897 343176613 343166733 343087616 342973747 342864876 342786636 342737617 342689056 342598000
2701C42598000j68572k52151l03612k92549k12899q7928L5515J06468R1476r155j59798
$$ 342598000 342429428 342177277 341873665 341581116 341368217 341280289 341315804 341422272 341513748 341504593 341344795
2712C41344795l03192l84178l73344k79618j45988l1204J6746j9989j21651k41279
$$ 341344795 341041603 340657425 340284081 340004463 339858475 339827271 339844017 339824028 339702377 339461098
2722C39461098l25165l37105k73704j64795n9853p248l2577j28594k58827l72314m24881
$$ 339461098 339135933 338798828 338525124 338360329 338300476 338293228 338260651 338132057 337873230 337500916 337076035
2733C37076035l95928k95067j57089k6169O1379R0027O8473K2278j7967l1319j2932
$$ 337076035 336680107 336385040 336227951 336201782 336263161 336353188 336421661 336443939 336425972 336394653 336381721
2744C36381721K3995N5847N8327J8539o0501j58386k44789k90604k80456k19078j31302
$$ 336381721 336405716 336461563 336519890 336538429 336477928 336319542 336074753 335784149 335503693 335284615 335153313
2755C35153313n2109j2093k3575p5378j38550j80206j79558j37863p6256k4566o600
$$ 335153313 335101204 335089111 335065536 334990158 334851608 334671402 334491844 334353981 334277725 334253159 334246559
2766C34246559k9106q0986j40648j86767k07253k02522j82686j62544j56327j73874
$$ 334246559 334217453 334136467 333995819 333809052 333601799 333399277 333216591 333054047 332897720 332723846
2776C32723846k16331k73819l25890l46870l15971k30103j09596N607P1831O1684k1439
$$ 332723846 332507515 332233696 331907806 331560936 331244965 331014862 330905266 330910873 330982704 331044388 331022949
2787C31022949j44386k59094l25699l29285k84004k20680j68000j39007j28670j22871
$$ 331022949 330878563 330619469 330293770 329964485 329680481 329459801 329291801 329152794 329024124 328901253
2797C28901253j10817r4261q4267r3689j27106j76773k27089k62108k72903k59056
$$ 328901253 328790436 328696175 328611908 328518219 328391113 328214340 327987251 327725143 327452240 327193184
2807C27193184k26364j82801j34811q8463n1002k9907l2197n8937j02615j49002j81656
$$ 327193184 326966820 326784019 326649208 326560745 326509743 326479836 326447639 326388702 326286087 326137085 325955429
2818C25955429j89972j74141j44996j18676j06697j09977j16654j09444p6522k0447
$$ 325955429 325765457 325591316 325446320 325327644 325220947 325110970 324994316 324884872 324808350 324787903
2828C24787903L8910P2670N6610j4763j23024k33650l11013l36952l19442k88048k77710
$$ 324787903 324826813 324899483 324956093 324941330 324818306 324584656 324273643 323936691 323617249 323329201 323051491
2839C23051491l10707l84674m74816n47600n78002n61257n13649m61159m26426m18777
$$ 323051491 322740784 322356110 321881294 321333694 320755692 320194435 319680786 319219627 318793201 318374424
2849C18374424m33311m57268m79756m97112n12218n30091n52387n76210n96542o11058
$$ 318374424 317941113 317483845 317004089 316506977 315994759 315464668 314912281 314336071 313739529 313128471
2859C13128471o21338o31809o44874o56967o58875o40316n96390n31463m58432l93524
$$ 313128471 312507133 311875324 311230450 310573483 309914608 309274292 308677902 308146439 307688007 307294483
2869C07294483l48549l27186l24726l33558l47766l66383l92647m29573m76608n27592
$$ 307294483 306945934 306618748 306294022 305960464 305612698 305246315 304853668 304424095 303947487 303419895
2879C03419895n72223o01330o10256o01998n86262n75866n81799o08463o51093o98147
$$ 303419895 302847672 302246342 301636086 301034088 300447826 299871960 299290161 298681698 298030605 297332458
2889B97332458p35626p54509p55329p48386p49283p69939q11310q61664r00192r06411
$$ 297332458 296596832 295842323 295086994 294338608 293589325 292819386 292008076 291146412 290246220 289339809
2899B89339809q69693p93324o92558n88303m98600m35371m03423m04759m39014n04494
$$ 289339809 288470116 287676792 286984234 286395931 285897331 285461960 285058537 284653778 284214764 283710270
2909B83710270n94597o95438p86915q49171q69522q48484p98721p38755o82277o32439
$$ 283710270 283115673 282420235 281633320 280784149 279914627 279066143 278267422 277528667 276846390 276213951
2919B76213951n82256n22614m52080l83892l41091l44791l99838m86297n63965n87826
$$ 276213951 275631695 275109081 274657001 274273109 273932018 273587227 273187389 272701092 272137127 271549301
2929B71549301n28622l86962j95351m082J39084K07176K04048J57090J03759P3777
$$ 271549301 271020679 270633717 270438366 270434284 270573368 270780544 270984592 271141682 271245441 271319218
2939B71319218P7858J07498J40743J55945J40114R3136K5405n0125j23138j89381k46868
$$ 271319218 271397076 271504574 271645317 271801262 271941376 272034512 272059917 272009792 271886654 271697273 271450405
2950B71450405k92168l17668l12291k69317j91880r5653l433O3610R5424R6150P8449
$$ 271450405 271158237 270840569 270528278 270258961 270067081 269971428 269967995 270031605 270127029 270223179 270301628
2961B70301628N4550K9984J964l3321p5550j18351j55773j90811k37770l16945m38213
$$ 270301628 270356178 270386162 270388126 270354805 270279255 270160904 270005131 269814320 269576550 269259605 268821392
2972B68821392n87597p25269p97539p60536o01521l45173m3373K47555M87404O62193
$$ 268821392 268233795 267508526 266710987 265950451 265348930 265003757 264960384 265207939 265695343 266357536
2982B66357536P78504Q49437Q82016Q75778Q28304P47700O57711N94253N92099O69975
$$ 266357536 267136040 267985477 268867493 269743271 270571575 271319275 271976986 272571239 273163338 273833313
2992B73833313Q20103J008854J188240J312713J354428J312809J212387J092872R92642
$$ 273833313 274653416 275662270 276850510 278163223 279517651 280830460 282042847 283135719 284128361
3001B84128361R35268R20391R25808R17263Q62065P44419N71727L73078J90563O2199
$$ 284128361 285063629 285984020 286909828 287827091 288689156 289433575 290005302 290378380 290568943 290631142
3011B90631142Q087K1744P1144J12037J06106L8338p5112j94644k75727k90947k44903
$$ 290631142 290639229 290660973 290732117 290844154 290950260 290988598 290913486 290718842 290443115 290152168 289907265
3022B89907265j72291j21021j27602j98269l05176m00562m40636m06360l11928j95446
$$ 289907265 289734974 289613953 289486351 289288082 288982906 288582344 288141708 287735348 287423420 287227974
3032B87227974r9316m8885m3659o1302p3739o6089m5910m0512q1883j87378l47557
$$ 287227974 287128658 287079773 287036114 286974812 286901073 286834984 286789074 286748562 286666679 286479301 286131744
3043B86131744n26027o74763p54662p54222o95096o20727n75180n81150o29292o83632
$$ 286131744 285605717 284930954 284176292 283422070 282726974 282106247 281531067 280949917 280320625 279636993
3053B79636993p02629o62746n73139m74110m17709m41857n50117p08409q59870r51367
$$ 279636993 278934364 278271618 277698479 277224369 276806660 276364803 275814686 275106277 274246407 273295040
3063B73295040r56344q85849p78981o82487o28433o23246o52599o96602p44476p99751
$$ 273295040 272338696 271452847 270673866 269991379 269362946 268739700 268087101 267390499 266646023 265846272
3073B65846272q72708r65061j061668j132584j149864j105881j022472r42364r06677
$$ 265846272 264973564 264008503 262946835 261814251 260664387 259558506 258536034 257593670 256686993
3082B56686993r32598j002961j075744j108666j082611j010570r28669q73795q63228
$$ 256686993 255754395 254751434 253675690 252567024 251484413 250473843 249545174 248671379 247808151
3091B47808151q89358r27620r53922r56154r35002q95023q36296p53365o44722n22365
$$ 247808151 246918793 245991173 245037251 244081097 243146095 242251072 241414776 240661411 240016689 239494324
3101B39494324m15325l56980l66916m35124n22766n79586n70679m94957l84845k86503
$$ 239494324 239078999 238722019 238355103 237919979 237397213 236817627 236246948 235751991 235367146 235080643
3111B35080643k32868k25392k34623k19593j51882l1662J14994K52438L55835M22115
$$ 235080643 234847775 234622383 234387760 234168167 234016285 233984623 234099617 234352055 234707890 235130005
3121B35130005M66938N10235N61657O14795O53992O67591O59657O50997O69517P32994
$$ 235130005 235596943 236107178 236668835 237283630 237937622 238605213 239264870 239915867 240585384 241318378
3131B41318378Q36163R49097J028175J036339R61895Q25348O73256N58071N16300N53665
$$ 241318378 242154541 243103638 244131813 245168152 246130047 246955395 247628651 248186722 248703022 249256687
3141B49256687O44131P42721Q05436Q05931P43293O37055N15404M03080L12881K46067
$$ 249256687 249900818 250643539 251448975 252254906 252998199 253635254 254150658 254553738 254866619 255112686
3151B55112686J96552J57223J24092R7580P9689P1373O9313O4812M5395K48p3643j67389
$$ 255112686 255309238 255466461 255590553 255688133 255767822 255839195 255908508 255973320 256018715 256018963 255945320 255777931
3163B55777931k60334l27740l52993l36914k99739k71912k77882l22342l86982m41722
$$ 255777931 255517597 255189857 254836864 254499950 254200211 253928299 253650417 253328075 252941093 252499371
3173B52499371m63124m50096m25510m22459m63314n44186o36730p03277p20997o94847
$$ 252499371 252036247 251586151 251160641 250738182 250274868 249730682 249093952 248390675 247669678 246974831
3183B46974831o54450o35967o59561p17659p81441q18005q10546p66182p08905o63776
$$ 246974831 246320381 245684414 245024853 244307194 243525753 242707748 241897202 241131020 240422115 239758339
3193B39758339o42052o38885o41690o42223o45676o65950p16076p95861q89148r69811
$$ 239758339 239116287 238477402 237835712 237193489 236547813 235881863 235165787 234369926 233480778 232510967
3203B32510967j014805j014213r73835r10301q42572p85656p49931p42206p67384q25710
$$ 232510967 231496162 230481949 229508114 228597813 227755241 226969585 226219654 225477448 224710064 223884354
3213B23884354r08852r98077j067543j094094j067428r95694r03053q19034p65744
$$ 223884354 222975502 221977425 220909882 219815788 218748360 217752666 216849613 216030579 215264835
3222B15264835p48939p58610p76119p85389p80792p68261p59487p63646p80391p99465
$$ 215264835 214515896 213757286 212981167 212195778 211414986 210646725 209887238 209123592 208343201 207543736
3232B07543736q05932p88097p43618o80962o14547n57118n12867m75750m31919l66688
$$ 207543736 206737804 205949707 205206089 204525127 203910580 203353462 202840595 202364845 201932926 201566238
3242B01566238k71167j46332l166J40228K63824L51963L98846M13036M17576M44145
$$ 201566238 201295071 201148739 201145573 201285801 201549625 201901588 202300434 202713470 203131046 203575191
3252B03575191N22385O67401Q71047J102944J321087J489010J589908J631584J640034
$$ 203575191 204097576 204764977 205636024 206738968 208060055 209549065 211138973 212770557 214410591
3261B14410591J644859J665402J704044J747627J777001J775494J735916J662655J569538
$$ 214410591 216055450 217720852 219424896 221172523 222949524 224725018 226460934 228123589 229693127
3270B29693127J476783J404934J368790J371288J400490J433983J448841J432324J388950
$$ 229693127 231169910 232574844 233943634 235314922 236715412 238149395 239598236 241030560 242419510
3279B42419510J335945J290951J259212J227951J173802J079654R49192Q10185P02591
$$ 242419510 243755455 245046406 246305618 247533569 248707371 249787025 250736217 251546402 252248993
3288B52248993O58607O84071P54776Q27789Q62141Q36601P57714O52618N54199M86527
$$ 252248993 252907600 253591671 254346447 255174236 256036377 256872978 257630692 258283310 258837509 259324036
3298B59324036M55494M49886M47807M27475L75405K91500J88331Q6708O504m0226n2871
$$ 259324036 259779530 260229416 260677223 261104698 261480103 261771603 261959934 262046642 262053146 262012920 261960049
3309B61960049m0856j6575J0605L6946O1359Q0566Q5984O7253J9779m8389j16444j60065
$$ 261960049 261919193 261902618 261913223 261950169 262011528 262092094 262178078 262245331 262265110 262216721 262100277 261940212
3321B61940212j64871j35860r6074p3432q5736j29585j83544k22645k31857k14463
$$ 261940212 261775341 261639481 261543407 261469975 261384239 261254654 261071110 260848465 260616608 260402145
3331B60402145j85318j58214j34258j01986m7722K9831J13048J71280J77841J26267
$$ 260402145 260216827 260058613 259924355 259822369 259774647 259804478 259917526 260088806 260266647 260392914
3341B60392914L6030n6572j17340j30711j05553o6604l8491l2558m3163n5104n4626
$$ 260392914 260428944 260372372 260255032 260124321 260018768 259952164 259913673 259881115 259837952 259782848 259728222
3352B59728222l7670j0433J6136L3359L8605L2825J7853o504m1046q2569j20850j39713
$$ 259728222 259690552 259680119 259696255 259729614 259768219 259801044 259818897 259812393 259771347 259688778 259567928 259428215
3364B59428215j23749o7043K0180J12438J78108J94588J59893R7427M5300L7613Q4171
$$ 259428215 259304466 259237423 259257603 259370041 259548149 259742737 259902630 260000057 260045357 260082970 260167141
3375B60167141J61457K21291K15187J22223l5839k01188l07369l13721k26383r5901
$$ 260167141 260328598 260549889 260765076 260887299 260851460 260650272 260342903 260029182 259802799 259706898
3385B59706898J0032M1676q431j03740j86062k05612j44081k0066J24226K41814K99015
$$ 259706898 259716930 259758606 259750175 259646435 259460373 259254761 259110680 259090614 259214840 259456654 259755669
3396B59755669K82097J98173P0305o6357j72519k14425j76715p2995N7049J61820K01835
$$ 259755669 260037766 260235939 260306244 260239887 260067368 259852943 259676228 259603233 259660282 259822102 260023937
3407B60023937J69049Q9893Q850l7937m5185l9826o2732j41125k67735m02355m91886
$$ 260023937 260192986 260282879 260291729 260253792 260208607 260168781 260106049 259964924 259697189 259294834 258802948
3418B58802948m98638m17748k75955j15089K9049J37920K07138K37713K27699J74542
$$ 258802948 258304310 257886562 257610607 257495518 257524567 257662487 257869625 258107338 258335037 258509579
3428B58509579Q2321l0708j34297j96876j98346j37195k9946R5501K06318K68193K50358
$$ 258509579 258591900 258561192 258426895 258230019 258031673 257894478 257864532 257960033 258166351 258434544 258684902
3439B58684902J36700n9757k86370m58831m91848l40500l0785L42674O57711Q20599
$$ 258684902 258821602 258761845 258475475 258016644 257524796 257184296 257153511 257496185 258153896 258974495
3449B58974495Q08868O74019N03044L67070K85568K31876J66474P4958j8215o7711
$$ 258974495 259783363 260457382 260960426 261327496 261613064 261844940 262011414 262086372 262068157 262000446
3459B62000446m0970N8384J94569L22666M14238M65126M84619M79908M51680M03843
$$ 262000446 261959476 262017860 262212429 262535095 262949333 263414459 263899078 264378986 264830666 265234509
3469B65234509L55167L36437L69511M43058N07431N00183L89271K03590K5749n3425
$$ 265234509 265589676 265926113 266295624 266738682 267246113 267746296 268135567 268339157 268364906 268311481
3479B68311481R041J81942L79982N17979N62153N41725N16701N29022N73120O08501
$$ 268311481 268320522 268502464 268882446 269400425 269962578 270504303 271021004 271550026 272123146 272731647
3489B72731647O01483N58319N23300N38941O01253O48308N95875M00505J03855j77078
$$ 272731647 273333130 273891449 274414749 274953690 275554943 276203251 276799126 277199631 277303486 277126408
3499B77126408l12558k38018M025K86159M69628M83074L58696K05860J41869K25715
$$ 277126408 276813850 276575832 276579857 276866016 277335644 277818718 278177414 278383274 278525143 278750858
3509B78750858M32148O75640Q65021R48029R25731Q30632O92844N19161K96002J2493
$$ 278750858 279183006 279858646 280723667 281671696 282597427 283428059 284120903 284640064 284936066 284948559
3519B84948559l16200o41289q90560r92108q97178n96161j27869M19827R19780J235943
$$ 284948559 284632359 283991070 283100510 282108402 281211224 280615063 280487194 280907021 281826801 283062744
3529B83062744J271897J024932O12755K44179J28040L56598Q29220J273308J374283
$$ 283062744 284334641 285359573 285972328 286216507 286344547 286701145 287530365 288803673 290177956
3538B90177956R52263Q7108q93421j573277j670227j192417m28333K26307N00336L93104
$$ 290177956 291130219 291217327 290323906 288750629 287080402 285887985 285459652 285685959 286186295 286579399
3548B86579399J44253N5828K91538P89356J339226J755162K003612K183838K375450
$$ 286579399 286723652 286779480 287071018 287860374 289199600 290954762 292958374 295142212 297517662
3557B97517662K479076K196923J204910n77679k806415m772358n703964n153962l246803
$$ 297517662 299996738 302193661 303398571 302820892 300014477 295242119 289538155 284384193 281137390
3566B81137390o36635J796856L339310L710823L096256J973229Q71544J94454J45988
$$ 281137390 280500755 282297611 285636921 289347744 292444000 294417229 295288773 295483227 295629215
3575B95629215P23076J720791K743893L280410K876931J379089q97198l204422m656028
$$ 295629215 296352291 298073082 300816975 304097385 306974316 308353405 307456207 304251785 299595757
3584B99595757m651642l198853r33361J194573K392959K390976J494083L31212n19505
$$ 299595757 294944115 291745262 290811901 292006474 294399433 296790409 298284492 298615704 298096199
3593B98096199p90901n45578j640O61735J373425K091617K684403K905445K515125
$$ 298096199 297305298 296759720 296758080 297419815 298793240 300884857 303569260 306474705 308989830
3602C08989830J465092N913j379090k188740k140522j298427l5172J124974J695690
$$ 308989830 310454922 310460835 309081745 306893005 304752483 303454056 303418884 304543858 306239548
3611C06239548J384773K00253j499215l038807l605918k579117R1266L665200O755733
$$ 306239548 307624321 307824574 306325359 303286552 299680634 297101517 297192783 300857983 307613716
3620C07613716P872276O145783J858787l558788q119507j0176181r151478n717583
$$ 307613716 315485992 321631775 323490562 319931774 311812267 301636086 292484608 286767025
3628B86767025j366158K350369M473934M883900M107132K919044K003384J796284K459163
$$ 286767025 285400867 287751236 292225170 297109070 301216202 304135246 306138630 307934914 310394077
3637C10394077L853321N481511O505527N979042L304749j297036o634788j0911160
$$ 310394077 314247398 319728909 326234436 332213478 335518227 334221191 327586403 316675243
3645C16675243j2510948j0803566o500072j327973K807846M706097M319954K577915
$$ 316675243 304164295 293360729 286860657 285532684 288340530 293046627 297366581 299944496
3653B99944496P64294j40724J93824J506501L240623M829807N832768N950642N045051
$$ 299944496 300708790 300568066 300761890 302268391 305509014 310338821 316171589 322122231 327167282
3662C27167282L216629Q69064j367263k895470l474922l383331l260899l694973m797230
$$ 327167282 330383911 331252975 329885712 326990242 323515320 320131989 316871090 313176117 308378887
3671C08378887o062298o621151n739326l250923L36876M100265P120247Q800488Q931179
$$ 308378887 302316589 295695438 289956112 286705189 287042065 291142330 298262577 307063065 315994244
3680C15994244P561969M872513J178246k957230o674099q983993r145337p043361l325520
$$ 315994244 323556213 328428726 329606972 326649742 319975643 310991650 301846313 294802952 291477432
3689B91477432Q28610M192238N966072N994396M660091K598591M41094j290341k176971
$$ 291477432 292306042 296498280 302464352 308458748 313118839 315717430 316158524 314868183 312691212
3698C12691212j925831n03407J692543L802567M758053L772163Q17108l212623o810227
$$ 312691212 310765381 310261974 311954517 315757084 320515137 324287300 325104408 321891785 315081558
3707C15081558q517799p598763m367714r880L983689O449279O939812N731297L530788
$$ 315081558 306563759 298964996 294597282 294587402 298571091 305020370 311960182 317691479 321222267
3716C21222267J103897r81788k419014l085461k942486k000427l67336J666717L585549
$$ 321222267 322326164 321344376 318925362 315839901 312897415 310896988 310529652 312196369 315781918
3725C15781918M710216M394684K314911j261063n375747q589364r498024p384719k689381
$$ 315781918 320492134 324886818 327201729 325940666 320564919 311975555 302477531 295092812 292403431
3734B92403431L006229P571278R272156P603492L537083r85985m071445m836655l772831
$$ 292403431 295409660 302980938 312253094 319856586 323393669 322407684 318336239 313499584 309726753
3743C09726753k306709j839829k859096m659729n833511n198327k574539J068535M169369
$$ 309726753 307420044 305580215 302721119 298061390 292227879 287029552 284455013 285523548 289692917
3752B89692917N471744M705964K664814O70337k05555L03746J619510K748490K876644
$$ 289692917 295164661 299870625 302535439 303205776 303000221 303303967 304923477 307671967 310548611
3761C10548611J776848j53714k167072l537807l832970k996731j293755P98607K703038
$$ 310548611 312325459 312171745 310004673 306466866 302633896 299637165 298343410 299142017 301845055
3770C01845055L866367L918343K828006R70917r78470k321110k655220k058754j016922
$$ 301845055 305711422 309629765 312457771 313428688 312450218 310129108 307473888 305415134 304398212
3779C04398212j23882K62089J99318O9332K83527R89933J975899K819634L172054K964096
$$ 304398212 304274330 304536419 304735737 304805069 305088596 306078529 308054428 310874062 314046116 317010212
3789C17010212K399120J753845J149331M73976m83170j793976l240966m385243m823227
$$ 317010212 319409332 321163177 322312508 322786484 322303314 320509338 317268372 312883129 308059902
3798C08059902m446869l515205k469883j619625r25083m8333J348897L265323N226822
$$ 308059902 303613033 300097828 297627945 296008320 295083237 295034904 296383801 299649124 304875946
3807C04875946O476631O384640M817448K230339n76134k871666m315968m995822n192109
$$ 304875946 311352577 317737217 322554665 324785004 324208870 321337204 317021236 312025414 306833305
3816C06833305n074615m553795l396034j501370Q74348L136673M625301M972840M310531
$$ 306833305 301758690 297204895 293808861 292307491 293181839 296318512 300943813 305916653 310227184
3825C10227184L180771K201634J692409J500244J131935J09768j675262l836861n667877
$$ 310227184 313407955 315609589 317301998 318802242 319934177 320043945 318368683 314531822 308863945
3834C08863945o510258o088237m604474k551937l77502J766929M003582O442090Q821106
$$ 308863945 302353687 296265450 291660976 289109039 288731537 290498466 294502048 300944138 309765244
3843C09765244J0354270R965058O852493J103363o027603j2407169j5827256j4966831
$$ 309765244 320119514 330084572 336937065 338040428 332012825 319605656 303778400 288811569
3851B88811569j0031814k732525M419079R158134J0361748Q377437M674874J048565
$$ 288811569 278779755 276047230 280466309 289624443 299986191 308363628 313038502 314087067
3859C14087067j207524j762905j186695m68063m18530j264610k599583l666439l784046
$$ 314087067 312879543 311116638 309929943 309461880 309043350 307778740 305179157 301512718 297728672
3868B97728672k693882o70986J625099L453217M292354M005795K822418J181812m54883
$$ 297728672 295034790 294363804 295988903 299442120 303734474 307740269 310562687 311744499 311289616
3877C11289616j737347k468433k588234k149849j317063l59573L98884O98967M89101
$$ 311289616 309552269 307083836 304495602 302345753 301028690 300669117 301068001 301766968 302256069
3886C02256069M58l24745n0907R86900K526092L934479M477444L664761J498279j501770
$$ 302256069 302256527 301931782 301880875 302867775 305393867 309328346 313805790 317470551 318968830 317467060
3896C17467060m501705o672897p477589o804733m935112k389298K56634K521610M101429
$$ 317467060 312965355 306292458 298814869 292010136 287075024 284685726 284942360 287463970 291565399
3905B91565399M885006M917832M339599L321095K030754O35833o75067j690846k221126
$$ 291565399 296450405 301368237 305707836 309028931 311059685 311695518 311020451 309329605 307108479
3914C07108479k178917j646786q70876j59111K67639L80268L28159L10402M15669N44471
$$ 307108479 304929562 303282776 302411900 302252789 302520428 302900696 303228855 303539257 303954926 304499397
3924C04499397M76914M6272p00264j470108j861019j586437o55308O05888J704426
$$ 304499397 304976311 305022583 304322319 302852211 300991192 299404755 298749447 299355335 301059761
3933C01059761K217693J987057J169930J38721p07378j116753j069393p44934m05522
$$ 301059761 303277454 305264511 306434441 306573162 305865784 304749031 303679638 302934704 302529182
3942C02529182k57721l56388n93357p69787p13424l76950J35365O25534R08299R02671
$$ 302529182 302271461 301915073 301321716 300551929 299838505 299461555 299596920 300222454 301130753 302033424
3952C02033424O55613K93179n7964l24860m87690n44300m83647k94284k709L07198
$$ 302033424 302689037 302982216 302924252 302599392 302111702 301567402 301083755 300789471 300786762 301093960
3962C01093960N17883N41496L73726R3403j90239m04835n39417o12907o25267n42298
$$ 301093960 301611843 302153339 302527065 302620468 302430229 302025394 301485977 300873070 300247803 299705505
3972B99705505l38058n1937K01435K99091K08168K7542q0108k5540J14365J43261q3637
$$ 299705505 299367447 299315510 299516945 299816036 300024204 300051746 299971638 299946098 300060463 300203724 300120087
3983C00120087n02930q51383q69904n56564k39735l52840j038933j905689k216320
$$ 300120087 299617157 298765774 297895870 297339306 297099571 296746731 295707798 293802109 291585789
3992B91585789j507225k50473l1433k926751j0287151k1600323l4193897m4125080
$$ 291585789 290078564 289828091 289796658 286869907 276582756 254982433 220788536 176663456
4000A76663456
$$ 176663456
##END=$$ End of the data block
