##TITLE=$$ Begin of the data block
##JCAMP-DX=5.00 $$ ACD/SpecManager v 10.08
##SPECTROMETER/DATA SYSTEM=16PC
##DATE=Fri Sep 13 14:34:24 2013
##DATA TYPE=INFRARED SPECTRUM
##DATA CLASS=XYDATA
##ORIGIN=
##OWNER=
##NPOINTS=3601
##FIRSTX=400.00000000
##LASTX=4000.00000000
##MAXX=4000.00000000
##MINX=400.00000000
##MAXY=38.69699860
##MINY=5.11616325
##XFACTOR=1.0000000000
##YFACTOR=0.000000100000000
##FIRSTY=20.62360001
##DELTAX=1.00000000
##XUNITS=1/CM
##YUNITS=TRANSMITTANCE
##XYDATA=(X++(Y..Y))
$$ plain form
400 206236000 259541740 301874332 329851837 344508209 349879875 350651131 350182953 349793930 349287567
409 349287567 348034172 345792084 342867279 339768486 336816254 334055214 331470604 329239922 327756729
418 327756729 327396431 328229485 329929962 331957550 333866882 335508728 336992378 338477859 339991493
427 339991493 341409225 342594452 343542786 344390602 345275726 346174431 346866684 347073250 346664467 345772247
437 345772247 344710732 343757744 342960281 342106667 340883789 339100456 336818085 334306374 331877403
446 331877403 329732361 327932816 326497612 325524635 325218811 325779915 327222099 329256058 331335678
455 331335678 332864952 333453178 333073654 332037468 330805130 329752426 329023247 328537827 328124695
464 328124695 327668686 327168808 326666565 326100960 325198479 323491974 320483360 315880432 309791508
$$ packed form
400B06236000N3305740M2332592K7977505J4656372N371666P71256m68178l89023n06363
409C49287567j253395k242088k924805l098793k952232k761040k584610k230682j483193
418C27756729l60298Q33054J700477K027588J909332J641846J483650J485481J513634
427C39991493J417732J185227R48334Q47816Q85124Q98705O92253K06566m08783q92220
437C45772247j061515r52988p97463q53614j222878j783333k282371k511711k428971
446C31877403k145042j799545j435204r72977l05824N61104J442184K033959K079620
455C31335678J529274N88226l79524j036186j232338j052704p29179m85420m13132
464C28124695m56009m99878n02243n65605r02481j706505l008614m602928o088924
$$ plain form
473 309791508 302787971 295815086 289997482 286414738 285899010 288875980 295253105 304378319 315115681
482 315115681 326071129 335941238 343874741 349691238 353841324 357109642 360195770 363379745 366433487
491 366433487 368811035 369999428 369837074 368633385 367038345 365737724 365128860 365125656 365174980 364471130
501 364471130 362279892 358246498 352574806 346008949 339625168 334510117 331449661 330742989 332201233
510 332201233 335307541 339444046 344074745 348820152 353424187 357678146 361377106 364345245 366513481
519 366513481 367988930 369057922 370100975 371446877 373229980 375319023 377357750 378908653 379646492
528 379646492 379516640 378784332 377940178 377495537 377757225 378689423 379934769 380989342 381444778 381173859
538 381173859 380362968 379375763 378525696 377883263 377228203 376178093 374427643 371970367 369176712
$$ packed form
473C09791508p003537o972885n817604l582744n15728K976970O377125R125214J0737362
482C15115681J0955448R870109P933503N816497M150086L268318L086128L183975L053742
491C66433487K377548J188393j62354j203689j595040j300621o08864l204M9324p03850
501C64471130k191238m033394n671692o565857o383781n115051l060456p06672J458244
510C32201233L106308M136505M630699M745407M604035M253959L698960K968139K168236
519C66513481J475449J068992J043053J345902J783103K089043K038727J550903P37839
528C79646492j29852p32308q44154m44641K61688R32198J245346J054573M55436k70919
538C81173859q10891r87205q50067o42433o55060j050110j750450k457276k793655
$$ plain form
547 369176712 366673660 365074234 364687576 365361633 366544991 367547455 367868462 367422485 366545715
556 366545715 365783081 365581779 366061096 366982613 367916794 368490219 368557968 368209343 367633400 366958199
566 366958199 366183014 365240784 364126701 362978592 362035255 361492729 361357307 361403198 361269989 360645027
576 360645027 359420052 357737160 355911255 354286423 353106384 352449760 352228889 352224121 352130089 351612816
586 351612816 350385857 348297348 345397263 341944389 338339500 335009041 332290726 330362320 329220848
595 329220848 328691788 328447495 328043213 327000961 324960899 321867447 318105278 314486389 312048702
604 312048702 311721687 313997803 318757496 325325737 332721901 339980125 346397781 351631050 355644608
613 355644608 358587570 360675583 362123222 363121223 363826714 364345970 364714165 364896469 364829369 364491730
$$ packed form
547C69176712k503052j599426l86658O74057J183358J002464L21007m45977q76770
556C66545715p62634k01302M79317R21517R34181N73425O7749l48625n75943o75201
566C66958199p75185r42230j114083j148109r43337n42526j35422M5891j33209o24962
576C60645027j224975j682892j825905j624832j180039o56624k20871m768r4032n17273
586C51612816j226959k088509k900085l452874l604889l330459k718315j928406j141472
595C29220848n29060k44293m04282j042252k040062l093452l762169l618889k437687
604C12048702l27015K276116M759693O568241P396164P258224O417656N233269M013558
613C55644608K942962K088013J447639R98001P05491N19256L68195J82304o7100l37639
$$ plain form
623 364491730 363967857 363457718 363208923 363391075 363969460 364649582 364940186 364328003 362499123 359512062
633 359512062 355839233 352248764 349569778 348430214 349066582 351263771 354434509 357794685 360578537
642 360578537 362233124 362549591 361695557 360135918 358456535 357148056 356436310 356236610 356253777 356168747
652 356168747 355802345 355161285 354354706 353459854 352454834 351281128 349987564 348824272 348168182
661 348168182 348278885 349025879 349790192 349663353 347880821 344260635 339382706 334381638 330452080
670 330452080 328336906 328075447 329123421 330735741 332362328 333831673 335261154 336809769 338468895
679 338468895 340029297 341218567 341886711 342098846 342076302 342039680 342068520 342068672 341853218 341269073 340281029
690 340281029 338967857 337452393 335827904 334136734 332411118 330742111 329321136 328417397 328292046
$$ packed form
623C64491730n23873n10139k48795J82152N78385O80122K90604o12183j828880k987061
633C59512062l672829l590469k678986j139564O36368K197189L170738L360176K783852
642C60578537J654587L16467q54034j559639j679383j308479p11746j99700J7167q5030
652C56168747l66402o41060q06579q94852j005020j173706j293564j163292o56090
661C48168182J10703P46994P64313j26839j782532l620186m877929n001068l929558
670C30452080k115174k61459J047974J612320J626587J469345J429481J548615J659126
679C38468895J560402J189270O68144K12135k2544l6622K8840J52k15454n84145r88044
690C40281029j313172j515464j624489j691170j725616j669007j420975r03739j25351
$$ plain form
699 328292046 329087906 330746307 332995872 335423126 337601128 339223709 340189705 340602951 340691872
708 340691872 340690613 340738373 340839615 340891266 340751190 340306091 339510307 338391762 337038918 335582619
718 335582619 334176636 332969475 332065125 331487312 331168213 330977554 330783463 330509949 330158234 329776840
728 329776840 329403000 329016762 328540802 327886086 327010727 325946999 324775200 323558006 322277908
737 322277908 320820694 319020519 316745205 313979092 310861187 307660294 304697838 302251835 300477848
746 300477848 299374046 298794956 298501854 298224487 297711315 296755810 295204887 292963715 290009689
755 290009689 286413536 282351608 278087444 273916225 270086193 266728439 263825359 261225910 258693638
764 258693638 255960903 252770004 248903179 244213581 238665447 232372780 225609322 218768005 212271805
$$ packed form
699C28292046P95860J658401K249565K427254K178002J622581R65996M13246Q8921
708C40691872j259M7760J01242N1651j40076m45099p95784j118545j352844j456299
718C35582619j405983j207161r04350n77813l19099j90659j94091k73514l51715l81394
728C29776840l73840l86238m75960o54716q75359j063728j171799j217194j280098
737C22277908j457214j800175k275314k766113l117905l200893k962456k446003j773987
746C00477848j103802n79090k93102k77367n13172r55505j550923k241172k954026
755B90009689l596153m061928m264164m171219l830032l357754k903080k599449k532272
764B58693638k732735l190899l866825m689598n548134o292667o763458o841317o496200
$$ plain form
773 212271805 206468506 201554718 197559395 194387054 191887321 189913902 188351059 187113209 186138878
782 186138878 185397568 184908180 184752617 185065975 185998802 187664509 190094528 193219681 196882744
791 196882744 200875263 204984608 209037094 212928162 216631603 220187111 223670292 227156773 230695934
800 230695934 234302883 237971592 241695518 245483513 249360313 253354015 257477932 261717415 266025600
809 266025600 270326462 274523335 278511734 282195511 285503769 288400784 290882645 292961693 294650497
818 294650497 295962296 296934700 297666836 298342609 299213619 300535355 302477398 305049400 308079071
827 308079071 311255608 314219570 316661510 318394909 319386215 319743156 319677048 319449596 319315968 319471340
837 319471340 320013847 320937119 322155914 323557701 325055466 326619263 328271866 330057526 332001534
$$ packed form
773B12271805n803299m913788l995323l172341k499733j973419j562843j237850r74331
782A86138878p41310m89388j55563L13358R32827J665707K430019L125153L663063
791A96882744L992519M109345M052486L891068L703441L555508L483181L486481L539161
800B30695934L606949L668709L723926L787995L876800L993702M123917M239483M308185
809B66025600M300862M196873L988399L683777L308258K897015K481861K079048J688804
818B94650497J311799R72404P32136O75773Q71010J321736J942043K572002L029671
827C08079071L176537K963962K441940J733399R91306L56941o6108k27452j33628J55372
837C19471340N42507R23272J218795J401787J497765J563797J652603J785660J944008
$$ plain form
846 332001534 334084587 336241951 338383026 340420914 342294655 343975983 345456810 346719551 347702980
855 347702980 348281631 348281136 347541084 346012039 343847504 341434593 339325294 338074379 338041878 339249802
865 339249802 341367531 343840599 346109428 347814674 348894386 349536057 350018311 350537720 351112137
874 351112137 351608963 351873093 351874847 351789818 351959610 352749176 354373512 356782608 359667015 362581902
884 362581902 365129280 367108421 368564301 369717789 370823669 372034607 373340874 374606743 375670471
893 375670471 376442604 376947327 377291183 377588921 377898293 378203621 378451576 378607521 378693390 378780327
903 378780327 378944435 379217148 379561768 379891281 380113564 380177002 380090294 379910355 379708824 379538383
913 379538383 379416847 379331512 379257393 379177094 379092064 379021988 378997154 379046288 379186287 379413986 379701691
$$ packed form
846C32001534K083053K157364K141075K037888J873741J681328J480827J262741R83429
855C47702980N78651m95p40052j529045k164535k412911k109299j250915l2501J207924
865C39249802K117729K473068K268829J705246J079712O41671M82254N19409N74417
874C51112137M96826K64130J754q5029J69792P89566J624336K409096K884407K914887
884C62581902K547378J979141J455880J153488J105880J210938J306267J265869J063728
893C75670471P72133N04723L43856K97738L09372L05328K47955J55945Q5869Q6937
903C78780327J64108K72713L44620L29513K22283O3438q6708j79939k01531j70441
913C79538383j21536q5335p4119q0299q5030p0076k4834M9134J39999K27699K87705
$$ plain form
924 379701691 379996948 380228271 380317802 380200806 379844513 379261055 378504295 377649460 376762466 375872841
934 375872841 374967117 374006805 372963982 371851997 370730400 369675674 368732567 367874908 367002869
943 367002869 365982895 364710312 363159790 361395798 359540596 357723923 356049309 354595871 353447762
952 353447762 352720757 352556419 353074493 354309196 356164513 358420181 360789909 363003616 364875793
961 364875793 366332283 367392197 368124580 368605118 368889923 369009171 368974571 368792114 368476410 368062630
971 368062630 367612152 367204018 366910477 366763611 366731339 366719513 366608315 366306229 365796089 365144615
981 365144615 364469452 363878517 363417511 363051872 362693062 362249680 361675072 360982780 360225716 359454498
991 359454498 358682671 357877464 356980209 355939903 354738884 353394890 351941452 350401382 348771515
$$ packed form
924C79701691K95257K31323Q9531j16996l56293n83458p56760q54835q86994q89625
934C75872841r05724r60312j042823j111985j121597j054726r43107q57659q72039
943C67002869j019974j272583j550522j763992j855202j816673j674614j453438j148109
952C53447762p27005j64338N18074J234703J855317K255668K369728K213707J872177
961C64875793J456490J059914P32383M80538K84805J19248l4600j82457l15704m13780
971C68062630m50478m08134k93541j46866l2272j1826j11198l02086n10140o51474
981C65144615o75163n90935m61006l65639l58810m43382n74608o92292p57064p71218
991C59454498p71827q05207q97255j040306j201019j343994j453438j540070j629867
$$ plain form
1000 348771515 347028961 345153656 343152847 341068687 338966331 336909447 334940567 333079071 331335258
1009 331335258 329726601 328278656 327004585 325875053 324803543 323666458 322358627 320859604 319271145
1018 319271145 317800179 316687031 316111889 316124802 316634827 317460995 318414612 319371414 320297165 321223564
1028 321223564 322194138 323213577 324225807 325125809 325793610 326130867 326088638 325678673 324972191 324087601
1038 324087601 323167038 322344360 321710205 321287041 321026573 320833473 320606728 320281219 319847794 319345455
1048 319345455 318830357 318337746 317857170 317328796 316661053 315757809 314544754 312984772 311079788
1057 311079788 308859634 306362247 303610916 300596828 297275105 293576603 289431591 284794159 279653339
1066 279653339 274025936 267934494 261384068 254352131 246795921 238671112 229949608 220626259 210715790
$$ packed form
1000C48771515j742554j875305k000809k084160k102356k056884j968880j861496j743813
1009C31335258j608657j447945j274071j129532j071510j137085j307831j499023j588459
1018C19271145j470966j113148n75142J2913N10025Q26168R53617R56802R25751R26399
1028C21223564R70574J019439J012230R00002O67801L37257m2229m09965p06482q84590
1038C24087601r20563q22678o34155m23164k60468j93100k26745l25509m33425n02339
1048C19345455n15098m92611m80576n28374o67743r03244j213055j559982j904984
1057C11079788k220154k497387k751331l014088l321723l698502m145012m637432n140820
1066B79653339n627403o091442o550426p031937p556210q124809q721504r323349r910469
$$ plain form
1075 210715790 200250931 189292049 177950573 166414452 154958029 143924007 133677998 124553814
1083 124553814 116811476 110624628 106095133 103280058 102207060 102861881 105148840 108841658 113556414
1092 113556414 118774576 123930264 128549681 132402048 135607100 138647699 142265081 147257690 154245033
1101 154245033 163475857 174746895 187455769 200762501 213795738 225835209 236421833 245383263
1109 245383263 252796326 258917141 264106007 268759098 273242855 277833385 282667084 287721615 292842083
1118 292842083 297814789 302465782 306744595 310755367 314714584 318852558 323301201 328021469 332805519
1127 332805519 337350159 341365814 344667053 347206268 349043083 350277557 350988808 351208420 350933762
1136 350933762 350157928 348890457 347155151 344975777 342371864 339381790 336106682 332748299 329607391
$$ packed form
1075B10715790j0464859j0958882j1341476j1536121j1456423j1034022j0246009r124184
1083A24553814p742338o186848m529495k815075j072998O54821K286959L692818M714756
1092A13556414N218162N155688M619417L852367L205052L040599L617382M992609O987343
1101A54245033R230824J1271038J2708874J3306732J3033237J2039471J0586624Q961430
1109B45383263P413063O120815N188866M653091M483757M590530M833699N054531N120468
1118B92842083M972706M650993M278813M010772L959217M137974M448643M720268M784050
1127C32805519M544640M015655L301239K539215J836815J234474P11251K19612k74658
1136C50933762p75834j267471j735306k179374k603913k990074l275108l358383l140908
$$ plain form
1145 329607391 327027626 325300217 324569778 324786301 325724106 327058487 328460159 329665184 330495605
1154 330495605 330838165 330609589 329738579 328174553 325908966 322981148 319452038 315357628 310677319
1163 310677319 305355320 299385509 292925758 286377392 280367241 275612030 272706947 271922951 273102760
1172 273102760 275704212 278973866 282180271 284818230 286714382 288010826 289047222 290191784 291679115
1181 291679115 293503933 295403576 296935558 297625942 297140198 295410519 292668896 289369602 286033726
1190 286033726 283079376 280705738 278868866 277340317 275808411 273970318 271585007 268483829 264557476
1199 264557476 259741116 254008560 247371845 239880104 231611042 222658024 213117847 203083858
1207 203083858 192645531 181892891 170923538 159852085 148819304 137998705 127596998 117848740
$$ packed form
1145C29607391k579765j727409p30439K16523R37805J334381J401672J205025Q30421
1154C30495605L42560k28576q71010j564026k265587k927818l529110m094410m680309
1163C10677319n321999n969811o459751o548366o010151m755211k905083p83996J179809
1172B73102760K601452L269654L206405K637959J896152J296444J036396J144562J487331
1181B91679115J824818J899643J531982O90384m85744j729679k741623l299294l335876
1190B86033726k954350k373638j836872j528549j531906j838093k385311l101178l926353
1199B64557476m816360n732556o636715p491741q269062q953018r540177j0033989
1207B03083858j0438327j0752640j0969353j1071453j1032781j0820599j0401707r748258
$$ plain form
1215 117848740 109007187 101332502 95075026 90446568 87573490 86439934 86843147 88395443 90595112
1224 90595112 92961912 95193729 97282324 99531603 102463064 106640396 112483931 120145702 129485149
1233 129485149 140138731 151639366 163530598 175439529 187099876 198343182 209080582 219288349
1241 219288349 228994865 238262520 247157249 255716515 263926163 271720657 279004116 285679340 291668797
1250 291668797 296917591 301382008 305017204 307774830 309613800 310514221 310484791 309558601 307785740
1259 307785740 305232620 301995850 298222103 294117260 289927292 285890331 282174072 278825207 275749969
1268 275749969 272733898 269486198 265693188 261066093 255380421 248509636 240453644 231357536 221509361
1277 221509361 211311226 201227665 191725044 183216877 176026344 170365791 166330090 163902149
$$ packed form
1215A17848740q841553p674685o257476m628458k873078j133556M03213J552296K199669
1224I0595112K366800K231817K088595K249279K931461M177332N843535P661771R339447
1233A29485149J0653582J1500635J1891232J1908931J1660347J1243306J0737400J0207767
1241B19288349R706516R267655Q894729Q559266Q209648P794494P283459O675224N989457
1250B91668797N248794M464417L635196K757626J838970R00421k9430r26190j772861
1259C07785740k553120l236770l773747m104843m189968m036961l716259l348865l075238
1268B75749969l016071l247700l793010m627095n685672o870785q055992r096108r848175
1277B21509361j0198135j0083561r502621q508167p190533n660553m035701k427941
$$ plain form
1285 163902149 162972984 163380241 164960079 167598095 171256046 175958843 181744537 188598747 196404552
1294 196404552 204931698 213861485 222825260 231426506 239234657 245768490 250510883 252992020 252942486
1303 252942486 250468311 246163521 241081409 236537762 233793602 233727608 236618824 242116871 249396954
1312 249396954 257420540 265194111 271937294 277129841 280467815 281790791 281036034 278246651 273622150
1321 273622150 267576618 260766869 254059772 248433094 244824505 243964005 246235447 251607037 259648266
1330 259648266 269623451 280629406 291741161 302140312 311217880 318646755 324413757 328790245
1338 328790245 332228813 335203743 338046303 340846291 343466339 345660477 347228928 348124390 348453102
1347 348453102 348385124 348043480 347449837 346559677 345349541 343877487 342252121 340507774 338456917
$$ packed form
1285A63902149r29165M07257J579838K638016L657951M702797N785694O854210P805805
1294A96404552Q527146Q929787Q963775Q601246P808151O533833M742393K481137m9534
1303B52942486k474175m304790n082112m543647k744160o5994K891216N498047P280083
1312B49396954Q023586P773571O743183N192547L337974J322976p54757k789383m624501
1321B73622150o045532o809749o707097n626678l608589q60500K271442N371590Q041229
1330B59648266R975185J1005955J1111755J0399151R077568P428875N767002M376488
1338C28790245L438568K974930K842560K799988K620048K194138J568451Q95462L28712
1347C48453102o7978l41644n93643q90160j210136j472054j625366j744347k050857
$$ plain form
1356 338456917 335624771 331339417 324979553 316291447 305641613 294081459 283166027 274566422
1364 274566422 269598007 268828773 271909866 277691059 284577045 290987682 295753117 298312054 298678627
1373 298678627 297241459 294519253 290984478 287001438 282852955 278785286 275019474 271719818 268958607
1382 268958607 266722698 264975452 263744392 263171349 263479996 264858570 267313042 270573292 274116325
1391 274116325 277314873 279651737 280900536 281183586 280877724 280415649 280085068 279924908 279761696
1400 279761696 279345760 278497810 277177563 275449982 273394356 271035557 268351841 265348186 262125340
1409 262125340 258876209 255791302 252928715 250140800 247121868 243569965 239379635 234763222 230231171
1418 230231171 226436443 223951244 223069687 223711987 225463619 227733078 229971008 231867409 233440189
$$ packed form
1356C38456917k832146m285354o359864q688106j0649834j1560154j0915432q599605
1364B74566422m968415p69234L081093N781193O885986O410637M765435K558937L66573
1373B98678627j437168k722206l534775l983040m148483m067669l765812l299656k761211
1382B68958607k235909j747246j231060n73043L08647J378574K454472L260250L543033
1391B74116325L198548K336864J248799K83050l05862m62075l30581j60160j63212
1400B79761696m15936q47950j320247j727581k055626k358799k683716l003655l222846
1409B62125340l249131l084907k862587k787915l018932l551903m190330m616413m532051
1418B30231171l794728k485199q81557O42300J751632K269459K237930J896401J572780
$$ plain form
1427 233440189 234965496 236767082 238964272 241316051 243266811 244194546 243738956 242028637 239670715
1436 239670715 237498798 236213055 236098766 236955357 238235836 239291973 239592571 238844852 237027378
1445 237027378 234378662 231354942 228522434 226354408 224971371 223961391 222438316 219398937 214256458
1454 214256458 207273140 199617462 192951508 188725929 187552223 188999481 191929073 195169735 198134212
1463 198134212 201025181 204530334 209219418 215031357 221170197 226473312 230023251 231639099 231964779
1472 231964779 232118740 233124657 235446663 238868923 242741833 246412144 249574394 252359371 255145721
1481 255145721 258238983 261621494 264919243 267605228 269332218 270219021 270927963 272457333 275702934
1490 275702934 280971241 287690792 294524937 299914970 302849426 303473129 303158131 303893166 307225647
$$ packed form
1427B33440189J525307J801586K197190K351779J950760R27735m55590j710319k357922
1436B39670715k171917j285743j14289Q56591J280479J056137L00598p47719j817474
1445B37027378k648716l023720k832508k168026j383037j009980j523075l039379n142479
1454B14256458o983318p655678o665954m225579j173706J447258K929592L240662K964477
1463A98134212K890969L505153M689084N811939O138840N303115L549939J615848L25680
1472B31964779J53961J005917K322006L422260L872910L670311L162250K784977K786350
1481B55145721L093262L382511L297749K685985J726990Q86803P08942J529370L245601
1490B75702934N268307O719551O834145N390033K934456O23703l14998P35035L332481
$$ plain form
1499 307225647 313288078 320475273 326026726 327281837 322973709 313877029 302472725 291829891
1507 291829891 284325027 280859776 280899277 283164959 286478596 290264664 294515781 299390564 304801121
1516 304801121 310272102 315116997 318763428 321007423 322076721 322522850 323033409 324236526 326518250
1525 326518250 329872742 333844872 337654610 340524826 342094498 342677803 343154907 344472847 346996651
1534 346996651 350103455 352320023 352003326 348232727 341421967 333294601 326206512 322152557 321953964
1543 321953964 325011292 329707375 334224129 337362633 338988914 339923592 341356697 344073868 347866364
1552 347866364 351423111 352803078 350317154 343436356 333280678 322398682 313865223 310064373
1560 310064373 311709747 317567329 325023079 331226349 334268150 333845100 331136017 328012924 326023979
$$ packed form
1499C07225647O062431P187195N551453J255111m308128r096680j1404304j0642834
1507B91829891p504864l465251L9501K265682L313637L786068M251117M874783N410557
1516C04801121N470981M844895L646431K243995J069298M46129N10559J203117K281724
1525C26518250L354492L972130L809738K870216J569672N83305M77104J317940K523804
1534C46996651L106804K216568l16697l770599o810760q127366p088089m053955j98593
1543C21953964L057328M696083M516754L138504J626281R34678J433105K717171L792496
1552C47866364L556747J379967k485924o880798j0155678j0881996q533459l800850
1560C10064373J645374N857582P455750O203270L041801m23050k709083l123093j988945
$$ plain form
1569 326023979 325665665 326276970 326547508 325326233 322287483 318120384 314176769 311797943 311686420
1578 311686420 313633804 316705875 319736519 321847115 322730141 322603645 321930275 321100578 320255051
1587 320255051 319302559 318068275 316451054 314496899 312370644 310267963 308325748 306571903 304926109
1596 304926109 303245106 301394615 299318314 297065010 294744453 292428017 290056076 287439632 284391899
1605 284391899 280927792 277389603 274364491 272385273 271567116 271419182 270998039 269361019 266073036
1614 266073036 261456470 256418495 251947651 248579617 246143494 243916092 241056862 237044601 231878338
1623 231878338 225983257 219946518 214265423 209216957 204832020 200901051 196973763 192401333 186495857
1632 186495857 178811073 169426556 159051199 148827677 139887724 132872648 127676296 123549538
$$ packed form
1569C26023979l58314O11305K70538j221275l038750m167099l943615k378826j11523
1578C11686420J947384L072071L030644K110596Q83026j26496o73370q29697q45527
1587C20255051r52492j234284j617221j954155k126255k102681j942215j753845j645794
1596C04926109j681003j850491k076301k253304k320557k316436k371941k616444l047733
1605B84391899l464107l538189l025112j979218q18157j47934m21143j637020l287983
1614B66073036m616566n037975m470844l368034k436123k227402k859230m012261n166263
1623B31878338n895081o036739n681095n048466m384937l930969l927288m572430n905476
1632A86495857p684784r384517j0375357j0223522q939953p015076n196352m126758
$$ plain form
1640 123549538 119507465 114816513 109316139 103437853 97953253 93609533 90840797 89680433 89895382
1649 89895382 91259031 93818293 98003025 104487314 113832617 126074047 140483637 155688200
1657 155688200 170140457 182722931 193153400 201945076 209931736 217641315 224908352 230967064
1665 230967064 234955807 236489353 235917034 234106617 231924896 229792767 227622910 225158081 222424374
1674 222424374 219920006 218352299 218073997 218613758 218671417 216653328 211469040 203127956 192780666
1683 192780666 182184181 172896709 165640564 160135822 155415134 150375490 144244137 136756849
1691 136756849 128053942 118453569 108281565 97841644 87484703 77670922 68942142 61798701
1699 61798701 56548781 53215542 51553144 51161633 51644535 52742286 54389863 56683526 59773302
$$ packed form
1640A23549538m042073m690952n500374n878286n484600m343720k768736j160364K14949
1649H9895382J363649K559262M184732O484289R345303J2241430J4409590J5204563
1657A55688200J4452257J2582474J0430469Q791676P986660P709579P267037O058712
1665B30967064L988743J533546n72319j810417k181721k132129k169857k464829k733707
1674B22424374k504368j567707k78302N39761N7659k018089n184288q341084j0347290
1683A92780666j0596485r287472p256145n504742m720688n039644o131353p487288
1691A36756849q702907r600373j0172004j0439921j0356941r813781q728780p143441
1699F1798701n249920l333239j662398l91511M82902J097751J647577K293663L089776
$$ plain form
1708 59773302 63720598 68375134 73323917 77945642 81568394 83682337 84124651 83153248 81366482
1717 81366482 79495769 78162999 77717519 78227391 79614687 81841526 85021687 89379454 95076799
1726 95076799 102024260 109816313 117861223 125655241 133043699 140304441 147982664 156557083 166127872
1735 166127872 176311741 186414852 195784683 204135418 211654091 218826847 226091022 233523540
1743 233523540 240753174 247149429 252181854 255744286 258263874 260537148 263384418 267307129 272314129
1752 272314129 277982788 283690300 288876534 293209438 296609726 299181137 301136494 302774830 304489746
1761 304489746 306733742 309879627 314004574 318718300 323179474 326367073 327519875 326533279 324087410
1770 324087410 321411667 319783630 320011177 322152176 325586243 329361343 332609749 334833107 335974388
$$ packed form
1708E9773302L947296M654536M948783M621725L622752K113943M42314r71403j786766
1717H1366482j870713j332770m45480N09872J387296K226839L180161M357767N697345
1726I5076799O947461P792053Q044910P794018P388458P260742P678223Q574419R570789
1735A66127872J0183869J0103111R369831Q350735P518673P172756P264175P432518
1743B33523540P229634O396255N032425L562432K519588K273274K847270L922711N007000
1752B72314129N668659N707512N186234M332904L400288K571411J955357J638336J714916
1761C04489746K243996L145885M124947M713726M461174L187599J152802r86596k445869
1770C24087410k675743j628037K27547K140999L434067L775100L248406K223358J141281
$$ plain form
1779 335974388 336325378 336376724 336681137 337727280 339790840 342772713 346113129 348895493 350177956
1788 350177956 349441299 346923866 343625565 340923157 339958496 341113434 343849297 347002411 349374619
1797 349374619 350305328 349936295 349056168 348641167 349351196 351235161 353769417 356167679 357778587
1806 357778587 358365021 358147507 357621880 357280197 357388382 357929459 358710098 359539032 360353127 361218300
1816 361218300 362224998 363370781 364522743 365488739 366134338 366451187 366519127 366398201 366047668 365356750
1826 365356750 364277267 362958336 361759834 361106415 361265678 362206764 363648720 365268440 366913300
1835 366913300 368647499 370583496 372619820 374300842 374947929 374024239 371516380 368073387 364783936
1844 364783936 362694473 362339172 363544807 365602074 367678566 369218979 370115662 370598946 370966721
$$ packed form
1779C35974388L50990N1346L04413J046143K063560K981873L340416K782364J282463
1788C50177956p36657k517433l298301k702408r64661J154938K735863L153114K372208
1797C49374619R30709l69033q80127m15001P10029J883965K534256K398262J610908
1806C57778587N86434k17514n25627l41683J08185N41077P80639Q28934Q14095Q65173
1816C61218300J006698J145783J151962R65996O45599L16849O7940j20926l50533o90918
1826C65356750j079483j318931j198502o53419J59263R41086J441956J619720J644860
1835C66913300J734199J935997K036324J681022O47087r23690k507859l442993l289451
1844C64783936k089463l55301J205635K057267K076492J540413Q96683M83284L67775
$$ plain form
1853 370966721 371350403 371662445 371731491 371507378 371184883 371147881 371756973 373097763 374840279 376309586
1863 376309586 376757393 375715790 373257484 370019989 366962662 364965935 364467392 365315971 366908493
1872 366908493 368516541 369620018 370073662 370053253 369859390 369725151 369737358 369876633 370099297 370372505
1882 370372505 370642319 370787926 370635834 370052452 369057045 367860680 366782913 366088638 365852051 365941277
1892 365941277 366127968 366239204 366242599 366214333 366233940 366301117 366341629 366287956 366152039 366016922 365946808
1903 365946808 365893707 365694199 365182915 364351006 363426476 362796707 362801437 363522682 364709892 365895882
1913 365895882 366635971 366724968 366269493 365586586 365009880 364725761 364728355 364891815 365092392 365292931
1923 365292931 365546951 365937004 366499214 367183914 367870789 368422775 368750153 368852692 368824883 368820419
$$ packed form
1853C70966721L83682L12042O9046k24113l22495l7002O09092J340790J742516J469307
1863C76309586M47807j041603k458306l237495l057327j996727m98543Q48579J592522
1872C66908493J608048J103477M53644k0409j93863j34239J2207J39275K22664K73208
1882C70372505K69814J45607j52092n83382r95407j196365j077767o94275k36587Q9226
1892C65941277J86691J11236L395k8266J9607O7177M0512n3673j35917j35117p0114
1903C65946808n3101j99508n11284q31909r24530o29769M730P21245J187210J185990
1913C65895882P40089Q8997m55475o82907n76706k84119K594J63460K00577K00539
1923C65292931K54020L90053N62210O84700O86875N51986L27378J02539k7809m464
$$ plain form
1933 368820419 368985100 369382515 369944954 370479088 370736275 370523911 369805222 368736496 367613945 366754074
1943 366754074 366365547 366474533 366938362 367530289 368045616 368374367 368512497 368519402 368460617 368369522 368247414
1954 368247414 368089180 367912636 367766151 367709770 367780724 367963905 368184967 368333435 368306198 368053360
1964 368053360 367606735 367076950 366618690 366375008 366424065 366749153 367247047 367770538 368187943 368430672
1974 368430672 368508568 368487320 368443718 368426437 368442879 368478928 368531570 368628006 368812752 369106865 369465714
1985 369465714 369770432 369866867 369640083 369083176 368319016 367558327 367010803 366796761 366905174 367217102
1995 367217102 367576103 367864990 368044052 368139076 368193893 368223648 368200302 368075600 367823906 367475166 367113876
2006 367113876 366844521 366742973 366818542 367009087 367207909 367309456 367252884 367041740 366736565 366424141
$$ packed form
1933C68820419J64681L97415N62439N34134K57187k12364p18689j068726j122551q59871
1943C66754074l88527J08986M63829N91927N15327L28751J38130O905n8785r1095j22108
1954C68247414j58234j76544j46485n6381P0954J83181K21062J48468k7237k52838
1964C68053360m46625n29785m58260k43682M9057L25088M97894N23491M17405K42729
1974C68430672P7896k1248m3602j7281J6442L6049N2642R6436J84746K94113L58849
1985C69465714L04718R6435k26784n56907p64160p60689n47524k14042J08413L11928
1995C67217102L59001K88887J79062R5024N4817K9755k3346j24702k51694l48740l61290
2006C67113876k69355j01548P5569J90545J98822J01547n6572k11144l05175l12424
$$ plain form
2016 366424141 366179314 366037674 365987778 365986252 365985413 365958366 365909424 365864449 365848351 365864372 365888443 365882721
2028 365882721 365820618 365707169 365580368 365490303 365467758 365501976 365541267 365519333 365393906 365172997 364915619
2039 364915619 364702454 364594040 364597397 364660912 364699097 364634743 364435272 364126320 363776321 363460464 363225441
2050 363225441 363070259 362953300 362821198 362642479 362429543 362235184 362123985 362132263 362238426 362360306
2060 362360306 362386055 362225914 361858902 361351509 360834236 360448494 360287399 360359650 360594177 360879135
2070 360879135 361113968 361248207 361289597 361283646 361279564 361302719 361346703 361383781 361385422 361339645 361257591 361168480
2082 361168480 361106644 361097260 361145134 361230621 361314545 361352158 361310616 361185379 361005440 360823402 360692711
2093 360692711 360642586 360663605 360711441 360729713 360678825 360555649 360393982 360244904 360149002 360115395 360120354
$$ packed form
2016C66424141k44827j41640m9896j526q39k7047m8942m4975j6098J6021K4071n722
2028C65882721o2103j13449j26801r0065k2545L4218L9291k1934j25427k20909k57378
2039C64915619k13165j08414L357O3515L8185o4354j99471l08952l49999l15857k35023
2050C63225441j55182j16959j32102j78719k12936j94359j11199Q278J06163J21880
2060C62360306K5749j60141l67012n07393n17273l85742j61095P2251K34527K84958
2070C60879135K34833J34239M1390n951m082K3155M3984L7078J641m5777q2054q9111
2082C61168480o1836r384M7874Q5487Q3924L7613m1542j25237j79939j82038j30691
2093C60692711n0125K1019M7836J8272n0888j23176j61667j49078r5902l3607M959
$$ plain form
2104 360120354 360123329 360092545 360023308 359940643 359885025 359889603 359962120 360080109 360199661 360275688 360280037 360214577
2116 360214577 360110283 360015335 359974709 360009079 360100327 360193787 360217056 360110931 359859734 359503899 359127159
2127 359127159 358822365 358651428 358621101 358687134 358783455 358859482 358902817 358936195 358992424 359085197 359194832
2138 359194832 359278069 359292870 359224701 359093819 358943634 358817177 358735886 358693466 358664360 358619652 358540955
2149 358540955 358425903 358286247 358142128 358016052 357927284 357886620 357890358 357919312 357942696 357929153 357859001
2160 357859001 357731133 357560463 357368011 357169914 356974068 356785545 356615944 356488533 356431847 356465225
2170 356465225 356583176 356751213 356916046 357026100 357051163 356991997 356875153 356740074 356625214 356559944
2180 356559944 356561470 356633224 356761436 356912117 357033615 357069969 356982346 356768341 356469383 356157799 355909729
$$ packed form
2104C60120354K975l0784o9237q2665n5618M578P2517J17989J19552P6027M349o5460
2116C60214577j04294r4948m0626L4370R1248R3460K3269j06125k51197l55835l76740
2127C59127159l04794j70937l0327O6033R6321P6027M3335L3378N6229R2773J09635
2138C59194832Q3237J4801o8169j30882j50185j26457q1291m2420k9106m4708p8697
2149C58540955j15052j39656j44119j26076q8768m0664L738K8954K3384j3543p0152
2160C57859001j27868j70670j92452j98097j95846j88523j69601j27411n6686L3378
2170C56465225J17951J68037J64833J10054K5063n9166j16844j35079j14860o5270
2180C56559944J526P1754J28212J50681J21498L6354q7623k14005k98958l11584k48070
$$ plain form
2191 355909729 355776024 355764961 355843887 355957947 356052895 356092339 356063843 355974159 355840607 355682526 355516396
2202 355516396 355351982 355191803 355033188 354872589 354711151 354558258 354428596 354334488 354277000 354242744
2212 354242744 354209404 354158897 354088516 354013901 353959618 353943100 353961601 353988724 353984604 353912086 353752327 353510704
2224 353510704 353212357 352891998 352582016 352306480 352079926 351910629 351804123 351764526 351793022 351883507
2234 351883507 352018967 352171478 352307472 352396431 352421265 352384644 352308006 352224121 352164268 352147560 352174072
2245 352174072 352225266 352270508 352277222 352222099 352099953 351927795 351741524 351584740 351492805 351478271 351525536
2256 351525536 351596909 351649933 351656723 351616592 351555176 351510773 351515236 351578865 351686440 351805458 351900520 351945992
2268 351945992 351931381 351857262 351727448 351544609 351312714 351046562 350781784 350575371 350492668 350584030 350862961
$$ packed form
2191C55909729j33705j1063P8926J14060R4948L9444k8496q9684j33552j58081j66130
2202C55516396j64414j60179j58615j60599j61438j52893j29662r4108n7488l4256
2212C54242744l3340n0507p0381p4615n4283j6518J8501K7123m120p2518j59759k41623
2224C53510704k98347l20359l09982k75536k26554j69297j06506l9597K8496R0485
2234C51883507J35460J52511J35994Q8959K4834l6621p6638q3885n9853j6708K6512
2245C52174072N1194M5242O714n5123j22146j72158j86271j56784r1935j4534M7265
2256C51525536P1373N3024O790m0131o1416m4403M463O3629J07575J19018R5062M5472
2268C51945992j4611p4119j29814j82839k31895k66152k64778k06413q2703R1362K78931
$$ plain form
2279 350862961 351296196 351814194 352335854 352795639 353157730 353414688 353573990 353646126 353642464 353582306 353499947
2290 353499947 353441772 353451729 353553734 353741379 353985672 354253693 354529991 354825897 355172729 355603638
2300 355603638 356131172 356730003 357329979 357822723 358083801 358013077 357582397 356876602 356101913 355546875
2310 355546875 355498123 356134911 357445221 359197273 360987587 362353401 362917519 362515259 361258202
2319 361258202 359504204 357732506 356365356 355605812 355367241 355335846 355140839 354547882 353570633 352439346
2329 352439346 351453514 350814285 350543709 350526962 350618706 350701523 350628090 350091209 348566666 345469971
2339 345469971 340536308 334247932 328023987 323953667 324085999 329560738 340001183 353497887
2347 353497887 367222672 378394279 385152245 386969986 384501801 379040031 371911354 364088516
$$ packed form
2279C50862961M33235N17998N21660M59785L62091K56958J59302P2136l662o0158q2359
2290C53499947n8175R957J02005J87645K44293K68021K76298K95906L46832M30909
2300C55603638N27534N98831N99976M92744K61078p0724m30680p05795p74689n55038
2310C55546875m8752O36788J310310J752052J790314J365814N64118m02260j257057
2319C61258202j753998j771698j367150p59544k38571l1395j95007n92957r77249j131287
2329C52439346r85832o39229k70576j6747R1744Q2817p3433n36881j524543l096695
2339C45469971m933663o288376o223945m070320J32332N474739J0440445J3496704
2347C53497887J3724785J1171607O757966J817741k468185n461770p128677p822838
$$ plain form
2355 364088516 356115379 348254166 340681953 333603973 327252884 321826782 317435131 314081879 311677399
2364 311677399 310055923 308995438 308255329 307640152 307067204 306598625 306403427 306662693 307467880 308775291
2374 308775291 310443153 312323570 314346771 316542492 318988686 321725807 324694633 327734108 330635071
2383 330635071 333213234 335359497 337050133 338323059 339244919 339886017 340309792 340571098 340715942
2392 340715942 340782242 340801086 340798988 340797653 340810699 340835991 340853653 340832214 340743637 340578041 340349159 340087128
2404 340087128 339824905 339587669 339391937 339249802 339172325 339164543 339216461 339297943 339367561 339391174 339359894
2415 339359894 339293823 339228325 339190750 339184113 339189301 339181023 339147873 339098167 339049911 339012299 338973656 338906364
2427 338906364 338785324 338609161 338406105 338222733 338100052 338052444 338060760 338082924 338074684 338008995 337884789
$$ packed form
2355C64088516p973137p861213p572213p077980o351089n426102m391651l353252k404480
2364C11677399j621476j060485p40109o15177n72948m68579j95198K59266Q05187J307411
2374C08775291J667862J880417K023201K195721K446194K737121K968826L039475K900963
2383C30635071K578163K146263J690636J272926R21860O41098M23775K61306J44844
2392C40715942O6300J8844k098j335J3046K5292J7662k1439q8577j65596k28882k62031
2404C40087128k62223k37236j95732j42135p7477p782N1918Q1482O9618K3613l1280
2415C39359894o6071o5498l7575o637N188q278l3150m9706m8256l7612l8643o7292
2427C38906364j21040j76163k03056j83372j22681m7608Q316K2164q240o5689j24206
$$ plain form
2438 337884789 337722969 337553520 337402458 337282677 337193069 337122040 337054634 336978111 336884804 336772842 336644249
2449 336644249 336503983 336358757 336217194 336088562 335981522 335901489 335849113 335820732 335810928 335814285 335825729
2460 335825729 335838203 335839996 335814018 335741882 335611382 335423889 335197067 334960060 334743118 334566383 334433517
2471 334433517 334331398 334238358 334133759 334007072 333861618 333712730 333581047 333483467 333425446 333397102 333376770
2482 333376770 333339920 333270683 333169060 333049927 332932625 332827072 332723770 332596283 332414436 332163773
2492 332163773 331858292 331539078 331258736 331058998 330953331 330924454 330935249 330947075 330935249 330892525 330824509
2503 330824509 330739326 330640717 330527115 330396042 330248566 330091133 329933624 329785690 329654121 329540825
2513 329540825 329442673 329351311 329254189 329137688 328992310 328818741 328630028 328448753 328298531 328195000
$$ packed form
2438C37884789j61820j69449j51062j19781q9608p1029o7406p6523r3307j11962j28593
2449C36644249j40266j45226j41563j28632j07040q0033n2376k8381r804L357J1444
2460C35825729J2474J793k5978p2136j30500j87493k26822k37007k16942j76735j32866
2471C34433517j02119r3040j04599j26687j45454j48888j31683r7580n8021k8344k0332
2482C33376770l6850o9237j01623j19133j17302j05553j03302j27487j81847k50663
2492C32163773l05481l19214k80342j99738j05667k8877J0795J1826j1826m2724o8016
2503C30824509q5183r8609j13602j31073j47476j57433j57509j47934j31569j13296
2513C29540825r8152r1362r7122j16501j45378j73569j88713j81275j50222j03531
$$ plain form
2523 328195000 328141136 328129120 328146515 328182068 328227043 328271065 328299408 328293877 328240128 328137169 328001060 327860031
2535 327860031 327740822 327655487 327596512 327543869 327479553 327399826 327317924 327254524 327222977 327218399 327219238 327198524
2547 327198524 327139130 327042580 326926842 326814690 326721115 326646156 326579170 326508408 326430588 326353188 326287727
2558 326287727 326238365 326194038 326128273 326011467 325826187 325579987 325307808 325060692 324888000 324817657 324846878
2569 324846878 324944267 325062675 325157280 325199242 325183372 325124931 325050659 324984818 324938812 324904480 324856567 324762344
2581 324762344 324596634 324354820 324057922 323745689 323461189 323232956 323065338 322942352 322841225 322748184
2591 322748184 322665863 322606392 322576981 322567596 322550354 322493019 322378159 322215996 322040405 321891212 321792488
2602 321792488 321739807 321704788 321651917 321558113 321420975 321253700 321070862 320877495 320667000 320431061 320170860
$$ packed form
2523C28195000n3864j2016J7395L5553M4975M4022K8343n531n3749j02959j36109j41029
2535C27860031j19209q5335n8975n2643o4316p9727q1902o3400l1547m578Q39k0714
2547C27198524n9394r6550j15738j12152r3575p4959o6986p0762p7820p7400o5461
2558C26287727m9362m4327o5765j16806j85280k46200k72179k47116j72692p0343K9221
2569C24846878R7389J18408R4605M1962j5870n8441p4272o5841m6006l4332m7913r4223
2581C24762344j65710k41814k96898l12233k84500k28233j67618j22986j01127r3041
2591C22748184q2321n9471k9411r385j7242n7335j14860j62163j75591j49193r8724
2602C21792488n2681l5019n2871r3804j37138j67275j82838j93367k10495k35939k60201
$$ plain form
2613 320170860 319902592 319652271 319443703 319288540 319184284 319121075 319091549 319095173 319134598 319205818 319291096
2624 319291096 319359436 319378262 319327526 319210548 319054146 318897781 318778362 318716755 318712635 318748188 318797646
2635 318797646 318837624 318853664 318842392 318808365 318759346 318701706 318638706 318570919 318499203 318427162 318361645 318310471
2647 318310471 318277130 318257008 318236275 318196049 318120079 318002892 317854080 317696056 317556229 317455940 317402744
2658 317402744 317387199 317386971 317375412 317331028 317244587 317121201 316978130 316838779 316726360 316657505 316638393
2669 316638393 316662788 316713104 316763515 316786156 316757545 316664486 316507320 316298923 316060600 315816517 315588665
2680 315588665 315393524 315240784 315131836 315059052 315005646 314948349 314863014 314733772 314559689 314357471 314155674
2691 314155674 313983688 313859196 313780918 313729610 313675556 313589954 313453083 313257656 313007107 312712059 312386932
$$ packed form
2613C20170860k68268k50321k08568j55163j04256o3209k9526L624L9425P1220Q5278
2624C19291096O8340J8826n0736j16978j56402j56365j19419o1607m120L5553M9458
2635C18797646L9978J6040j1272l4027m9019n7640o3000o7787p1716p2041o5517n1174
2647C18310471l3341k0122k0733m0226p5970j17187j48812j58024j39827j00289n3196
2658C17402744j5545k28j1559m4384q6441j23386j43071j39351j12419o8855j9112
2669C16638393K4395N0316N0411K2641k8611r3059j57166k08397k38323k44083k27852
2680C15588665j95141j52740j08948p2784n3406n7297q5335j29242j74083k02218k01797
2691C14155674j71986j24492p8278n1308n4054q5602j36871j95427k50549k95048l25127
$$ plain form
2702 312386932 312049198 311718731 311416435 311160984 310963268 310821705 310719681 310627842 310510979 310338192
2712 310338192 310093555 309783001 309433784 309085636 308776073 308524437 308323040 308139153 307927361 307648392
2722 307648392 307285213 306850033 306379890 305923519 305525551 305213566 304992809 304847298 304746475 304654617
2732 304654617 304540348 304385204 304188690 303968277 303754005 303577862 303461590 303406487 303390484 303374119
2742 303374119 303314209 303181381 302973289 302718391 302466278 302268524 302156925 302129688 302152214 302172642 302143974
2753 302143974 302042561 301872807 301657467 301420803 301174469 300915222 300633507 300326481 300006008 299695568
2763 299695568 299419270 299189930 299002686 298837376 298667660 298469143 298225822 297932472 297595654 297233410
2773 297233410 296871243 296534328 296235561 295966988 295701485 295407448 295069294 294703236 294352989 294067402
$$ packed form
2702C12386932l37734l30467l02296k55451j97716j41563j02024r1839j16863j72787
2712C10338192k44637l10554l49217l48148l09563k51636k01397j83887k11792k78969
2722C07648392l63179m35180m70143m56371l97968l11985k20757j45511j00823r1858
2732C04654617j14269j55144j96514k20413k14272j76143j16272n5103j6003j6365
2742C03374119n9910j32828k08092k54898k52113j97754j11599k7237K2526K0428k8668
2753C02143974j01413j69754k15340k36664k46334k59247k81715l07026l20473l10440
2763B99695568k76298k29340j87244j65310j69716j98517k43321k93350l36818l62244
2773B97233410l62167l36915k98767k68573k65503k94037l38154l66058l50247k85587
$$ plain form
2783 294067402 293869343 293735619 293603191 293398876 293077736 292647038 292160721 291689472 291283283 290950871
2793 290950871 290665169 290389709 290106144 289825878 289579506 289393902 289273338 289196110 289126873 289034061
2803 289034061 288899956 288719864 288493767 288220501 287900410 287542400 287169380 286813202 286501770 286245632
2813 286245632 286033115 285838852 285639935 285428810 285215988 285019989 284853210 284713345 284584503 284447880
2823 284447880 284291725 284115582 283925972 283727207 283516350 283283119 283015709 282706356 282353935 281960754
2833 281960754 281528606 281056557 280542450 279986267 279392128 278766422 278113441 277432003 276715393 275955429
2843 275955429 275148029 274297199 273414307 272515049 271615067 270727043 269860897 269024258 268222694 267457619
2853 267457619 266723499 266005688 265280495 264520092 263700008 262807903 261850986 260857430 259870281 258934441
$$ packed form
2783B94067402j98059j33724j32428k04315l21140m30698m86317m71249m06189l32412
2793B90950871k85702k75460k83565k80266k46372j85604j20564p7228o9237r2812
2803B89034061j34105j80092k26097k73266l20091l58010l73020l56178l11432k56138
2813B86245632k12517j94263j98917k11125k12822j95999j66779j39865j28842j36623
2823B84447880j56155j76143j89610j98765k10857k33231k67410l09353l52421l93181
2833B81960754m32148m72049n14107n56183n94139o25706o52981o81438p16610p59964
2843B75955429q07400q50830q82892q99258q99982q88024q66146q36639q01564p65075
2853B67457619p34120p17811p25193p60403q20084q92105r56917r93556r87149r35840
$$ plain form
2863 258934441 258079510 257307911 256592731 255889072 255153790 254364700 253528767 252675400 251839409 251044159
2873 251044159 250294647 249583588 248903999 248258591 247655888 247097073 246562424 246007786 245378551 244632473
2883 244632473 243759289 242784729 241755104 240713043 239677391 238638916 237573185 236459846 235297337
2892 235297337 234104214 232907944 231729984 230576820 229440193 228307877 227175579 226056099 224980679
2901 224980679 223991814 223130684 222421322 221856899 221393166 220953064 220443268 219779701 218911705 217836838
2911 217836838 216600628 215280781 213965302 212730942 211630363 210688686 209905491 209261646 208724308
2920 208724308 208254395 207812939 207368679 206902637 206409721 205895996 205374775 204862919 204379654 203946381
2930 203946381 203585339 203315010 203144035 203065681 203057957 203089867 203132458 203169937 203204556 203254185 203341751
$$ packed form
2863B58934441q54931p71599p15180p03659p35282p89090q35933q53367q35991p95250
2873B51044159p49512p11059o79589o45408o02703n58815n34649n54638o29235p46078
2883B44632473q73184r74560j029625j042061j035652j038475j065731j113339j162509
2892B35297337j193123j196270j177960j153164j136627j132316j132298j119480j075420
2901B24980679r88865q61130p09362n64423m63733m40102n09796o63567q67996j074867
2911B17836838j236210j319847j315479j234360j100579r41677p83195o43845n37338
2920B08724308m69913m41456m44260m66042m92916n13725n21221n11856m83265m33273
2930B03946381l61042k70329j70975p8354p724L1910M2591L7479L4619M9629Q7566
$$ plain form
2941 203341751 203481407 203667469 203870049 204039860 204121113 204068146 203860092 203510036 203063469 202587986
2951 202587986 202155895 201825600 201628704 201566620 201618919 201758785 201968288 202245274 202597980 203029346
2961 203029346 203520355 204022827 204467239 204783955 204926109 204881840 204668961 204314957 203835411 203224545
2971 203224545 202464561 201550865 200516911 199445953 198460617 197694302 197256832 197208538 197551270 198236790
2981 198236790 199186363 200312748 201537189 202798958 204056358 205283909 206467762 207603626 208698921
2990 208698921 209776249 210875149 212046909 213341084 214788189 216385536 218094711 219853611 221597328
2999 221597328 223278465 224876289 226391296 227828693 229181633 230423336 231512089 232407627 233090363
3008 233090363 233574429 233908024 234160328 234397373 234657078 234932423 235171661 235299263 235248127 234992199
$$ packed form
2941B03341751J39656J86062K02580J69811Q1253n2967k08054l50056m46567m75483
2951B02587986m32091l30295j96896o2084N2299J39866K09503K76986L52706M31366
2961B03029346M91009N02472M44412L16716J42154m4269k12879l54004m79546o10866
2971B03224545p59984r13696j033954j070958r85336p66315m37470m8294L42732O85520
2981A98236790R49573J126385J224441J261769J257400J227551J183853J135864J095295
2990B08698921J077328J098900J171760J294175J447105J597347J709175J758900J743717
2999B21597328J681137J597824J515007J437397J352940J241703J088753Q95538O82736
3008B33090363M84066L33595K52304K37045K59705K75345K39238J27602n1136k55928
$$ plain form
3018 234992199 234560814 234028244 233480911 232979069 232533016 232107086 231647568 231121368 230541248 229964848
3028 229964848 229468136 229108124 228894806 228786831 228711281 228595924 228397636 228112984 227769985 227405758
3038 227405758 227044010 226682339 226294155 225843353 225302334 224664650 223945751 223171482 222361584 221517162
3048 221517162 220620594 219648876 218594379 217480526 216361618 215305843 214366417 213556385 212840233
3057 212840233 212147369 211401768 210553303 209595509 208561764 207503223 206460838 205445938 204438400
3066 204438400 203402309 202308502 201151962 199953804 198747692 197559242 196388874 195210953 193986702
3075 193986702 192686768 191308651 189880085 188445549 187044067 185690823 184372940 183062191 181736622
3084 181736622 180397835 179073772 177805614 176626701 175545158 174541626 173580418 172628136 171668434
$$ packed form
3018B34992199m31385n32570n47333n01842m46053m25930m59518n26200n80120n76400
3028B29964848m96712l60012k13318j07975p5550j15357j98288k84652l42999l64227
3038B27405758l61748l61671l88184m50802n41019o37684p18899p74269q09898q44422
3048B21517162q96568r71718j054497j113853j118908j055775r39426q10032p16152
3057B12840233o92864p45601q48465r57794j033745j058541j042385j014900j007538
3066B04438400j036091j093807j156540j198158j206112j188450j170368j177921j224251
3075A93986702j299934j378117j428566j434536j401482j353244j317883j310749j325569
3084A81736622j338787j324063j268158j178913j081543j003532r61208r52282r59702
$$ plain form
3093 171668434 170705833 169758492 168846893 167985172 167179413 166430950 165740223 165107594 164530754 164002399
3103 164002399 163511314 163046665 162603130 162182274 161790009 161429939 161100235 160795555 160514679 160268822
3113 160268822 160084038 159995317 160033665 160212765 160523643 160940094 161432076 161980019 162581654 163247089
3123 163247089 163986797 164799252 165667400 166566315 167477627 168401585 169358501 170377064 171476631 172653408
3133 172653408 173878689 175110588 176312790 177468338 178583050 179675961 180764904 181854229 182931309
3142 182931309 183971500 184946938 185834579 186620865 187302799 187887402 188390369 188833389 189239521 189629345
3152 189629345 190017357 190411835 190815716 191227074 191636219 192021713 192348671 192573795 192658482 192584229
3162 192584229 192363625 192038746 191668148 191305981 190983505 190700932 190431099 190134468 189776363 189341831
$$ packed form
3093A71668434r62601r47341r11599q61721q05759p48463o90727o32629n76840n28355
3103A64002399m91085m64649m43535m20856l92265l60070l29704l04680k80876k45857
3113A60268822j84784q8721L8348J79100L10878M16451M91982N47943O01635O65435
3123A63247089P39708Q12455Q68148Q98915R11312R23958R56916J018563J099567J176777
3133A72653408J225281J231899J202202J155548J114712J092911J088943J089325J077080
3142A82931309J040191R75438Q87641P86286O81934N84603N02967M43020M06132L89824
3152A89629345L88012L94478M03881M11358M09145L85494L26958K25124Q4687p4253
3162A92584229k20604l24879l70598l62167l22476k82573k69833k96631l58105m34532
$$ plain form
3172 189341831 188841419 188306065 187774143 187273731 186810493 186364975 185903587 185395699 184829082 184213181
3182 184213181 183569374 182914410 182248554 181556759 180821342 180036697 179214973 178378010 177542381 176708622
3192 176708622 175863533 174993668 174099617 173199902 172320728 171478748 170669270 169867554 169041615 168167477
3202 168167477 167236843 166254883 165233192 164185543 163128967 162085514 161078167 160119381 159198351
3211 159198351 158277025 157302685 156231241 155049791 153784552 152488327 151216860 150006294 148864431
3220 148864431 147777052 146722164 145682459 144650526 143627625 142621603 141645575 140716619 139851198
3229 139851198 139057178 138326826 137637587 136962204 136284981 135613146 134975424 134407587 133934860 133561430
3239 133561430 133275042 133062429 132924147 132877731 132946100 133139715 133444824 133828363 134257259 134720964
$$ packed form
3172A89341831n00412n35354n31922n00412m63238m45518m61388n07888n66617o15901
3182A84213181o43807o54964o65856o91795p35417p84645q21724q36963q35629q33759
3192A76708622q45089q69865q94051q99715q79174q41980q09478q01716q25939q74138
3202A68167477r30634r81960j021691j047649j056576j043453j007347r58786r21030
3211A59198351r21326r74340j071444j181450j265239j296225j271467j210566j141863
3220A48864431j087379j054888j039705j031933j022901j006022r76028r28956q65421
3229A39851198p94020p30352o89239o75383o77223o71835o37722n67837m72727l73430
3239A33561430k86388k12613j38282m6416O8369J93615L05109L83539M28896M63705
$$ plain form
3249 134720964 135243511 135876026 136674404 137674427 138878250 140259008 141778803 143408794 145138083
3258 145138083 146969233 148904610 150934658 153036070 155181179 157350864 159541960 161763058 164022045
3267 164022045 166313648 168616085 170899696 173142643 175343342 177521935 179709034 181928864 184186344
3276 184186344 186465950 188741093 190988579 193197880 195368881 197501945 199585609 201593208 203492146
3285 203492146 205261726 206910324 208479996 210033131 211626034 213282623 214981537 216666069 218271313
3294 218271313 219755497 221118393 222396870 223640938 224883518 226120224 227310333 228396187 229332085
3303 229332085 230105991 230745850 231308022 231855030 232432175 233053017 233698978 234332447 234917412 235439587
3313 235439587 235914898 236381168 236875153 237407169 237947216 238434296 238806686 239037838 239157600 239243660
$$ packed form
3249A34720964N22547O32515P98378J000023J203823J380758J519795J629991J729289
3258A45138083J831150J935377K030048K101412K145109K169685K191096K221098K258987
3267A64022045K291603K302437K283611K242947K200699K178593K187099K219830K257480
3276A84186344K279606K275143K247486K209301K171001K133064K083664K007599J898938
3285B03492146J769580J648598J569672J553135J592903J656589J698914J684532J605244
3294B18271313J484184J362896J278477J244068J242580J236706J190109J085854R35898
3303B29332085P73906O39859N62172N47008N77145O20842O45961O33469N84965N22175
3313B35439587M75311M66270M93985N32016N40047M87080L72390K31152J19762Q6060
$$ plain form
3323 239243660 239385929 239642105 240008640 240424309 240803566 241080132 241238003 241312923 241367912 241458721
3333 241458721 241609325 241808376 242024670 242228603 242406235 242560196 242700424 242833118 242955036 243056202
3343 243056202 243126488 243161469 243164387 243143597 243109379 243071289 243037663 243015022 243007545 243014202 243027878 243035755 243023739
3356 243023739 242981625 242906895 242805347 242689228 242574196 242479057 242426605 242443790 242556286 242778645 243102856
3367 243102856 243493938 243898544 244264870 244565716 244810715 245039673 245298443 245609035 245951786 246270065
3377 246270065 246496773 246588860 246551380 246439056 246332970 246306000 246392536 246576366 246801853 246999016 247113552
3388 247113552 247125721 247053528 246941700 246842632 246799068 246834431 246951027 247134285 247358227 247591076 247802448
3399 247802448 247972775 248102303 248215961 248356400 248565903 248864555 249237194 249639130 250019169 250345516
$$ packed form
3323B39243660J42269K56176L66535M15669L79257K76566J57871P4920N4989R0809
3333B41458721J50604J99051K16294K03933J77632J53961J40228J32694J21918J01166
3343B43056202P0286L4981K918k0790l4218l8090l3626k2641p477O657J3676P877j2016
3356B43023739m2114p4730j01548j16119j15032r5139n2452J7185J12496K22359L24211
3367B43102856L91082M04606L66326L00846K44999K28958K58770L10592L42751L18279
3377B46270065K26708R2087l7480j12324j06086k6970Q6536J83830K25487J97163J14536
3388B47113552J2169p2193j11828r9068m3564L5363J16596J83258K23942K32849K11372
3399B47802448J70327J29528J13658J40439K09503K98652L72639M01936L80039L26347
$$ plain form
3409 250345516 250617809 250854721 251064644 251221008 251262550 251124592 250784702 250293236 249767208 249345016
3419 249345016 249127064 249135361 249313221 249563675 249800797 249983273 250116673 250227509 250333710 250430241
3429 250430241 250497761 250524845 250525169 250539951 250622158 250813007 251121120 251512184 251911125 252216606 252327614
3440 252327614 252177048 251764488 251172886 250555515 250090923 249919605 250090370 250543442 251139565 251722164
3450 251722164 252180023 252479858 252656898 252774162 252878475 252978859 253054142 253079090 253047886 252981052 252915344
3461 252915344 252887363 252922821 253034573 253224239 253482094 253784981 254098530 254390030 254646015 254881554
3471 254881554 255128956 255406551 255688210 255899010 255949554 255794353 255476990 255127125 254903622 254913483
3481 254913483 255158234 255541000 255930634 256238747 256460171 256652756 256880379 257164097 257480946 257804279
$$ packed form
3409B50345516K72293K36912K09923J56364M1542j37958l39890m91466n26028m22192
3419B49345016k17952Q297J77860K50454K37122J82476J33400J10836J06201R6531
3429B50430241O7520K7084L24J4782Q2207J90849L08113L91064L98941L05481J11008
3440B52327614j50566m12560n91602o17371m64592j71318J70765M53072N96123N82599
3450B51722164M57859K99835J77040J17264J04313J00384P5283K4948l1204o6834o5708
3461B52915344k7981L5458J11752J89666K57855L02887L13549K91500K55985K35539
3471B54881554K47402K77595K81659K10800N0544j55201l17363l49865k23503R861
3481B54913483K44751L82766L89634L08113K21424J92585K27623K83718L16849L23333
$$ plain form
3491 257804279 258146744 258560448 259085293 259681911 260206738 260464592 260316677 259778194 259036121 258366375
3501 258366375 257995892 257992210 258247604 258563728 258780022 258864384 258914890 259082756 259472771 260087242 260840244
3512 260840244 261620884 262354660 263021450 263625717 264147835 264517536 264631100 264401932 263813553 262945328
3522 262945328 261958675 261055546 260428276 260216579 260477276 261166668 262140942 263185062 264077473 264677105
3532 264677105 264996872 265214748 265594730 266339302 267442226 268634434 269474144 269556198 268736172 267238369
3542 267238369 265574398 264303570 263767109 263947811 264534760 265144253 265555592 265813980 266153297 266812096
3552 266812096 267884426 269306622 270964298 272804680 274832306 276966457 278870335 279920082 279412022
3561 279412022 276939259 272727776 267705040 263213100 260487423 260163879 262064476 265350208 268929176
$$ packed form
3491B57804279L42465M13704N24845N96618N24827K57854j47915n38483p42073o69746
3501B58366375l70483l682K55394L16124K16294Q4362N0506J67866L90015O14471P53002
3512B60840244P80640P33776O66790O04267N22118L69701J13564k29168n88379q68225
3522B62945328r86653r03129o27270k11697K60697O89392R74274J044120Q92411N99632
3532B64677105L19767K17876L79982P44572J102924J192208Q39710Q2054q20026j497803
3542B67238369j663971j270828n36461J80702N86949O09493M11339K58388L39317O58799
3552B66812096J072330J422196J657676J840382K027626K134151J903878J049747n08060
3561B79412022k472763m211483n022736m491940k725677l23544J900597L285732L578968
$$ plain form
3570 268929176 271894588 273794823 274670277 274918957 275101185 275754967 277231483 279546852 282287331
3579 282287331 284653854 285708218 284774094 281819077 277592163 273388386 270517464 269734497 270934925
3588 270934925 273273239 275623341 277114067 277454395 276918716 276073608 275459309 275408802 276050549 277398472
3598 277398472 279399128 281884460 284493961 286684475 287887020 287756214 286370201 284251900 282183971
3607 282183971 280904694 280826530 281887951 283572350 285072823 285558472 284495125 281945000 278717613
3616 278717613 276228046 276004848 278973484 284834976 291911125 297654476 299675865 296820583 289742203
3625 289742203 280654163 272375736 267164135 265913620 268060989 272128544 276522236 280158081 282697163
3634 282697163 284435596 286044331 288303757 291848717 296877365 302859325 308421669 311626167 310680828
$$ packed form
3570B68929176K965412J900235Q75454K48680J82228O53782J476516K315369K740479
3579B82287331K366523J054364r34124k955017m226914m203777k870922p82967J200428
3588B70934925K338314K350102J490726L40328n35679q45108o14299n0507O41747J347923
3598B77398472K000656K485332K609501K190514J202545j30806j386013k118301k067929
3607B82183971j279277p8164J061421J684399J500473M85649j063347k550125l227387
3616B78717613k489567k23198K968636N861492P076149N743351K021389k855282p078380
3625B89742203r088040q278427n211601j250515K147369M067555M393692L635845K539082
3634B82697163J738433J608735K259426L544960N028648N981960N562344L204498r45339
$$ plain form
3643 310680828 304830322 294950237 283435993 273331375 267088451 265592384 267954769 272142563
3651 272142563 276049671 278417282 279172726 279144135 279449463 280949192 283991299 288426476 293734512
3660 293734512 299141884 303739414 306676140 307437897 306081295 303237076 299801121 296450443 293281536
3669 293281536 289829521 285491104 280095234 274251537 269238071 266485500 266962357 270799999 277308216
3678 277308216 285279675 293341656 300177765 304623985 305773697 303199635 297235947 289114590 280760727
3687 280760727 274232235 271027241 271591339 275261726 280639420 286158943 290568638 293161259 293782539
3696 293782539 292754917 290806084 288969517 288349190 289711704 293041363 297325153 300793571 301613045
3705 301613045 298743248 292520924 284640312 277506313 273271561 273024540 276489964 282312908 288706703
$$ packed form
3643C10680828n850506r880085j1514244j0104618o242924j496067K362385M187794
3651B72142563L907108K367611P55444k8591L05328J499729L042107M435177N308036
3660B93734512N407372M597530K936726P61757j356602k844219l435955l350678l168907
3669B93281536l452015m338417n395870n843697n013466k752571M76857L837642O508217
3678B77308216P971459Q061981O836109M446220J149712k574062n963688q121357q353863
3687B80760727o528492l204994N64098L670387N377694N519523M409695K592621O21280
3696B93782539j027622j948833j836567o20327J362514L329659M283790L468418Q19474
3705C01613045k869797o222324p880612p133999m234752k47021L465424N822944O393795
$$ plain form
3714 288706703 294111767 297591591 298889523 298258362 296240005 293517685 290850182 289019356 288714294
3723 288714294 290334320 293766937 298248577 302421169 304647846 303555756 298648186 290728416 281872597
3732 281872597 274832115 272008743 274414368 281128330 289594517 296696720 300119324 299303150 295491371
3741 295491371 290854397 287207355 285065689 283570480 281283321 277314415 272062073 267101994 264309788
3750 264309788 264775829 268180141 272987747 277308559 279881954 280615234 280420399 280527706 281728973
3759 281728973 283976326 286494236 288253002 288490658 287024517 284269791 281046009 278305798 276877346
3768 276877346 277248516 279407730 282789879 286397038 289113941 290127125 289258652 287029629 284394608
3777 284394608 282277412 281159172 280946007 281171761 281386356 281475658 281714840 282546177 284250717 286742458
$$ packed form
3714B88706703N405064L479824J297932o31161k018357k722320k667503j830826l05062
3723B88714294J620026L432617M481640M172592K226677j092090m907570p919770q855819
3732B81872597p040482k823372K405625O713962Q466187P102203L422604q16174l811779
3741B95491371m636974l647042k141666j495209k287159l968906n252342m960079k792206
3750B64309788M66041L404312M807606M320812K573395P33280j94835J07307J201267
3759B81728973K247353K517910J758766K37656j466141k754726l223782k740211j428452
3768B76877346L71170K159214L382149L607159K716903J013184q68473k229023k635021
3777B84394608k117196j118240k13165K25754K14595Q9302K39182Q31337J704540K491741
$$ plain form
3787 286742458 289612217 292365913 294669857 296427059 297648582 298246651 297941055 296382236 293420792
3796 293420792 289327240 284778671 280589676 277351418 275220451 274003429 273473949 273683167 275020065
3805 275020065 277943878 282552929 288284206 293972874 298273849 300209293 299526997 296681976 292495232
3814 292495232 287741108 282923450 278339863 274310646 271337585 270023098 270777245 273515453 277580452
3823 277580452 281981030 285827713 288704319 290747623 292388477 293924122 295198498 295601273 294395409
3832 294395409 291178894 286201153 280343494 274777813 270511513 268088474 267605934 268989887 272286263
3841 272286263 277702770 285295753 294464798 303611832 310306416 312048798 307359257 296665478
3849 296665478 282475777 268641434 258970394 255802040 259196014 267090912 276315594 283937473
$$ packed form
3787B86742458K869759K753696K303944J757202J221523N98069l05596j558819k961444
3796B93420792m093552m548569m188995l238258k130967j217022n29480K09218J336898
3805B75020065K923813M609051N731277N688668M300975J935444o82296k845021m186744
3814B92495232m754124m817658m583587m029217k973061j314487P54147K738208M064999
3823B77580452M400578L846683K876606K043304J640854J535645J274376M02775j205864
3832B94395409l216515m977741n857659n565681m266300k423039m82540J383953L296376
3841B72286263N416507P592983R169045R147034O694584J742382m689541j0693779
3849B96665478j4189701j3834343r671040l168354L393974P894898R224682P621879
$$ plain form
3857 283937473 288317623 289443626 288502522 287016735 286021309 285662880 285337791 284210625 281797123
3866 281797123 278311749 274629917 271915493 271112537 272546043 275803051 279921646 283775215 286461830
3875 286461830 287539978 287050266 285377960 283066387 280670223 278668461 277399120 276986790 277284775
3884 277284775 277900791 278359318 278363667 278024902 277895718 278734264 281080112 284860001 289252701 292917309
3894 292917309 294495277 293148880 288888035 282554207 275503445 269157887 264615479 262439499 262647228
3903 262647228 264840336 268392086 272622795 276919136 280787907 283858128 285865593 286658916 286239834
3912 286239834 284812050 282784443 280683823 278988571 277960930 277575626 277597160 277763367 277954025
3921 277954025 278230801 278717823 279411926 280071239 280284386 279700813 278282547 276410141 274756775
$$ packed form
3857B83937473M380150J126003r41104j485787r95426l58429l25089j127166k413502
3866B81797123l485374l681832k714424q02956J433506L257008M118595L853569K686615
3875B86461830J078148m89712j672306k311573k396164k001762j269341m12330K97985
3884B77284775O16016M58527M349l38765j29184Q38546K345848L779889M392700L664608
3894B92917309J577968j346397m260845o333828p050762o345558m542408k175980K07729
3903B62647228K193108L551750M230709M296341L868771L070221K007465P93323m19082
3912B86239834j427784k027607k100620j695252j027641l85304K1534J66207J90658
3921B77954025K76776M87022O94103O59313K13147n83573j418266j872406j653366
$$ plain form
3930 274756775 273986778 274441032 275978603 278050976 279958477 281148243 281412354 280910492 280033836
3939 280033836 279194603 278642807 278386154 278236198 277946529 277371273 276559677 275739765 275199604 275134926
3949 275134926 275551434 276274071 277048759 277665234 278024769 278126602 278008041 277702904 277252464 276745472
3959 276745472 276329842 276159115 276298943 276664848 277050438 277239056 277123375 276748562 276253510 275764198
3969 275764198 275328999 274940987 274611549 274410896 274423695 274653645 274971371 275174656 275131130 274887333
3979 274887333 274637604 274560776 274654064 274717522 274522190 274028053 273445053 273045311 272857151 272526703
3989 272526703 271542492 269723854 267574196 266069317 265796051 265876637 263448105 254301987 234643517
3998 234643517 203174915 162346859
$$ packed form
3930B74756775p69997M54254J537571K072373J907501J189766K64111n01862q76656
3939B80033836q39233n51796k56653j49956k89669n75256q11596q19912n40161o4678
3949B75134926M16508P22637P74688O16475L59535J01833j18561l05137m50440n06992
3959B76745472m15630j70727J39828L65905L85590J88618j15681l74813m95052m89312
3969B75764198m35199l88012l29438k00653J2799K29950L17726K03285m3526k43797
3979B74887333k49729p6828R3288O3458j95332m94137n83000l99742j88160l30448
3989B72526703r84211j818638k149658j504879k73266Q0586k428532r146118j9658470
3998B34643517l1468602m0828056
$$ plain form
4000 162346859
$$ packed form
4000A62346859
##END=$$ End of the data block
