##TITLE=$$ Begin of the data block
##JCAMP-DX=5.00 $$ ACD/SpecManager v 10.08
##SPECTROMETER/DATA SYSTEM=16PC
##DATE=Mon Sep 16 14:37:32 2013
##DATA TYPE=INFRARED SPECTRUM
##DATA CLASS=XYDATA
##ORIGIN=
##OWNER=
##NPOINTS=3601
##FIRSTX=400.00000000
##LASTX=4000.00000000
##MAXX=4000.00000000
##MINX=400.00000000
##MAXY=41.35975647
##MINY=7.55467415
##XFACTOR=1.0000000000
##YFACTOR=0.000000100000000
##FIRSTY=41.35975647
##DELTAX=1.00000000
##XUNITS=1/CM
##YUNITS=TRANSMITTANCE
##XYDATA=(X++(Y..Y))
400D13597565l3760071l8036347j789779O265640l914604l438950M697304L582497
408C47203255r680291o593437J6981850J5991898q693467j5499801r900589j1577606
416C18231812k1619797j5991211O462097J7085571K4543534K2830467J0028610j85013
424C61386070j8815269j5523224J6021500K0158996K318154l560067n402794n445747
432C51137619k294273P07130P562866N599747q091660r202499l74794M648933J2542725
441C62235794J0350685m710655q552094m470596l369789l202667j255760M714737L019790
450C54759445q961906r057770J506577N460014P918625N687942m414825o465912k423515
459C44008675l78838K146225L327408M006119K638588j834870l633728l593445m152565
$$ y = [413597565, 379837494, 341801147, 340011368, 346277008, 342362404, 338923454, 343620758, 347203255, 337522964, 330929527, 347911377, 363903275, 355209808, 339710007, 329809418, 318231812, 296612015, 280620804, 287082901, 304168472, 328712006, 351542473, 361571083, 361386070, 342570801, 327047577, 343069077, 363228073, 365546227, 361986160, 356583366, 351137619, 348843346, 349550476, 357113342, 362713089, 354621429, 345418930, 345044136, 349693069, 362235794, 372586479, 367875824, 359323730, 354853134, 351483345, 348280678, 347024918, 351739655, 354759445, 345797539, 336739769, 338246346, 343706360, 351624985, 357312927, 352898102, 346432190, 344008675, 343629837, 345776062, 349103470, 353109589, 355748177, 353913307, 350279579, 346686134, 342533569]
468C42533569n606880m337311k83699K692223O753197P107734L462792J780281R04808
477C55006714n05448l841667k198906O211739P328758K190590P03812J540184J03225
486C66539001m024734m577179j702538j074066k510566j064759M301758M486580M96
495C60373993k100716m328041l694763J137733J824608j003723j524925p48863m57993
504C49477310J85700l88146l193130k606392J756439K734642J668930L56674l103256
513C46888771k907028K044449J551132m044991n913276o437531m913330J68343K063751
522C28500290K537689J271744l583183m314690q87146j157036n092144m966736j123905
531C11184883P9632o01769J69049L149490J969338m270306n606403k616425k954941
$$ y = [342533569, 336926689, 332589378, 332305679, 334997902, 341751099, 348858833, 352321625, 354101906, 355006714, 354501266, 350659599, 348460693, 354672432, 362001190, 364191780, 364895592, 366435776, 366539001, 362514267, 357937088, 356234550, 355160484, 352649918, 351585159, 355886917, 360373497, 360373993, 358273277, 353945236, 350250473, 351388206, 353212814, 352209091, 350684166, 349935303, 349477310, 349663010, 349274864, 346081734, 343475342, 345231781, 347966423, 349635353, 349992027, 346888771, 343981743, 346026192, 347577324, 343532333, 337619057, 331181526, 326268196, 326436539, 328500290, 331037979, 332309723, 328726540, 324411850, 323524704, 322367668, 317275524, 312308788, 311184883, 311264515, 310662746, 310831795, 313981285, 315950623, 311680317, 306073914, 303457489, 300502548]
540C00502548o641636n943546j792660J803150P706643Q473892M420032J726628k047539
549C08207512l319969k677212j357079K665520K527237k423286k717724R27200J907578
558C03739777J604328J094818m83265p58667K27222K66076m53473m80423j25160M00067
568C05031300J629123J637211M00791o1760l51905q2493Q55446J636753L083686K729912
578C16508064L74794p15503j620999j290817O08692J689663K989540K743492J17760
587C21404686K10762L334770L139992p4883j155624j028786j146049j303673q65936
596C22515259K81334J044273K037048J896592O3934J37062K317429K199897J11809
605C32604637q52585j812439j385917J211395J456490n0087j188965l562470k882957
$$ y = [300502548, 293860912, 287917366, 286124706, 287927856, 295634499, 304108391, 308528423, 310255051, 308207512, 304887543, 302210331, 300853252, 303518772, 306046009, 303622723, 300904999, 301832199, 303739777, 305344105, 306438923, 305955658, 305196991, 305424213, 305690289, 305236816, 304756393, 304631233, 305031300, 306660423, 308297634, 308698425, 308636665, 308284760, 308202267, 309057713, 310694466, 313778152, 316508064, 316882858, 316167355, 314546356, 313255539, 313864231, 315553894, 318543434, 321286926, 321404686, 321615448, 324950218, 328090210, 328015327, 326859703, 325830917, 324684868, 323381195, 322515259, 322796593, 323840866, 325877914, 327774506, 327838440, 327975502, 330292931, 332492828, 332604637, 331752052, 329939613, 328553696, 329765091, 331221581, 331171494, 329982529, 326420059, 323537102]
614C23537102J493721K703171J909027J320839r5635m12903k21519R12437M122010
623C35268250M440307K355576Q81920j221199k008667j490098j572608k067833j823883
632C32761765q13981k98004k36053M69932K164612K369423J346321N23567o25114j423378
642C36239090j843910k671738n019417l654022K501259L904343J980552N70755k146454
651C29860458k728958j559486n50270J514206J682052l357p64122j554985j338005
660C24557533N15709M52767l052025l46642J3043633R564171j2937546j8297425j3175010
669C00325165p097016P374039J0014534J874218j025200k592792l214836k548466j579762
678C01529884Q84056J056443q42591j907100k902508l675461m346123m590530l824234
$$ y = [323537102, 325030823, 327733994, 329643021, 330963860, 330868225, 330455322, 330233803, 331146240, 335268250, 339708557, 342064133, 342946053, 341724854, 339716187, 338226089, 336653481, 334585648, 332761765, 331947784, 331649780, 331413727, 331883659, 334048271, 336417694, 337764015, 338287582, 337662468, 336239090, 334395180, 331723442, 326704025, 323050003, 325551262, 329455605, 331436157, 332006912, 329860458, 327131500, 325572014, 325021744, 326535950, 328218002, 328214645, 327450523, 325895538, 324557533, 325073242, 325526009, 322473984, 322127342, 335170975, 344735146, 331797600, 313500175, 300325165, 293228149, 300602188, 310616722, 312490940, 311465740, 308872948, 305658112, 303109646, 301529884, 302413940, 303470383, 302627792, 300720692, 297818184, 294142723, 289796600, 285206070, 281381836]
687B81381836m711857o452560r587994j4605770j9017468k3821334k7514229l2708168
695A42962456l0458689k0443678j2896299l617049Q28028J73331K045393M574775P612229
704I0780497J1416912J5099287J9074917K2567987K7223825K7234555K2420654J9306412
712B55125046J6161690J3379554J1107445Q359451M936447K618313R58691l7441j17302
721C12491894k99931p9632m63237j721154j766204m44413m61807j570244k058487k246399
731C01380386k566795l030071l163586k572517l308792n825501o260414n112648m248371
740B65291691k548924k624759m736195n234718m516354m645824n418053n589027m937172
749B25040665n595436p825127q451004q108597p431030n681038n177269n940208n571595
$$ y = [281381836, 276669979, 270217419, 260629425, 246023655, 227006187, 203184853, 175670624, 142962456, 112503767, 92060089, 79163790, 75546741, 76374769, 76548100, 78593493, 83168268, 90780497, 102197409, 117296696, 136371613, 158939600, 186163425, 213397980, 235818634, 255125046, 271286736, 284666290, 295773735, 304133186, 309069633, 311687946, 312646637, 312609196, 312491894, 312191963, 312112331, 311649094, 309927940, 308161736, 307717323, 307255516, 305685272, 303626785, 301380386, 298813591, 295783520, 292619934, 290047417, 286738625, 280913124, 274652710, 269540062, 265291691, 262742767, 260118008, 255381813, 250147095, 245630741, 240984917, 235566864, 229977837, 225040665, 219445229, 211620102, 203169098, 195060501, 187629471, 181948433, 176771164, 170830956, 165259361]
758A65259361m914512k996693Q57830K970467L556957N430469Q817902R996891R374142
767A98352814R044647Q339882P835617P171402P212639Q162269Q340340Q179913P628917
776B70268440O316662N778065N934963N565167N045661M090062K189159J665115K404690
785C09257984K538433K699394K222291P93933L29495N06878O96430J056671J582604
794C21684113K925186K483368k0981q75473q48770n79834N40237P12395L5286r0370
804C25965157K13165L1929o34918q71888q75244p79113n27421k10495M30832M47236
814C23189240q8654n18570j120338j441727j847725j333733L90053J159668J771927
823C20160141J201630j022568j990795k718449k056122Q71659J410484P6294n43594
$$ y = [165259361, 160344849, 157348156, 158205986, 161176453, 164733410, 170163879, 178981781, 188978672, 198352814, 207397461, 215737343, 223572960, 230744362, 237957001, 246119270, 254459610, 262639523, 270268440, 276585102, 282363167, 288298130, 293863297, 298908958, 302999020, 305188179, 306853294, 309257984, 311796417, 314495811, 316718102, 317512035, 317841530, 318348408, 319044838, 320101509, 321684113, 324609299, 327092667, 327071686, 326196213, 325347443, 324767609, 325307846, 326020241, 326055527, 325965157, 326178322, 326210251, 325575333, 324703445, 323828201, 323049088, 322521667, 322311172, 322742004, 323189240, 323100586, 322582016, 321461678, 320019951, 318172226, 316838493, 317228546, 318388214, 320160141, 321361771, 320339203, 318348408, 315629959, 313573837, 314445496, 315855980, 315932274, 315388680]
832C15388680j174927j504898j629105j480350q94070n98431m21524l25680l18050
841C07041645m10328q72364o13689L37829J001854K037754J787663j16825n45750o5079
851C09582710M57535J608601J907348J614094J167069k8611l4828J353512J376858
860C19004288K16732r4414Q6308J53770L78857K82993j16100m10328r93004p00474
870C17808628R40075Q70476r00269j351356j053334p45773O0787J48068n45502n55744
880C14676056j26133K51770Q83350J036148R62506L84330j152515j554489j281967
889C14079056n89371J291027J542339M58222l19481j513233j878491j452942j332511
898C10284615j013527j417160k548218l469219m777661n023498m202595l784657l379592
$$ y = [315388680, 314213753, 312708855, 311079750, 309599400, 308705330, 308106899, 307685375, 307359695, 307041645, 306631317, 305758953, 305145264, 305483093, 306484947, 308522701, 310310364, 310193539, 309647789, 309582710, 310040245, 311648846, 313556194, 315170288, 316337357, 316308746, 316273918, 317627430, 319004288, 319221020, 319126606, 319212914, 319366684, 319745541, 320028534, 319912434, 319502106, 318509102, 317808628, 318748703, 319619179, 318718910, 317367554, 316314220, 315568447, 315629234, 315777302, 315231800, 314676056, 314549923, 314801693, 315685043, 316721191, 317683697, 318068027, 316915512, 315361023, 314079056, 313489685, 314780712, 316323051, 316781273, 316461792, 314948559, 313070068, 311617126, 310284615, 309271088, 307853928, 305305710, 301836491, 297058830, 292035332, 287832737, 284048080, 280668488]
907B80668488l078213l183117k394924p88441O35853K182007L630886N437355N998859
916B89108753N431423M870873L857612L094445K345085J851559J588115J412850J679668
925C15240383J112938o48251q85505L21159N71728L26633J42575j32084m47502j033783
935C14568291j020928l27816j50928k04315m35830j036644j297226j278419j447430
944C07368755j889476j798859j153946q49495m83971p71522j861572k442608k481938
953B93635368l423919n509873o333809n971203o528148p890206q411655q815060p856369
962B32895126n326500l305912j153240O44455K213478L535500M529247N536785O924172
971B46493111O885032N107422M645348N326500M782676L108025K292156K006531J574268
$$ y = [280668488, 277590275, 274407158, 272012234, 271223793, 271859646, 274041653, 277672539, 283109894, 289108753, 294540176, 299411049, 303268661, 306363106, 308708191, 310559750, 312147865, 313560715, 315240383, 316353321, 315705070, 314819565, 315140724, 315712452, 316039085, 316181660, 316049576, 315602074, 314568291, 313547363, 313219547, 313068619, 312864304, 312428474, 311391830, 310094604, 308816185, 307368755, 305479279, 303680420, 302526474, 301676979, 301193008, 300421486, 298559914, 296117306, 293635368, 290211449, 284701576, 278367767, 272396564, 265868416, 257978210, 249566555, 240751495, 232895126, 227568626, 224262714, 223109474, 223753929, 225967407, 229502907, 234032154, 239568939, 246493111, 253378143, 258485565, 263130913, 268457413, 273240089, 276348114, 278640270, 280646801, 282221069]
980B82221069R30329J010647K252330J968880J38283m65889l21140k93980M6730j57108
990B87330151j216641j032123L42845J021157J645088J529198N16662q2245n00679
999B89553413j119861k391339k130985j27544N90076O82583N36213l46432l65486M71344
1009B85351982N91774L11127o1760p97272j125088j050701j323471j915932k189159
1018B77791500k225876k336502k349605k640973l199825l693332m618893m321327l274918
1027B49130249j240501K599964M731884O070633O469001N573998M943848M235019L259907
1036B85774002J695385J021633J179924R23157N06878J54972l09219m06037j16577
1045B90424118R54R7503J27564J79043n4837o70204r76791j070748j260261j595993
$$ y = [282221069, 283151398, 284162045, 286414375, 288383255, 288521538, 288055649, 287734509, 287440529, 287487259, 287330151, 286113510, 285081387, 285424232, 286445389, 288090477, 289619675, 290136337, 290054092, 289553413, 288433552, 286042213, 283911228, 283783684, 284373760, 285056343, 285592556, 285246124, 284880638, 285351982, 285943756, 286254883, 286193123, 285395851, 284270763, 283220062, 281896591, 279980659, 277791500, 275565624, 273229122, 270879517, 268238544, 265038719, 261345387, 256726494, 252405167, 249130249, 247889748, 250489712, 255221596, 261292229, 267761230, 273335228, 278279076, 282514095, 285774002, 287469387, 288491020, 289670944, 290594101, 291100979, 291255951, 290946732, 290540695, 290424118, 290425072, 290522575, 290650139, 290829182, 290774345, 290104141, 289127350, 288056602, 286796341, 285200348]
1055B85200348j567116j158485r41983o12011q22315j849651j936188j129150r98268
1064B74185181j435051j305580p45278l48339R6073L36647L47863M82082N80540R24358
1074B73118496J762867J816978J065503Q69998R83468J029491J029720J273403J846066
1083B84795990K114544K290249K159843J854401J060257r10282r93977R46999J297245
1092B94615269O12507K84423q2016k99682o28720k16960J298179J613388R90391O85692
1102B98872471L54061J18484k6702j82877l28293m50134n64098o20594o91185n39551
1112B95941582r2736J19439J72615K91118L87669N83877J029740J002788N40028K15034
1122C00191154k39372l30925Q9417o8188q88348r45091l21159j12992J58539l27110
$$ y = [285200348, 283633232, 282474747, 281532764, 280920753, 280098438, 278248787, 276312599, 275183449, 274185181, 272750130, 271444550, 270699272, 270350933, 270447006, 270783653, 271131516, 271613598, 272194138, 273118496, 274881363, 276698341, 277763844, 278633842, 279617310, 280646801, 281676521, 282949924, 284795990, 286910534, 289200783, 291360626, 293215027, 294275284, 293365002, 292371025, 293318024, 294615269, 295227776, 295512199, 295430183, 295130501, 294501781, 294284821, 295583000, 297196388, 298186779, 298872471, 299226532, 299345016, 299318314, 299135437, 298807144, 298357010, 297792912, 297172318, 296481133, 295941582, 295848846, 295968285, 296140900, 296432018, 296819687, 297403564, 298433304, 299436092, 299976120, 300191154, 299951782, 299620857, 299710274, 299642086, 298753738, 297808647, 297487488, 297374496, 297533035, 297205925]
1132B97205925k115726k207280n97000l03993q48770j130562j322746j834641l047714
1141B83797493l029575j577378j435527k338162k604485k595195k551537k295742k299309
1150B63070583k763042k415886j255512n62191j31378M96158J337299J862278K179623
1159B61817932K382050K548446K269974J484642Q49247J2875k80609J5010l0765l29723
1169B70739079l06607p1525K39372R75380Q73318m77o50177j507035j844406j825561
1179B66621361j527558p30514k37942J31130M56334P48157Q82378R75151O82831k35558
1189B67765770m73747j76430p4387L6469O8207Q812o199q6079O8913N90076O51608
1200B68373013K90393J83831J62830K25067M73728M97361J80950L92208J221161J436481
$$ y = [297205925, 295090199, 292882919, 292285919, 291981926, 291133156, 290002594, 288679848, 286845207, 283797493, 280767918, 279190540, 277755013, 275416851, 272812366, 270217171, 267665634, 265369892, 263070583, 260307541, 257891655, 256636143, 256073952, 255942574, 256438732, 257776031, 259638309, 261817932, 264199982, 266748428, 269018402, 270503044, 271352291, 271365166, 271084557, 271099567, 271068802, 270739079, 270432472, 270360947, 270600319, 271575699, 272449017, 272448540, 271798363, 270291328, 268446922, 266621361, 265093803, 264363289, 264125347, 264256477, 264712811, 265460968, 266343346, 267318497, 268001328, 267765770, 267292023, 267115593, 267041206, 267077675, 267145882, 267154694, 267148495, 267062416, 267131329, 267721405, 268373013, 268663406, 268847237, 269010067, 269235134, 269708862, 270206223, 270387173, 270779381, 272000542, 273437023]
1210B73437023J268635J024246M01955K98042P36942P22180M16756J64489k82516k79656
1220B77908096K47002L54042K22206O8665j50452m79927j115570j231194q37078p19547
1230B74266243o08673q00858j466274j629829j394749j325607j352539j190434q43525
1239B63653755n81970j72863k77519j163235j101265p9880J23272l24497l17802l3856
1249B59724140J29223L10421L48568K83012J16806l16619l55950j7166J02272K11258
1259B60535965O8893n28564n27630j9779L04222P05948Q28972P49588N19294j88827
1269B62448082j22318P55787J042595J034984R47476M72068O22979J551170J635780
1278B70388603J107445O63052k54384j16596J278878J590728J296521Q26110k97775
$$ y = [273437023, 274705658, 275729904, 276131859, 276429901, 277166843, 277889023, 278305779, 278470268, 278187752, 277908096, 278155098, 278509140, 278731346, 278800011, 278649559, 278169632, 277054062, 275822868, 274985790, 274266243, 273657570, 272856712, 271390438, 269760609, 268365860, 267040253, 265687714, 264497280, 263653755, 263071785, 262898922, 262621403, 261458168, 260356903, 260277023, 260400295, 260075798, 259757996, 259724140, 259853363, 260163784, 260512352, 260795364, 260912170, 260595551, 260239601, 260222435, 260324707, 260535965, 260604858, 260076294, 259548664, 259528885, 259833107, 260539055, 261368027, 262117615, 262636909, 262448082, 262325764, 263081551, 264124146, 265159130, 266106606, 266578674, 267201653, 268752823, 270388603, 271496048, 272159100, 271904716, 271788120, 273066998, 274657726, 275954247, 276780357, 276482582]
1287B76482582n98183k72750q584O09150O05336p1526k42233k3594j30901m85421o89506
1298B75174370q25882r62486j156807j114369q34713o15577k86351k33173n86987m38938
1308B68119087L46680L17573o10847o50158l3855L82423J133194R36050n26676p04288
1318B68709183J28517N19256J072178Q22316n45502q08964j63326n0297k27680k25315
1328B69230366j89781p878M11988N90572N11417P16915J544247J102200o52790j656056
1338B71601200k876987k504845J45912N22156j060982j312961o56834o93569j337052
1347B61826038j333713q39462m85192J4305J47820j52588j03951J78814L70503N58624
1357B60181198P17621J387367M32244k785435l579388l023376j510144K673855L063927
$$ y = [276482582, 275884399, 275611649, 275603065, 276212215, 276817551, 276746025, 276503792, 276480198, 276349297, 275863876, 275174370, 274348488, 273386002, 272229195, 271114826, 270280113, 269664536, 269378185, 269145012, 268558025, 268119087, 268465767, 268783340, 268172493, 267522335, 267488480, 267870903, 269004097, 269940147, 269413471, 268709183, 268837700, 269356956, 270429134, 271251450, 270705948, 269896984, 269733658, 269683361, 269455681, 269230366, 269040585, 269032707, 269444695, 270035267, 270546684, 271263599, 272807846, 273910046, 273257256, 271601200, 268724213, 266219368, 266365280, 266887436, 265826454, 264513493, 263856659, 263163090, 261826038, 260492325, 259652863, 259167671, 259181976, 259329796, 259177208, 259073257, 259252071, 259622574, 260181198, 260898819, 262286186, 262718430, 259932995, 256353607, 253330231, 251820087, 254493942, 257557869]
1366B57557869o57311p56263K164592K780915K507210J007080l578663l477574J483441
1375B59031296K836456J936455J829147J739006J721630J492024K133598M671593L919601
1384B81310806k09808k183685m098168l102073J642951L929368O625175M462471n385857
1393B82991180o343135J375446K050629k784958l543148k383709k58446N576611N095233
1402B81775703k577533l917942q14667P61986L154983K962609o08693r84192J300564
1411B81052818J812935P23610J780281P129898M433632q156776j0910511p449150l020535
1420B67396202Q507023P852802o965885q740425N37624J624356k198220m817257r692421
1429B53503799r100914k613792L29971M350205M06494j5976906j7859936p334003k973309
$$ y = [257557869, 256900558, 256144295, 258308887, 261089802, 263597012, 264604092, 261025429, 257547855, 259031296, 261867752, 263804207, 265633354, 267372360, 269093990, 270586014, 272719612, 277391205, 281310806, 281100998, 278917313, 274819145, 271717072, 273360023, 277289391, 283914566, 288377037, 282991180, 276648045, 278023491, 280074120, 277289162, 273746014, 271362305, 271103859, 276680470, 281775703, 279198170, 275280228, 274465561, 275227547, 278382530, 281345139, 280736446, 279752254, 281052818, 282865753, 283589363, 285369644, 292499542, 296933174, 288776398, 277865887, 270416737, 267396202, 275903225, 283756027, 276790142, 268049717, 268587341, 270211697, 268013477, 263196220, 253503799, 244402885, 241789093, 242119064, 246469269, 246875763, 230898857, 213038921, 205704918, 202731609]
1438B02731609O47793L99819n440712o850472n011558n221615o214390p760754j1410474
1447A55869246j1195660o648779n608082r494304m788399J0430574J4957428J0376692
1455A53898716J1554470J6611824J8197537J7525920J7087937J8293381J3010025k082825
1463B64096985n572815J55945L226986P585277R327431J1365166N951881j2098312
1471B84038544j4295349j793366J533012k18849M36783K385140K599468J836529R3460
1480B76615372m377823m582901L50246o3419m426231p843743j0777244j6277066k8243065
1489B00374126k8026828j6757956q566856Q18729Q439779J5730858J9912720K1915684
1497B13840256K0797233J3930817J2765160J6283512J7102947K2103310J1145134k4862538
$$ y = [202731609, 203379402, 203779221, 198338509, 191488037, 186476479, 181254864, 175040474, 167279720, 155869246, 144673586, 138024807, 132416725, 122922421, 118134022, 128564596, 143522024, 153898716, 165453186, 182065010, 200262547, 217788467, 234876404, 253169785, 266179810, 264096985, 258524170, 258680115, 261907101, 269492378, 278819809, 290184975, 296136856, 284038544, 269743195, 267949829, 269482841, 269263992, 269700775, 272085915, 274685383, 276521912, 276615372, 272237549, 267654648, 268004894, 267941475, 263515244, 255671501, 244894257, 228617191, 200374126, 172347298, 155589342, 147022486, 147841215, 156280994, 172011852, 191924572, 213840256, 234637489, 248568306, 261333466, 277616978, 294719925, 316823235, 327968369, 303105831]
1505C03105831k9419651o228447L017178R711971R969254p49360m06494J2563210R857673
1514C11421165j1318931j1484623R359837J1734733J273155n080719j6557445j3180485
1522B76166687J0745277J2462140p003785r001732J657239N563983Q386612O861439
1530C05837860l59287m624119j2456188o416073K0286789K3048172P565231m348488
1538C28533897k6233444k5744667O20117O505242k746086k153168N262852O606102
1546B90650845L810176K036801j425266q94070M915237N180607k058983J862030K5117646
1555C29195023J6343116l1454563l8939953j6131401k293110J9280911K1029472p59849
1563B96269646l679276Q573780Q379231k70138n726337j5458336j1238346J1729240
$$ y = [303105831, 273686180, 267457733, 270474911, 280186882, 290156136, 289406776, 289000282, 301563492, 311421165, 300102234, 288617611, 297977448, 309712181, 310985336, 305904617, 289347172, 276166687, 286911964, 299374104, 292370319, 283368587, 285025826, 290589809, 298976421, 305837860, 305478573, 300854454, 288398266, 281982193, 302268982, 325317154, 332882385, 328533897, 302300453, 276555786, 277175903, 283681145, 280935059, 278781891, 284044743, 290650845, 294461021, 296497822, 295072556, 294178486, 299093723, 304274330, 302215347, 304077377, 329195023, 345538139, 314083576, 275143623, 259012222, 256719112, 276000023, 297029495, 296269646, 292590370, 301164150, 309543381, 309273243, 303546906, 288088570, 276850224, 288579464]
1571B88579464J6032467Q403778o77357k2589435k2299061K254238P792721R14325
1579B78411140j496315m880409m360695P51038K822380L565330L761292L040066K097606
1588B83711433K92778n07125j6442j248588m319687n753975o159554o581306o715298
1597B52702236o734600p134933n762101l099193O31084P158528R785652R717464Q828640
1606B66092777N761624M071006K357235K660752N311718O946811J2074223O024609
1614C11300755j7382145j8756638k02637P303696J3306389J0605335n343189r164353
1622B91667213m967918j690636O353150N356788p388839p240753M259338Q633385J1529922
1631C06511650Q829575k42462q470307k4711113k0752678Q374214J4577866K578011
$$ y = [288579464, 304611931, 313015709, 312338352, 289748917, 267449856, 269704094, 277496815, 278411140, 276914825, 272034416, 267673721, 268424759, 271247139, 274812469, 278573761, 281613827, 283711433, 284004211, 283497086, 283480644, 282232056, 277912369, 272158394, 265998840, 259417534, 252702236, 245967636, 238832703, 233070602, 229971409, 230602493, 237761021, 247546673, 257264137, 266092777, 271854401, 275925407, 278282642, 280943394, 286255112, 293201923, 305276146, 311300755, 293918610, 275161972, 274959335, 282263031, 295569420, 306174755, 300831566, 291667213, 286699295, 285008659, 291361809, 296718597, 289329758, 282089005, 286348343, 294981728, 306511650, 315341225, 315098763, 306628456, 281917343, 261164665, 269538879, 284116745, 286694756]
1639B86694756J584053O853828Q145103J0550251L940831j8415222j9463768k855301
1647B77034531Q956413L2604942K4009476k5957356l6707630k0700702q690129J4300843
1655B64850388J9116630O137619K998104O141415K156982j1311760j1429786R74159
1663B79633751O377468J1513233Q968125l861924r150962j3675232q157959J5641689
1671B87288189J5480995r317398j3801823n055885L01113R147167J0588417L154259
1679B97785034L618241J7006874O437568l9441375l8341752J0972023K1266938M530906
1687B83834457M3869l032207o26087J1771431J2049923K017498l448258j1756401q151054
1696B82703171J6253223J1158467l0583859l0084362J1909714J9495239L015289k999782
$$ y = [286694756, 288278809, 295132637, 303277740, 313827991, 317768822, 299353600, 279889832, 277034531, 285990944, 318595886, 342605362, 316648006, 279940376, 259239674, 250549545, 264850388, 283967018, 290104637, 293102741, 299244156, 301401138, 290089378, 278659592, 279633751, 286011219, 297524452, 306492577, 302630653, 293479691, 279804459, 271646500, 287288189, 302769184, 293451786, 279649963, 274594078, 274895191, 284042358, 294630775, 297785034, 301403275, 318410149, 324847717, 285406342, 247064590, 258036613, 279303551, 283834457, 283878326, 280846119, 280220032, 291991463, 304041386, 306058884, 302610626, 290854225, 282703171, 298956394, 310114861, 279531002, 249446640, 261356354, 280851593, 283866882, 280867100]
1704B80867100q760700p957917J963845M472255J749039J598110K826233K401352J964569
1713B81123886k016563j1174431j5450001j9664059j4595260N013237Q909683p8201
1721B32068291l011704n123367m421711O92367J830578n82466J41640L557205M756680
1730B29907513Q100757J050701k6033401k2055874J7128944K3840676N588760J3352
1738B37541428k284050j351815O042710P014999J946907K194653P816066P220040J115322
1747B67256260j741886m218579l602981L55244L940582J1274338R584903m091015n132217
1756B73624649N555401O972790K689838n74112p838001n745888Q510590J0340442J382828
1765B94918537l28312K510567K649536L171692j005669j4579525j3679981K453327
$$ y = [280867100, 272106400, 264148483, 266112328, 270584583, 272333622, 273931732, 276757965, 279159317, 281123886, 279107323, 267932892, 252482891, 232818832, 218223572, 223236809, 232146492, 232068291, 229056587, 223933220, 219511509, 220203876, 222034454, 221451988, 221593628, 225150833, 229907513, 238008270, 239058971, 213025570, 190969696, 208098640, 231939316, 237528076, 237541428, 235257378, 233905563, 239948273, 246963272, 248910179, 251104832, 258920898, 266140938, 267256260, 265514374, 261295795, 257692814, 258048058, 261988640, 273262978, 282847881, 278756866, 273624649, 279180050, 286152840, 288842678, 288268566, 280430565, 274684677, 283195267, 293535709, 294918537, 294590225, 297100792, 299750328, 302922020, 301916351, 287336826, 273656845, 276110172]
1773B76110172O908894L927002L456821L861428J736164n111218m507065N145073N282879
1782B96810150l746033m771957l04680K525082P327080O793270J535644l587951j4141579
1791B88439026j2729874K612114O628266L152618K104034J342316m90189m567871m836807
1800B81653633j459350J59740J574516J971722J074562Q03452J191139J84307k971897
1809B84181824l206711r31988M26998K434273K258759p02858j209488k9087O65664
1818B83887386J397381K244949M669190K747993o004562n722771M292984N377770m9362
1827B92840958l003121p906437o053219M883061O888142J731872L46432N49316J37329
1836B90414333j383075J62124O498108O549359J816997k629051j1935711j0586262
$$ y = [276110172, 283019066, 286946068, 290402889, 294264317, 296000481, 290889263, 286382198, 291527271, 296810150, 293064117, 288292160, 287987480, 290512562, 297839642, 304632912, 306168556, 302580605, 288439026, 275709152, 278321266, 284949532, 288102150, 290206184, 291548500, 291058311, 286490440, 281653633, 280194283, 280354023, 281928539, 283900261, 284974823, 285778275, 286969414, 287153721, 284181824, 280975113, 280043125, 280470123, 282904396, 285163155, 284460297, 283250809, 283221722, 283887386, 285284767, 287529716, 292198906, 294946899, 288942337, 283219566, 287512550, 292890320, 292840958, 289837837, 281931400, 275878181, 280761242, 287649384, 289381256, 289727688, 290277004, 290414333, 289031258, 289193382, 295691490, 302240849, 304057846, 301428795, 289493084, 278906822]
1844B78906822L642082O337891r3956q64735J897107J913528r9411p29332o77109n51452
1854B89681435J5735J60923J06354j76926j056900j033306m52518N70526L046989L044129
1864B93906441J529941j435985q775254q863201j857757J247654L631344L571510m292
1873B82950401j087188p99656o63510j07307J03493L6697J82877O93092M70867j138210
1883B80641556m22001L711700L181210k282848l522873k333641o94027L698349L610363
1892B85587788j458645k275944Q1539O88553N10445O09646Q04424P56740M39396K96593
1902B86040535J52130K66075R45091P00455n74341r67025j052132m44412J270294K046585
1912B88383255K767792J944771r70593k297401l565083k339821L271103L259659k526779
$$ y = [278906822, 282548904, 288886795, 288792839, 287928104, 289825211, 291738739, 291639328, 290909996, 290232887, 289681435, 289697170, 289858093, 289964447, 289787521, 288730621, 287697315, 287244797, 287815323, 290862312, 293906441, 295436382, 294000397, 285225143, 276361942, 274504185, 275751839, 279383183, 282954693, 282950401, 281863213, 281063557, 280400047, 280292740, 280396233, 280432930, 280615807, 281308899, 281779766, 280641556, 280219555, 283931255, 287112465, 284829617, 281306744, 278973103, 278279076, 281977425, 285587788, 284129143, 281853199, 281934738, 282623291, 283133736, 283743382, 284547806, 285304546, 285743942, 286040535, 286192665, 286458740, 287403831, 288104286, 287529945, 286562920, 285510788, 285066376, 286336670, 288383255, 291151047, 293095818, 292125225, 289827824, 286262741, 283922920, 287194023, 290453682, 287926903]
1921B87926903l473034j045227L567J178989J210690j89305n99384m37737m55856m79221
1931B83640385m57287l21388l99590j008758n55993J363755J534958P32173r28401
1940B83599854n335808n050888M53453J629123l93867n90572K29129K76318m17709
1949B74399033j90010J225471J101723p53403q46367O75907R05991K09808L0766M0760
1959B76799679J05610L10669M46796P86781M48475q84304j067161m28906K00024J502285
1969B78219948J577835L20206N2452M80423M56085J27792M8866J47591J55678J13983
1979B81700859J26839J77841K25563L40214K78473r6073M768P90825O34670m20818
1989B83763161r20296j572113j001358J375198J849404Q65459L55015l32604n27858
$$ y = [287926903, 284453869, 283408642, 283412209, 284591198, 285801888, 285612583, 285013199, 284575462, 284119606, 283640385, 283183098, 282861710, 282462120, 281453362, 280897369, 282261124, 283796082, 284528255, 283599854, 278264046, 273213158, 273666611, 275295734, 274901867, 274311295, 274540424, 274816742, 274399033, 274209023, 275434494, 276536217, 275782814, 274936447, 275612354, 276518345, 276728153, 276758919, 276799679, 276905289, 277215958, 277662754, 278449535, 278898010, 278013706, 276946545, 276517639, 276717663, 278219948, 279797783, 280117989, 280170441, 280650864, 281106949, 281234741, 281283607, 281431198, 281586876, 281700859, 281827698, 282005539, 282231102, 282571316, 282849789, 282753716, 282758484, 283549309, 284183979, 283763161, 282842865, 281270752, 280269394, 281644592, 283493996, 284359455, 284714470, 284381866, 283854008]
1998B83854008k17915j25885o3896o0082k89440k4547R72500J022338J76430r2506
2008B85151005p153j49498n65033m90684K94933J43051j138210j132736Q7280L92189
2018B82585144J16119N1251k861l7193p7725k9564J97182J47819k26974k75154p9613
2029B82368431L8147K67983J69029m29630m05064K05994M27246N60035L75271l34740
2039B83242702n12123k62966k22702l21140k03133J88580K69661J58310l5286n34535
2049B81767368n58147j74980J05858N92460N61943q9397k26727P0572j5507n51223
2059B81482220m56810L89347M21028k92530m64440l29971k35309l5534L2901m6005
2069B80464897K5749K96097K71797q7490j28498J22776J15395j04199j72615Tj38283
$$ y = [283854008, 283636093, 283510208, 283446312, 283386230, 283096790, 283072243, 284044743, 285067081, 285243511, 285151005, 285143852, 284994354, 284429321, 283938637, 284233570, 284376621, 283238411, 282105675, 282192955, 282585144, 282701263, 282752514, 282749653, 282712460, 282634735, 282605171, 282802353, 282950172, 282723198, 282448044, 282368431, 282406578, 282674561, 282843590, 282413960, 282008896, 282214890, 282642136, 283202171, 283577442, 283242702, 282730579, 282467613, 282244911, 281923771, 281720638, 281909218, 282178879, 282337189, 282301903, 281767368, 281209221, 281034241, 281140099, 281732559, 282294502, 282205105, 281978378, 282048950, 282033443, 281482220, 281025410, 281414757, 281835785, 281543255, 281078815, 280748844, 280513535, 280478001, 280510902, 280464897, 280490646, 280786743, 281058540, 280971050, 280842552, 280965328, 281080723, 280976524, 280803909, 280631294, 280493011]
2080B80493011J0033j2169k66304k22206J14193K34852L58086J16348p38373q50201
2090B79237270l60965o0807L79563M32262M5071m8638k403O2485L13759J99070l67165
2101B79829502m93526l16620j84288O7463J28040m0779K4319L58333L57399J08490
2111B79838333j35193o15597o20136j17531N1270J10378K156m56353m77066j22547
2121B77457714O8417L31649K62738k61059l46909q8215n016R079M5281Q2740J11580
2132B77667999J58310J25656J1673q0585k64168j90487J98364L20435L56903J64261
2142B78468361m15802o06537n87921m18911J38531J88579k92072l14217K9316J19915
2152B76309242J24932r041m39892m83990k32696o199M29153M56810K6455m4575K30084
$$ y = [280493011, 280503044, 280490875, 280224571, 280002365, 280116558, 280351410, 280709496, 280825844, 280087471, 279237270, 278876305, 278815498, 279195061, 279627323, 279672394, 279623756, 279621353, 279683838, 279997597, 280196667, 279829502, 279335976, 279019356, 278835068, 278902531, 279030571, 278989792, 279014111, 279372444, 279729843, 279838333, 279703140, 279087543, 278467407, 278349876, 278401146, 278511524, 278513680, 278057327, 277580261, 277457714, 277526131, 277857780, 278120518, 277859459, 277512550, 277424335, 277419319, 277428398, 277473679, 277556419, 277667999, 277826309, 277951965, 277963638, 277883053, 277618885, 277428398, 277626762, 277947197, 278304100, 278468361, 278052559, 277446022, 276858101, 276439190, 276577721, 276766300, 276474228, 276160011, 276189327, 276309242, 276434174, 276425133, 275985241, 275501251, 275268555, 275262356, 275691509, 276148319, 276174774, 276130199, 276360283]
2163B76360283Q5106o09875n70049K76565L55473j98116l51201m15554j77154P24068
2173B75479546O31103n10445q28514o68048n21908j95256K4090L41873K19593n55744
2183B73416290n96294K1686K12918J92165J83582Q2493Q2741K03590J72615k7408n6019
2194B73888359O2218Q1787O2446Q126j27793j63803j09443j08719j02272j84536m66824
2205B72839546m11262M7912J07994j11808k86580o66618n76725R4872K22931k9335
2215B71230927j90735m32721n42163n13554n81989p31221p91549n73635j006604k030124
2225B63836632k956391l984222n006790o233940o934872p501850p096748n740662m189243
2234B14191914k039204j49002J858482L330937M408588N182266N591889N783539N778808
$$ y = [276360283, 276445389, 275835514, 275265465, 275542030, 275897503, 275699387, 275348186, 274932632, 274755478, 275479546, 276110649, 275600204, 274771690, 274103642, 273581734, 273386478, 273410568, 273752441, 273972034, 273416290, 272819996, 272841682, 273054600, 273246765, 273430347, 273512840, 273595581, 273799171, 273971786, 273944378, 273888359, 273950577, 274032364, 274094810, 274102936, 273975143, 273811340, 273701897, 273593178, 273490906, 273306370, 272839546, 272428284, 272476196, 272584190, 272472382, 272185802, 271519184, 270942459, 271037331, 271260262, 271230927, 271040192, 270607471, 270065308, 269551754, 268969765, 268238544, 267446995, 266873360, 265866756, 263836632, 260880241, 256896019, 251889229, 245655289, 238720417, 231218567, 224121819, 218381157, 214191914, 212152710, 212003708, 213862190, 217193127, 221601715, 226783981, 232375870, 238159409, 243938217]
2243B43938217N345345M422416L483544K145042J467705J366844J119862Q64277P69119
2252B64922371R25789P98454M91142J20888o01540o39190L4332K76566L07083L89576
2262B67025471M60624N07355O12736M56085k9564k56042m18434l27835J83830K53906
2272B68468132m2667j43052j63326k04315l38554j77384K64168O56128J326790J290817
2282B70936737N18551J12781k79922l49751k861P5093k136o905N8880k6455l91503
2293B70642509l02066L37352M08421K48j27564l21617M3373J250267J539956J168727
2303B74639606Q69751L88394O676k81582p35531j689186j548291m59671N67685K211322
2313B73969173K768517K535820K029419R37214j0719j290093j731148j567611j035691
$$ y = [243938217, 249283562, 253705978, 257189522, 259334564, 260802269, 262169113, 263288975, 264153252, 264922371, 265848160, 266646614, 267137756, 267258644, 266657104, 266017914, 266052246, 266328812, 266635895, 267025471, 267486095, 267993450, 268606186, 269062271, 269032707, 268776665, 268358231, 268030396, 268214226, 268468132, 268425465, 268282413, 268119087, 267914772, 267576218, 267398834, 267663002, 268319130, 269645920, 270936737, 271455288, 271568069, 271288147, 270938396, 270935535, 271010628, 271008492, 271001587, 271060467, 271034012, 270642509, 270340443, 270677795, 271086216, 271086464, 270958900, 270637283, 270680656, 271930923, 273470879, 274639606, 275509357, 275897751, 275904427, 275622845, 274887314, 273198128, 271649837, 271190166, 271757851, 273969173, 276737690, 279273510, 281302929, 282240143, 282229424, 280939331, 279208183, 277640572, 276604881]
2322B76604881N16186P16457m43706n57652O47297l27816m532814m270324L93867K022266
2332B70768642K411137J811981q49266j528244l52402q57105k340565m077186o503830
2341B58483162q599987j3861656r328842O308078J4847031K3238182K1882305Q321057
2349C01289330J985549j874694l690949j350174k873421q390903r362698p292976m707584
2358B63731480J240730J686573l139267n296707p863274o472111P46480J944313j843224
2367B44734993k910118l213883k633094n46227M36058Q27789J183053J234054J495113
2376B40607738J997242K099743J748085J799832K102852K408256L140927K848873J383781
2385B60137329P88689P34081M92344J51138Q4877L75996L19958k6474j86425l36895
$$ y = [276604881, 277121067, 277837524, 277393818, 276836166, 277483463, 277155647, 272622833, 268352509, 268746376, 270768642, 273179779, 274991760, 274142494, 272614250, 272261848, 271404743, 269064178, 264986992, 258483162, 249883175, 236021519, 226692677, 233000755, 247847786, 271085968, 292968273, 301289330, 303274879, 301400185, 297709236, 296359062, 293485641, 285094738, 275732040, 268439064, 263731480, 264972210, 266658783, 263519516, 258222809, 250359535, 243887424, 244633904, 246578217, 244734993, 241824875, 238610992, 235977898, 235431671, 235867729, 236695518, 237878571, 239112625, 240607738, 242604980, 244704723, 246452808, 248252640, 250355492, 252763748, 255904675, 258753548, 260137329, 260926018, 261660099, 262152443, 262303581, 262388458, 262764454, 263084412, 263057938, 262871513, 262534618]
2395B62534618k49862J89304K91100J34010R1782J23977J7643k49386l76224n02587
2405B62004375l71933J58310K60830j0719m7226O4850O2714l9101l7422Q5830N1957
2416B62182465r4643k54631o27518n15461K50817K93026m43955l62148M97570O99043
2426B61624565N71251K31991o61602q55942n47161k05517N48592O63528K50588q5373
2436B61534920o87828p90596m60625j99089K34604L77655K73952K09561Q1558J4057
2446B60588169j3103m6502o675j65711p03811o30379R3708L19233L39508J28994o19888
2457B59283543o53515k0733K18143L18776L18279J39732N1003K3613r9182l56446m35333
2468B58787880m06513l03746J5030J2398l89824l44753J64032K23160r0351j71662
$$ y = [262534618, 262284756, 262474060, 262765160, 262899170, 262990952, 263114929, 263132572, 262883186, 262506962, 262004375, 261632442, 261790752, 262051582, 262040863, 261993637, 262058487, 262121201, 262082100, 262044678, 262130508, 262182465, 262087822, 261833191, 261205673, 260690212, 260941029, 261234055, 260790100, 260427952, 260925522, 261624565, 262195816, 262427807, 261766205, 260910263, 260363102, 260157585, 260706177, 261369705, 261620293, 261534920, 260847092, 260056496, 259595871, 259396782, 259631386, 260009041, 260282993, 260492554, 260574112, 260588169, 260575066, 260528564, 260521889, 260356178, 259652367, 259021988, 259115696, 259434929, 259774437, 259903431, 259283543, 258630028, 258609295, 258827438, 259146214, 259464493, 259604225, 259655228, 259678841, 259579659, 259223213, 258787880, 258381367, 258077621, 258092651, 258105049, 257715225, 257370472, 257534504, 257757664, 257667313, 257495651]
2478B57495651j04675j59035m18892k80380M58489L83129o48747o55403L34740M52270
2488B56857147j24435k40097q7509n0545k0733m8885k29836j33018L68347L33557l24745
2499B56299248l17078L61443M01249l6946k89211n74112o83784p06673m98295J08948
2509B54064789K97546J25179J76430M31309L83835O0806j40419l65982m31061l70979
2519B54231453k32697J00861K08130J57833R6321k6455j57852l75500m24385l80764
2529B53196945j95961K68212M08649L54290J90010k73456l67165j56403n1021J14441
2539B53488541Q6555j94321k38189q9646o1988q9150j22070k15531k01473j01337J678
2550B52263069J78566K27699J99547R2507j87149k64893j94054j37577q583O199j10149
$$ y = [257495651, 257390976, 257231941, 256813049, 256532669, 256991158, 257374287, 256725540, 256070137, 256404877, 256857147, 256732712, 256492615, 256405106, 256354561, 256333828, 256284943, 256055107, 255922089, 256290436, 256623993, 256299248, 255982170, 256343613, 256744862, 256707916, 256418705, 255844593, 255160809, 254454136, 253955841, 254064789, 254362335, 254487514, 254663944, 255095253, 255479088, 255539894, 255399475, 255033493, 254602432, 254231453, 253998756, 254099617, 254307747, 254465580, 254561901, 254535446, 254377594, 254002094, 253577709, 253196945, 253000984, 253269196, 253677845, 254032135, 254222145, 253948689, 253581524, 253425121, 253374100, 253488541, 253575096, 253380775, 253142586, 253052940, 252990952, 252901802, 252779732, 252564201, 252362728, 252261391, 252263069, 252441635, 252669334, 252868881, 252961388, 252774239, 252509346, 252315292, 252177715, 252169132, 252175331, 252065182]
2561B52065182j03245l2654Q5602L77884L52135J4305j70708m16031l34968J23024
2571B51960526L69071P08333N05695m17481p12623o72836m77791J83353K46296k55833
2581B51436710l91483l91006k66800P1067K72027N09738M36783l6487k03839j80721
2591B51255989k12669k91596k05497J89533J03245n79834o09646k5997P8697j09673
2601B49592552k43683n79109m41074K62012M86374M24633L49045J31607J1444p6771
2611B49917030j12533p0572p5817r2755j41372l31650k06223L71209L95774n0773k91825
2622B49310493o03446n58606j8596L4809l31879m03156l66459j88580L13759L71933
2632B47560272j907r0847o2466L3379L44047L27111r308j56880k55336k57740j25885
$$ y = [252065182, 251961937, 251929283, 252014885, 252392769, 252744904, 252759209, 252588501, 252172470, 251837502, 251960526, 252329597, 253037930, 253543625, 253126144, 252413521, 251740685, 251262894, 251446247, 251692543, 251436710, 251045227, 250654221, 250387421, 250458488, 250730515, 251240253, 251677036, 251640549, 251436710, 251255989, 251043320, 250751724, 250546227, 250735760, 250839005, 250259171, 249649525, 249623528, 249702225, 249592552, 249348869, 248769760, 248328686, 248590698, 249077072, 249501705, 249850750, 249982357, 249993801, 249917030, 249804497, 249733925, 249658108, 249565353, 249423981, 249092331, 248886108, 249257317, 249653091, 249602318, 249310493, 248707047, 248148441, 248129845, 248164654, 247832775, 247429619, 247063160, 246874580, 247188339, 247560272, 247558365, 247467518, 247405052, 247438431, 247782478, 248109589, 248100281, 247943401, 247688065, 247430325, 247304440]
2643B47304440o0788K0485j4534k19822k48909j68094n9834J90258K05994n7697m6978
2654B46844521K24838K54631Q3923M7455J27544O0082j64509k44369k76337j74999
2664B46782780J63784K36053N9128O6032K69165J85738j62601l82424o96182o10104
2674B45911369m9839J92643L19957L11375R5119k2640j83353j30883K33651K57015
2684B46934414r537j21116j75000k29358l10192k55814p1755J01796M22954L98636
2694B46685028p858j57604j72139k05516k48909j85013R1552L9807m66805l81241M22001
2705B45413303L92437n36918n50995K69661M30336J67389K9564p8202l27358r59873
2715B44249344q39462R9411M56810N42411N14260K54402P6294j15395k54631m27494
$$ y = [247304440, 247243652, 247264137, 247249603, 247029781, 246780872, 246612778, 246552944, 246743202, 246949196, 246891499, 246844521, 247069359, 247323990, 247407913, 247455368, 247582912, 247642994, 247478485, 247234116, 246957779, 246782780, 246946564, 247182617, 247241745, 247307777, 247576942, 247762680, 247600079, 247217655, 246521473, 245911369, 245861530, 246054173, 246374130, 246685505, 246780624, 246757984, 246574631, 246443748, 246677399, 246934414, 246924877, 246803761, 246628761, 246399403, 246089211, 245833397, 245761642, 245863438, 246286392, 246685028, 246677170, 246519566, 246347427, 246141911, 245893002, 245707989, 245799541, 245839348, 245372543, 244991302, 245413303, 245805740, 245268822, 244717827, 244987488, 245417824, 245585213, 245614777, 245536575, 245209217, 244249344, 243409882, 243509293, 243966103, 244508514, 245022774, 245277176, 245353470, 245238075, 244983444, 244555950]
2725B44555950l56922M6730J46866J2169L090Q7509L1700j71661k62490l75976k31285
2736B43485680K83241M36783L97453K22931k81830l94325j69296j10627p4138j35670
2746B43660202m33922l38783J85966L65487L73134K87762L2425j66645m44412m88034
2756B43033180k88963j95274j22796o1492L089K385j32084n9605L25203K58446k70367
2767B42491722m57535m94232m21047j20869k4566k3842j22299n07126m27475K08358
2777B40101089K80381j81427j78337K92301K21500m10805n16891k55585q1787K39144
2787B39509583K23159j59740l08743l78608l51906j25427j29700l68118l96958l14483
2797B37199059j72120J69754K00501j7166k26021o49929o50883j04427j47572q38051
$$ y = [244555950, 244199028, 244245758, 244392624, 244404793, 244407883, 244495392, 244527092, 244355431, 244092941, 243716965, 243485680, 243768921, 244205704, 244603157, 244826088, 244544258, 244149933, 243980637, 243870010, 243795872, 243660202, 243226280, 242887497, 243073463, 243438950, 243812084, 244099846, 244132271, 243965626, 243521214, 243033180, 242744217, 242548943, 242426147, 242364655, 242367744, 242370129, 242238045, 242178440, 242503643, 242762089, 242491722, 242034187, 241539955, 241118908, 240998039, 240973473, 240949631, 240827332, 240320206, 239892731, 240101089, 240381470, 240200043, 240021706, 240314007, 240535507, 240124702, 239607811, 239352226, 239270439, 239509583, 239732742, 239573002, 239264259, 238885651, 238533745, 238408318, 238278618, 237910500, 237513542, 237199059, 237026939, 237196693, 237397194, 237380028, 237154007, 236504078, 235853195, 235748768, 235601196, 234763145]
2807B34763145q11348q0108M1733j81198m94233j319179j224041O904P8698q66433
2817B29913940j102905r56306q53310n09262o36101j262169j562118j645336j902581
2826B19483852k305278k578965k836952k903938k704620k718201k900601k951870k874832
2835A94708595k958545l252030l272056l027916k968789l173828k879848j965294j681557
2844A69528732j887817j897812k057075j669884o03905q6555J25656K84424J62620
2853A61898384M16260J109848J328239J164437J160850J178742J228332J307964J411686
2862A72204742J590481J644840J683484J470317R38912N89599K31267J27086L94325
2871A80875053K97795j31855k85149j92394l45230o54927r87300j532078j665840j318436
$$ y = [234763145, 233951797, 233871689, 233913422, 233732224, 233237991, 231918812, 230694771, 230701675, 230780373, 229913940, 228811035, 227854729, 227001419, 226492157, 225856056, 224593887, 223031769, 221386433, 219483852, 217178574, 214599609, 211762657, 208858719, 206154099, 203435898, 200535297, 197583427, 194708595, 191750050, 188498020, 185225964, 182198048, 179229259, 176055431, 173175583, 171210289, 169528732, 167640915, 165743103, 163686028, 162016144, 161412239, 161325684, 161451340, 161735764, 161898384, 162314644, 163424492, 164752731, 165917168, 167078018, 168256760, 169485092, 170793056, 172204742, 173795223, 175440063, 177123547, 178593864, 179532776, 180122375, 180353642, 180480728, 180875053, 181172848, 181040993, 180755844, 180563450, 180218220, 179563293, 178575993, 177043915, 175378075, 174059639]
2881A74059639j395950j816521k001514k158642k037278j435775j411438j888743k114534
2890A57799244k315521k340794k171516k037287j832485j749993j732826j817942k039194
2899A39761686k225637k509594k533436k381802k076148j269579j329661k258777k681256
2908A20495796k963304l017187k808094k563477k161503j862287j578331j400233j439571
2917A00701809j159430m16517l21627q81195r62019q28027n59807m3869L44992Q51392
2927I6725702Q68082K27452K03848O43014Q87156J171589J211405R29832R16243J013040
2937A04797363J259327J785994K029657K121449K099752J835108J804829J872539K106428
2946A21712446K634049K873897K986908K911091K436399K461672K968550L128290L085613
$$ y = [174059639, 172663689, 170847168, 168845654, 166687012, 164649734, 163213959, 161802521, 159913778, 157799244, 155483723, 153142929, 150971413, 148934126, 147101641, 145351648, 143618822, 141800880, 139761686, 137536049, 135026455, 132493019, 130111217, 128035069, 126765490, 125435829, 123177052, 120495796, 117532492, 114515305, 111707211, 109143734, 106982231, 105119944, 103541613, 102141380, 100701809, 99542379, 99125862, 98804235, 97923040, 96961021, 96132994, 95573187, 95529318, 95874310, 96725702, 97593784, 97821236, 98025084, 98668098, 99555254, 100726843, 101938248, 102868080, 103784323, 104797363, 106056690, 107842684, 109872341, 111993790, 114093542, 115928650, 117733479, 119606018, 121712446, 124346495, 127220392, 130207300, 133118391, 135554790, 138016462, 140985012, 144113302, 147198915]
2955A47198915L089667L079891L048658L016234K906322K755871K493401K021541J798153
2964A71408653J631966J827011K748966K630234J472225J036415R56764R33419J164913
2973A85810566J156559R89914Q31604N14278N37625R57737J050472J017094P76996
2982A93642845J16596l0517K16732L97682Q13236P19319J70459l08742r51309j352539
2992A93433762j491547j857758k372741k860794l705254l548145k377033j600037q09422
3001A72811031k31495J11332N34535J041183J301995J385688J346589J206626Q22564
3010A80330048R9887m42504q81195j430264k017021k718926l548870m378566n496254
3019A59516335n877972n844593n136490l595114k115011k20776J079083J866341K820491
$$ y = [147198915, 150288582, 153368473, 156417131, 159433365, 162339687, 165095558, 167588959, 169610500, 171408653, 173040619, 174867630, 177616596, 180246830, 181719055, 182755470, 183712234, 184645653, 185810566, 186967125, 187957039, 188788643, 189302921, 189840546, 190798283, 191848755, 192865849, 193642845, 193759441, 193728924, 193945656, 194343338, 195156574, 195875893, 196046352, 195737610, 194786301, 193433762, 191942215, 190084457, 187711716, 184850922, 181145668, 177597523, 175220490, 173620453, 172811031, 172579536, 172690868, 173225403, 174266586, 175568581, 176954269, 178300858, 179507484, 180330048, 180429935, 179987431, 179106236, 177675972, 175658951, 172940025, 169391155, 165012589, 159516335, 153638363, 147793770, 142657280, 139062166, 136947155, 136726379, 137805462, 139671803, 142492294]
3028A42492294L771067M718542N956650O308784N926628N376816M114151L751030M372826
3037A86788788M022369K862702K196769J700173J367092J417866R74655P4634n56697
3046B00848351j191140j469154j297226j409531j619568j940021k513886k757778k826233
3055A83823814k687454k355804j809120j065026p6999J477489K260208K479057K640267
3064A84686432K453079K573738L089905K994041K381325J875420J210918Q22544Q24700
3073B02912102L23753o43234j333485k129307k243995j709938j187573m88281K90623
3082A93790665J242408K088547L073692L495446L429909L274669K824536K501983K338162
3091B18060017J783123N80330L02543J060257Q35648k37694o78063q38279p91321m75407
$$ y = [142492294, 146263361, 150981903, 156938553, 163247337, 169173965, 174550781, 178664932, 182415962, 186788788, 190811157, 193673859, 195870628, 197570801, 198937893, 200355759, 201330414, 201405048, 200848351, 199657211, 198188057, 196890831, 195481300, 193861732, 191921711, 189407825, 186650047, 183823814, 181136360, 178780556, 176971436, 175906410, 175829411, 177306900, 179567108, 182046165, 184686432, 187139511, 189713249, 192803154, 195797195, 198178520, 200053940, 201264858, 202087402, 202912102, 203235855, 202592621, 201259136, 199129829, 196885834, 195175896, 193988323, 193500042, 193790665, 195033073, 197121620, 200195312, 203690758, 207120667, 210395336, 213219872, 215721855, 218060017, 219843140, 220423470, 220726013, 221786270, 222621918, 222384224, 221706161, 220867882, 220076561, 219601154]
3101B19601154o4602O11306J043777J425743J492272J210441R73473M73976N45731
3110B27313271J312027J443386J207599Q62580Q6784r4872K32926L80516N63850O05584
3120B33913651N48133L95775M0283r3212j30901N264M81110N54809M20094M0760r93729
3131B35182037j006355M0531L16868J69258L9349l38307l44047M6501J16100n6514
3141B34165421p1984j9798N8174K45094K49138L357O5804N55496M36325l84827n00679
3152B34801521j6670Q0814J2398j18732n42412m43459K22702M60129N71976L40462
3162B35368729n57900o13689J76182K87056r1057j95046k24113j46618Q7490K45094
3172B34336128M89235L97682j28021k72980k33192l9558O14624N30738l39756o04629
$$ y = [219601154, 219536552, 220147858, 221191635, 222617378, 224109650, 225320091, 226293564, 226767540, 227313271, 228625298, 230068684, 231276283, 232138863, 232225647, 232130775, 232363701, 232744217, 233308067, 233913651, 234461784, 234857559, 234897842, 234804630, 234673729, 234678993, 235160103, 235714912, 236135006, 236175766, 235182037, 234175682, 234216213, 234533081, 234702339, 234741688, 234403381, 234059334, 234105835, 234221935, 234165421, 234093437, 234073639, 234131813, 234376907, 234626045, 234629402, 234695206, 235250702, 235687027, 235302200, 234801521, 234784851, 234865665, 234878063, 234759331, 234216919, 233773460, 233996162, 234456291, 235028267, 235368729, 234810829, 234197140, 234373322, 234660378, 234569321, 234374275, 234150162, 234003544, 234091034, 234336128, 234825363, 235223045, 235095024, 234822044, 234588852, 234549294, 235163918, 235694656, 235354900, 234750271]
3182B34750271n66483m10556M1732K59152M78496K82288n64575p05471k40803j28746
3192B33195305k21481j53084L4332J41144J98364K79198M86374L34263l27111m13418
3202B33553886p400J34964K31018J64986j72139k31495m1732l9330k36759j49021L13759
3213B33520737L06625j31607l12576n08786l20682M44660O12965L18069J97640J30424
3223B34257469l7441m03156m25835r1305J202M272r4642m18187m65641l31878j41144
3234B31853714K35558M04853N34764L46183l92913m77085O0081J47114j30406m6978
3244B32534885M91848L83149m52767n96275j85013q9416j19668j66893l92456k59857
3254B31147537L21846M51088K31285J47572R1076J2169o7253j85242m31061m12216
$$ y = [234750271, 234183788, 233773232, 233814964, 234074116, 234552612, 234834900, 234270325, 233564854, 233324051, 233195305, 232973824, 232820740, 232855072, 232996216, 233194580, 233473778, 233960152, 234294415, 233967304, 233553886, 233546486, 233681450, 233912468, 234077454, 233905315, 233673820, 233632088, 233592758, 233355999, 233206978, 233520737, 233827362, 233695755, 233383179, 232874393, 232553711, 232998371, 233611336, 233929405, 234127045, 234257469, 234220028, 233816872, 233391037, 233299732, 233300934, 233305206, 233210564, 232792377, 232326736, 231994858, 231853714, 232089272, 232494125, 233028889, 233375072, 232982159, 232505074, 232565155, 232712269, 232581863, 232534885, 233026733, 233409882, 232957115, 232360840, 232175827, 232086411, 231966743, 231799850, 231407394, 231147537, 231469383, 231920471, 232151756, 232299328, 232390404, 232402573, 232335320, 232150078, 231719017, 231306801]
3264B31306801j66664O2713M98047M93527L1948j74752k87303l77179m24385m40368
3274B30522385m68483l23773Q4877K06700J00135P9403L0995R4414M00772K83737l66936
3285B30644226m45843N722M7207j96686k86827l42846l26633k34375j22776L4332J85719
3296B28961220M53491L97186l1700j99547l44047j50452O60191O54697j76659l64551
3306B29859829n4112j34964o21547n66235k8610K81334O39419O48747L11375J4076
3316B30349312n14279n78632r7046r3231n67188m98524J26114K32468j21613r6550
3326B28140831K42004L13759K00024J54972J89552N722m70886o45161o95705n04017
3336B26931095Q9398L26404L55244L40690K57988L9330n04265n52177r6779P629j11580
$$ y = [231306801, 231140137, 231202850, 231700897, 232194424, 232226372, 232051620, 231764317, 231387138, 230962753, 230522385, 230053902, 229730129, 229815006, 230021706, 230121841, 230201244, 230232239, 230326653, 230727425, 231011162, 230644226, 230198383, 230204105, 230251312, 230054626, 229767799, 229424953, 229098320, 228863945, 228741169, 228775501, 228961220, 229414711, 229811897, 229780197, 229580650, 229236603, 229086151, 229746342, 230401039, 230224380, 229859829, 229805717, 229670753, 229049206, 228482971, 228454361, 228735695, 229375114, 230023861, 230335236, 230349312, 229835033, 229256401, 229159355, 229066124, 228498936, 228000412, 228126526, 228358994, 228237381, 228140831, 228382835, 228696594, 228896618, 229051590, 229241142, 229246864, 228775978, 228130817, 227435112, 226931095, 227020493, 227346897, 227702141, 228042831, 228300819, 228340149, 227835884, 227283707, 227186928, 227194557, 227082977]
3347B27082977j09672j03951K7886M29382M02451j06316j86691L2653J55697L99838
3357B28024254K89917k40822m49886n82943m01249L19958M42504L1948l7441N6038
3367B27452278J51405M17214L37849j41850k86827k15530j91212j32561j01566o1264
3377B27227936r7771k55337k71549j67141j24454j71433j5716M19368N32627N51224
3387B27627754J64986r88007j149654m18663j60923j09673L0976J87168L58829P45049
3397B26287842N48134l97225o34651l16162k92530m83513l60737Q9417K81105L86944
3407B25108624L00655j67389j54495K59647N27859R81560Q41636J42098m74224j560688
3417B25805283j548996m00544J58768O57082P04536J79520m3621k23160k01225J42803
$$ y = [227082977, 226973305, 226869354, 226897240, 227326622, 227729073, 227622757, 227436066, 227468719, 227624416, 228024254, 228314171, 228073349, 227623463, 227040520, 226639271, 226959229, 227401733, 227433681, 227396240, 227452278, 227603683, 228020897, 228358746, 228216896, 227930069, 227714539, 227523327, 227390766, 227289200, 227227936, 227130165, 226874828, 226603279, 226436138, 226311684, 226140251, 226124535, 226543903, 227076530, 227627754, 227792740, 226804733, 225655079, 225236416, 225075493, 224965820, 224996796, 225183964, 225542793, 226287842, 226835976, 226438751, 225804100, 225487938, 225195408, 224711895, 224351158, 224440575, 224721680, 225108624, 225409279, 225241890, 225087395, 225347042, 225874901, 226856461, 227698097, 227840195, 227365971, 225805283, 224256287, 223855743, 224014511, 224671593, 225376129, 225555649, 225512028, 225288868, 225087643, 225230446]
3427B25230446J66664j13258j23253O7711J60217K51293K51522J98364L0518m59423
3437B25660801l83129K84653N53379Q41140M65393p71522j399517k121926j597404
3446B21531868O86169J335392Q59718O13213R3956m5548J93825J61667j05629TK30083
3457B25449085J22547n18322n54084n6973J20163K30293J12534m41551m37737J79539
3467B24205494J91441m00048l86734Q8463L86009P62215Q28743O69956L36895l20930
3477B26361504p54357j355877j106014K63672O59714N25245J80950q69274r63440k57492
3487B22684631K09809J011123Q91915k96097p06673r02672m80880R91592J378059J195183
3497B25975990N12123j322269j773129j253585o46592Q59490Q98361n42412j048317
$$ y = [225230446, 225397110, 225283852, 225160599, 225228310, 225388527, 225639820, 225891342, 226089706, 226120224, 225660801, 225277672, 225562325, 226115704, 226956844, 227422237, 226650715, 225251198, 223129272, 221531868, 222218037, 223553429, 224413147, 225026360, 225120316, 225074768, 225268593, 225430260, 225324631, 225219002, 225449085, 225571632, 225053310, 224499226, 224442253, 224562416, 224792709, 224905243, 224463692, 224025955, 224205494, 224396935, 223996887, 223610153, 223698616, 224084625, 224846840, 225675583, 226345539, 226682434, 226361504, 225607147, 224251270, 223145256, 223408928, 224068642, 224593887, 224774837, 223905563, 222942123, 222684631, 222894440, 223905563, 224797478, 224501381, 223794708, 222892036, 222411156, 223402748, 224780807, 225975990, 226488113, 225165844, 223392715, 222139130, 221492538, 222352028, 223250389, 222707977, 221659660]
3506B21659660j308918r81807L13530P09991M29649M49887N74112O11057N61256O12965
3516B23631382R29584O68068j13029q05130j987228j952172l97186k42958j402378
3525B18328953j306534k67735L93868J229992J351356Q94070K02179j453877j502037
3534B17870235j64032Q72860K527943K810001K053986R11217j257897k547969l912449
3543B19163895l443718p72705P13806K441406K094765j033078j801242j205445m06761
3552B15750923J504898K050400J442909J308937J090279J392136K513885K649536L046036
3561B32749939N18570o347904q709431r180069o148815L135681O055584M639168L389587
3570B20102310J35193r41048n00202q1539J191616J348248J9569O48727L310433M261970
$$ y = [221659660, 220350742, 219368935, 219682465, 220392456, 220822105, 221271992, 221846104, 222457161, 223018417, 223631382, 224560966, 225229034, 225116005, 224310875, 222323647, 220371475, 219974289, 219731331, 218328953, 217022419, 216754684, 217148552, 218378544, 219729900, 220623970, 220826149, 219372272, 217870235, 217706203, 218579063, 221107006, 223917007, 225970993, 226882210, 225624313, 223076344, 219163895, 215720177, 214947472, 215661278, 218102684, 220197449, 219164371, 217363129, 216157684, 215750923, 217255821, 219306221, 220749130, 222058067, 223148346, 224540482, 227054367, 229703903, 232749939, 233268509, 226920605, 218211174, 209031105, 202882290, 206017971, 212073555, 216712723, 220102310, 220237503, 219296455, 218796253, 218714714, 219906330, 221254578, 221274147, 221922874, 225233307, 229495277]
3580B29495277N372048K905845m483680p675171r790669p463207J640072M820118M869461
3589B19690094L316383k430191l535499q36621J77632J241436R05037j697789j652946
3598B15177536L72658K131920N499611N223751J516819j220227n471477n703926j679879
3607B15846786J14670J431694J749535L09219O67801L861675K187253n146504p272015
3616B13750114o989708l968715L802299P944355J1497250J0678768N947838p49588
3624B41912613j3949394j7453919j4507770q331299P350674J0656852K717724Q89530
3632B09285011J758576J622448J453876J064301k27204M89464L219605N030861P597217
3641B31294155P154465N277386n71003j4251957j7786255j4501343r070148L183116
$$ y = [229495277, 234867325, 237773170, 233289490, 225614319, 215823650, 208360443, 210000515, 214820633, 219690094, 223006477, 220576286, 217040787, 216204166, 216381798, 217623234, 218528271, 216830482, 215177536, 215550194, 217682114, 223181725, 228405476, 229922295, 228702068, 223230591, 217526665, 215846786, 215961456, 217393150, 219142685, 219451904, 220119705, 223981380, 226168633, 221022129, 213750114, 206760406, 202791691, 206593990, 214538345, 226035595, 236714363, 242662201, 241912613, 227963219, 210509300, 196001530, 187670231, 195020905, 205677757, 208395481, 209285011, 211043587, 212666035, 214119911, 215184212, 214957008, 215446472, 218666077, 223696938, 231294155, 238448620, 243726006, 243155003, 228903046, 211116791, 196615448, 187545300, 190728416]
3649A90728416Q226395R835968O938934m672775p096748k731819J14689N147228N854110
3658B12344398J673470J361847L548851M957199Q060227O240367r81807n074272j0436764
3667B21693516q003941N897026P509003L27835n875130j9312133j6906510M074593
3675A89404259R621620M267445L888607M883766N781650P881165P457027O042710J228561
3684B40456810r693604j3483295j3364086r682655R14115N358696O144524O364098
3692B13014603M604816L422032K249221P97043q57353k735615o667137n313396J864662
3701B10378876N370140Q352527P709256L368625j281490r297867j1844387j1081695
3709B01673985p205258K722283P144432Q815536Q273354L924141J601696m4346j447201
$$ y = [190728416, 198954811, 208790779, 215729713, 211056938, 203960190, 201228371, 201343060, 206490288, 212344398, 214017868, 215379715, 218928566, 223885765, 231945992, 238186359, 237204552, 232130280, 221693516, 213689575, 219586601, 227095604, 227423439, 221548309, 202236176, 185329666, 189404259, 199025879, 203293324, 207181931, 212065697, 217847347, 225728512, 233185539, 239228249, 240456810, 230763206, 217279911, 203915825, 194233170, 195147285, 200505981, 206650505, 213014603, 217619419, 221041451, 223290672, 224087715, 223230362, 220494747, 213827610, 208514214, 210378876, 215749016, 224101543, 231810799, 235179424, 233897934, 224600067, 212755680, 201673985, 194468727, 197191010, 204335442, 213150978, 221424332, 225348473, 226950169, 226905823, 225458622]
3718B25458622k664566l035545k480259j980324j820564J19705M368782O692638R748936
3727B34407425P139206k576103p240296r492645j0933647j2788525q556614L476868
3735A93435669R949207J5835514J4595280N253792j750469j2400151j3205776m444580
3743B07268486J500130J2691955R258042j3181210j7236004q093834k396583O046066
3751A95857048R112358Q483887N554199k984772n297165l281135j181603L490944N021553
3760B14775314M673500L105393j159439k875557k616654l336181n521775m272689O54678
3769B03426590L382454N965958O059646L503075J283645k011776l721485n115013l775844
3778B08997250K055645K923011n92956j358738r23157k25315J575718K053966J231919
$$ y = [225458622, 222794056, 219758511, 217278252, 215297928, 213477364, 213597069, 217965851, 224658489, 234407425, 241546631, 238970528, 231730232, 222237587, 211303940, 198515415, 189958801, 193435669, 203384876, 219220390, 233815670, 239069462, 237318993, 224918842, 211713066, 207268486, 208768616, 221460571, 230718613, 217537403, 200301399, 192207565, 189810982, 195857048, 204969406, 213453293, 219007492, 216022720, 210725555, 207444420, 206262817, 209753761, 214775314, 219448814, 222554207, 221394768, 218519211, 215902557, 212566376, 207044601, 202771912, 203426590, 206809044, 212775002, 218834648, 222337723, 223621368, 221609592, 217888107, 212773094, 208997250, 211052895, 213975906, 213382950, 212024212, 211101055, 210875740, 212451458, 214505424, 215737343]
3787B15737343J444092K660999K664814J660805J044044L56198L3130N70793m53243
3796B25718975k778053n027294j0075798p802010M382839O000767j189232l746986
3804B05483208o640930l440857Q693695J1967430R548912O559124K12192l470420o992112
3813B21920242o362190P44095J035690m465103o559601r190559n788803O803035R384633
3822B07521439L665695K006035J328964J581898M104366L588219m22478p97043K791882
3831B25368977J901149k775669n569935r219169q443833k332458J85966R58443J523514
3840B01596985M80404J893520N486717Q298169J2685527J2179623Q823643R13124j5989762
3849B36367950k2429466k4382591j7399559M565716J2876262J2823353J1877537O867180
$$ y = [215737343, 217181435, 219842434, 222507248, 224168053, 225212097, 225568295, 225601425, 226172218, 225718975, 222940922, 217913628, 207837830, 200035820, 204418659, 210419426, 209230194, 205483208, 198842278, 195401421, 204095116, 216062546, 225611458, 232170582, 232382774, 228912354, 221920242, 215558052, 216302147, 217337837, 212872734, 206313133, 197122574, 191333771, 198136806, 207521439, 211187134, 213193169, 214522133, 216104031, 220208397, 223796616, 223374138, 222577095, 225368977, 227270126, 224494457, 218924522, 209705353, 201261520, 198929062, 199115028, 200073471, 201596985, 202077389, 203970909, 209457626, 217755795, 230441322, 242620945, 251444588, 252357712, 236367950, 213938484, 189555893, 172156334, 176722050, 189598312, 202421665, 214299202, 221166382]
3857B21166382L007393k093544m085770l896255k167206L434887M215717J629829j448402
3866B19763031q449059q526096j566410J131287J805801K800694L514766M006863N352497
3875B19833374L188133m284134n509624j275768J1196P79628k80380n600452m147778
3884B02714195N734940O385078r40552l609905n715122l522167N019665P970581Q019447
3893B22056160O349316J544475j916160n898247p421265o423950o134262o519089m483223
3902A91153755L77426L350735O309986O474018L020535K016525K598763K151737J422176
3911B18875656L8147k736339l588429l239632k116699R57737J697540N61009M58r74884
3921B09474564q56171K83737J226654L251305K459774j593590l229847m164696l214607
$$ y = [221166382, 224173775, 222080231, 217994461, 214098206, 211931000, 215365887, 219581604, 221211433, 219763031, 211313972, 202787876, 201221466, 202352753, 204158554, 206959248, 210474014, 214480877, 219833374, 223021507, 218737373, 213227749, 211951981, 211963177, 212742805, 212462425, 206861973, 202714195, 208449135, 214834213, 213893661, 210283756, 204568634, 201046467, 206066132, 214036713, 222056160, 228405476, 229949951, 228033791, 222135544, 214714279, 208290329, 202156067, 195636978, 191153755, 191531181, 194881916, 201191902, 207665920, 210686455, 212702980, 215301743, 217453480, 218875656, 218913803, 216177464, 212589035, 209349403, 207232704, 208190441, 209887981, 210448990, 210449448, 209474564, 208618393, 208902130, 210128784, 213380089, 215839863, 214246273, 211016426, 206851730, 203637123]
3930B03637123N66006K207756K991199K760163P88459J34945N45502k5501j823921
3939B11781731j821747j15395O49929J438847J037140j006623j675357j621952j254578
3948B07411995j79749M36058R96590J052628L36399L67641J320610R74884p57694j306534
3958B10652828j188030r08852j90982L58333J218796J076946k44617p22885r14345
3967B09137192o18210O47774P50541k25772m87080m52767k42233M37966N32875J10149
3977B09590435m9114k05269r9182M35581M73499P3910p7000j12533j85967l06377k84195
3988B09253788K5997j47362r36260j043567o95935k86808M38194Q53787J225223J113186
3998B09800243K77272J17073
$$ y = [203637123, 204203129, 206410885, 209402084, 212162247, 212950706, 213085651, 213631153, 213605652, 211781731, 209959984, 209844589, 210494518, 211933365, 212970505, 211963882, 210288525, 208666573, 207411995, 207232246, 207668304, 208664894, 209717522, 210053921, 210421562, 211742172, 212717056, 211959362, 210652828, 209464798, 208555946, 208364964, 208723297, 209942093, 211019039, 210774422, 210051537, 209137192, 208518982, 209166756, 209917297, 209691525, 209204445, 208751678, 208509445, 208947411, 209480286, 209590435, 209541321, 209336052, 209236870, 209672451, 210145950, 210219860, 210142860, 210030327, 209844360, 209537983, 209253788, 209279785, 209132423, 208196163, 207152596, 206456661, 206169853, 206608047, 207461834, 208687057, 209800243, 210077515, 210194588]
4000B10194588
$$ y = [210194588]
##END=$$ End of the data block
