##TITLE=$$ Begin of the data block
##JCAMP-DX=5.00 $$ ACD/SpecManager v 10.08
##SPECTROMETER/DATA SYSTEM=16PC
##DATE=Mon Sep 16 14:41:38 2013
##DATA TYPE=INFRARED SPECTRUM
##DATA CLASS=XYDATA
##ORIGIN=
##OWNER=
##NPOINTS=3601
##FIRSTX=400.00000000
##LASTX=4000.00000000
##MAXX=4000.00000000
##MINX=400.00000000
##MAXY=39.03849030
##MINY=1.89373493
##XFACTOR=1.0000000000
##YFACTOR=0.000000100000000
##FIRSTY=27.47874260
##DELTAX=1.00000000
##XUNITS=1/CM
##YUNITS=TRANSMITTANCE
##XYDATA=(X++(Y..Y))
400 274787426 307128906 343648911 344296684 327061424 286299934 252856483 266717911 294811249
408 294811249 316006184 334458351 347512474 354469299 353003502 345336685 331694107 315738201
416 315738201 300330887 288096428 282394180 283880005 298930893 313742161 313177109 307605743
424 307605743 299840450 297415733 315159569 334001770 335984459 332596054 329665909 326211472
432 326211472 322278252 320608597 325554848 332331161 337900887 341366272 338186035 336254578 347573776
441 347573776 355277557 339686394 321239929 316552887 317420235 321870804 327816238 332842102 335953217
450 335953217 334163895 331030350 328193893 328413963 337254524 347942352 355718613 360100975 357906799
459 357906799 352477074 344887733 338749657 338760376 342733154 352015991 360699883 361383896 359890709
468 359890709 360403290 360439072 358479271 355812531 352827301 350703011 352342606 352962494 345882645
477 345882645 339694023 342673531 349080086 357723236 363226395 355940590 347489586 349685211 352313538
486 352313538 346535683 340036621 338860016 339089394 338761826 338058472 336725693 334102859 327774048
495 327774048 322748184 324915161 329216003 332955132 334930878 331671486 327288628 324962845 324012985
504 324012985 325437775 327376862 327288857 328213463 333344688 339676361 345365982 350116272 353009720
513 353009720 354063263 352573853 349781036 345955849 343298187 345363159 348352661 348862877 349263191
522 349263191 351490021 353436470 353594055 352103729 347108841 343091965 345468063 349581718 351861000
531 351861000 354467392 359375229 363573074 363455544 362776260 365464935 367385864 364111404 360444069
540 360444069 360527267 361909142 363952179 365353355 363744736 361683121 360963097 361502151 364824295
549 364824295 367902527 366892815 365766754 368482361 371232986 370893021 369376411 366774063 365427017
558 365427017 369204521 373612175 375011673 374703636 371531715 369225273 372954597 377237320 377785454
567 377785454 376183739 371680031 366996765 365093956 364506950 364949455 365843773 366613388 366967926
576 366967926 366103172 364981651 364603996 364050636 361712227 360656967 365208397 369991531 370041847
585 370041847 368451614 366172562 364658356 366782188 369234810 368461838 368072052 371876717 375711670
594 375711670 376089096 374789734 371927986 369011383 368259888 367648125 365005722 362985840 364270935
603 364270935 366601219 368697662 370298615 370572090 369948883 368379593 366472969 364789734 363423347
612 363423347 362491837 362478714 364717712 366776466 365933418 364389191 363424759 363077621 364402542 365626564
622 365626564 364741096 363504868 363217354 363247375 363875885 363666077 360510826 356701851 353539696 351888199
632 351888199 353804359 357007523 359912643 362486343 364201050 364951134 363826523 362711411 364048958
641 364048958 365249176 363608131 361910095 363132706 363989601 361114502 357722778 356416473 355668297
650 355668297 354240189 353863487 357038956 360219498 359951019 358452072 356577148 354962578 355002632
659 355002632 355275154 354368668 353642235 352606544 355393181 372407188 384338379 368274918 345426331
668 345426331 328532944 320089798 332844963 348776817 350877037 348853340 346942902 344548454
676 344548454 342686882 340753326 337921143 335870018 336750259 338319778 339028130 338949661 336837044
685 336837044 335102081 336519470 338751564 340574989 341419945 339533081 337239761 336990585 336654892
694 336654892 334381561 331781616 330530396 328582993 323612442 318140259 314310074 310928116 307559490
703 307559490 304067612 299937019 295866966 292325497 289491177 288212776 286946297 284036160 280662308
712 280662308 278389454 274404755 266196976 254422665 239588261 219633331 190927505 158684731
720 158684731 126191378 95597506 69724321 49841881 39075851 34678221 35645247 39869070
728 39869070 44587612 50757647 58259487 67557335 78513861 92813730 112704039 136356831
736 136356831 163110504 191709518 221383324 250012875 275401592 297007790 312941551 325048676
744 325048676 334442139 341428986 346641083 350213776 351995926 353477936 356882324 359860916 360120544
753 360120544 359715233 360497475 360777626 358715286 356612434 356688499 357350578 357496033 357872467 359469185
763 359469185 360458374 358695030 356120605 354154129 352214813 349948654 348093758 347855339 347476006
772 347476006 344863892 342226486 341513405 341406593 341516266 341005096 338257561 335217705 333848953
781 333848953 332474937 329784164 326642265 323596001 320289154 316639423 312369118 306931267 301050186
790 301050186 294496536 289584389 288938751 291394005 297662964 304734955 309573898 312968254 314342270
799 314342270 314750195 315181503 315253735 314613571 314162731 315193405 316178551 315736046 314719925 313561211
809 313561211 312146912 309988022 308642159 310037842 312571526 315627823 318169823 318591118 317985058
818 317985058 316643944 315363407 315349102 315660706 315849781 315644493 314444771 312785149 310875664
827 310875664 309087524 308246384 307197094 304658661 301833153 299772491 297642937 294696808 291727066
836 291727066 289457092 287346115 285023460 282702446 280287266 278334389 277623177 277386665 277042618
845 277042618 276814461 276813984 276792297 276337395 276047707 276424885 277344227 279101143 280933857 282287369
855 282287369 282836437 281579494 279990196 279687157 279232750 277603149 275172710 272232056 268007050
864 268007050 261710167 253669739 244044533 232552299 217638016 203275909 192936668 186572800
872 186572800 185818195 189097176 196011772 204660187 212988625 221052895 228045464 234500160 240890732
881 240890732 246589184 250741005 254497299 259041061 263420830 267136345 270015240 271578064 272244930
890 272244930 272041798 271669617 272122612 272543907 272122154 271714211 271897793 272697220 274425030 276793003
900 276793003 279525032 282896519 287080288 292107353 298427811 304955959 310817242 315826416 319039116
909 319039116 321856499 325664291 329564323 333240738 336329956 338096619 339339485 340588570 341914406
918 341914406 343918076 345537186 345447540 345035324 345488548 346077423 346439133 346660385 346619110 346576233
928 346576233 346996765 347143898 345995407 344871979 345040321 345639229 346352081 346809616 346404800 345534325
938 345534325 344197769 342976799 342635651 342625618 342800865 342715263 341521988 340276489 339941483 339945564
948 339945564 340179443 340215683 339428406 338302612 337143898 335861206 334553947 332953453 330643654
957 330643654 328164597 326134911 323900223 320791016 317471027 314572811 311517715 307605019 303830147
966 303830147 301429977 298976173 294786453 290856590 288880825 288080215 288111458 289359818 292532196
975 292532196 296316872 299408436 302491417 306027412 309378624 311982880 314071884 315710545 316834927
984 316834927 317262173 317412376 317633152 317956696 318706989 319354782 319194317 319076767 319992542 320816040
994 320816040 320548553 319798241 318888893 317674637 316064110 314217339 312282791 310200462 308300247
1003 308300247 305559158 300891647 294812202 287795544 278873444 267427444 252881279 234480381
1011 234480381 212140560 183587551 154635429 129664183 110700369 102212191 101251364 107306242
1019 107306242 117535353 129041195 141479254 152838707 165220985 181818962 197344780 206658840
1027 206658840 212509155 215682259 216922035 217131386 216619720 216216564 215261936 212973824 210547924
1036 210547924 209305038 208084335 205723286 203547955 202776680 202568531 202194691 202537308 204299927
1045 204299927 207289219 211710930 217068195 223074436 229303360 235094299 240862617 246956825 252916107
1054 252916107 258449783 263392448 267520905 270714760 272804031 273713589 273013344 271595230 270451775
1063 270451775 268851280 266204357 263074646 260000954 256464958 252088318 246988525 241291046 234593163
1072 234593163 226494312 217111111 206343880 194438457 181412697 167847862 154060125 140859365
1080 140859365 129498005 118964911 108484983 98600626 89538097 81467152 74978113 69032669
1088 69032669 62401533 56248188 51559687 47635317 44101954 40964127 37909269 35512924 34554243
1097 34554243 34108639 33295393 32759905 32854557 33576727 35247564 37245750 38933039 40681124 42775154
1107 42775154 44836044 46504974 48005104 49734592 50808430 50239801 48731089 46369314 44012070
1116 44012070 42625427 41967392 42282820 43077230 43881416 44862509 46035767 47385931 48980713
1125 48980713 50583839 51867723 53173065 54652452 56540966 59186697 62402964 66075563 70334673
1134 70334673 75259686 80888033 87303877 94444036 102330685 110790730 119551659 128934145 139294147
1143 139294147 150249720 161800156 173155556 183267365 192910194 202492714 212063560 222108116
1151 222108116 231724510 240034580 247449150 254072418 259942780 265271664 269640923 272412300 274456024
1160 274456024 276570797 278330803 279759407 280306816 279421329 277128944 273002148 267847538 261962891
1169 261962891 256443977 252612591 250085354 248960495 249112358 250504494 252965202 256384373 260538330
1178 260538330 265236626 270267487 275484810 280501366 285019875 288623333 290349731 291533241 293504944
1187 293504944 295311203 296405563 296896935 296635399 295849075 294684410 293235054 291682243 289907227
1196 289907227 287819138 285513878 282989502 280446053 278140545 275896797 273602962 271321526 269074211
1205 269074211 266868591 264764061 262625923 260389328 257900715 254945984 251639137 247985115 244095802
1214 244095802 240184307 235949745 231228828 225819817 219237328 212167263 205055237 198136806 192148437
1223 192148437 186029663 179098129 170953751 160622120 149142504 137338638 124881506 111399651
1231 111399651 97844124 84941149 72993755 62567472 53601265 46275377 40429831 36156416
1239 36156416 32879114 29838800 27675390 27202129 27137995 26218891 25206327 24440765 23918629 23779631
1249 23779631 23932457 24583101 24978399 24030924 22946596 22851229 22895098 22481680 21975756 21456718
1259 21456718 21183014 21648169 22226334 22312164 22334337 22538424 22867918 23355246 23978233 24791718
1269 24791718 25597095 26138544 26642323 27282953 27956486 28669834 29261827 29478550 29602528 29833078
1279 29833078 30165195 30630350 31315804 32345295 33639669 35341501 36909342 37542582 38159847
1288 38159847 39458275 41301250 43891668 46906710 50042391 53441763 56954622 61154604 66711187
1297 66711187 73184967 80507755 88234425 95921040 103493690 110833645 117628813 123049021 128527880
1306 128527880 135538816 143129110 150973082 158660889 165440559 172009697 178899288 185853729 192950478
1315 192950478 199718704 205464363 210931053 216636181 222562790 229091167 235544434 241378307 246572266
1324 246572266 250970840 254432678 256851425 257965565 257638931 255388489 250539055 243530998 234539757
1333 234539757 223683834 210921764 196906090 181780090 167029381 153255224 143253088 140615702
1341 140615702 143552065 151782990 164362679 181113968 199450264 216891766 232938766 246020317
1349 246020317 256868591 265742779 272489548 276757469 279399643 281130066 282012939 282439003 282140503
1358 282140503 281780243 278955936 270391693 259367714 247434845 236505032 230420113 224940777
1366 224940777 215279102 206921101 204872608 205783615 208553085 211438179 210988045 211223125 216070900
1375 216070900 222359657 228211403 233671417 238023529 241672745 244452477 247359753 252533436 256378174
1384 256378174 254994392 251430283 246675014 243005276 243924370 246738911 251617661 253475189 244175682
1393 244175682 233036995 228773346 225058556 217829227 209010353 198293915 188312302 183809509
1401 183809509 178140869 164511204 148112297 130930662 115784407 106979847 102036953 98454475
1409 98454475 100599289 113381147 132668972 156283140 183276901 214642525 242381325 256440392
1417 256440392 263972054 266890049 270853519 286633968 300805321 299041023 294811726 299544563
1425 299544563 305043449 307006836 305177689 295292377 285065651 282210827 282466412 287329903 287236443
1434 287236443 267102470 244979134 236269722 233833313 237336884 241759529 240269184 237965107
1442 237965107 238410473 239377975 240620384 239758968 231797447 224339714 225719929 228750000 226087093
1451 226087093 226526737 242837429 255757561 243386497 226408730 219245186 218784561 228344193
1459 228344193 243056297 261797428 276649704 275043964 269807339 270606270 274353752 281902790
1467 281902790 291095963 302645454 308792839 296213627 282316933 283719292 289471149 293310642
1475 293310642 297791252 303778877 310072422 316158524 320838470 321016541 321870079 329562683 338038216
1484 338038216 342915306 345333824 345598221 341831665 328029404 316876640 323092461 334567299
1492 334567299 346073875 351681709 339451790 322181473 310116539 298972607 287123451 276838303
1500 276838303 269471893 266140709 272834778 276286125 257058372 239645233 247053623 264304390
1508 264304390 286429634 306402435 310773125 313839436 331619720 345501900 334300766 321752777
1516 321752777 330909729 342638969 344631424 339467545 319356194 303102970 315741310 330795059
1524 330795059 323440781 313753853 316030979 322782059 332860718 341531296 343074074 339294434
1532 339294434 323816757 315463791 341119308 370221634 379391174 373961945 342495193 311926842
1540 311926842 314071178 322852631 318199387 313913822 319727173 327778816 333480835 336743126 333775024
1549 333775024 331087112 336440315 342290649 339040298 340611229 370591393 390384903 353732109
1557 353732109 307208538 284526348 278013229 299867630 324187050 321428299 314710617 321982880
1565 321982880 329212189 327500114 319390526 299088001 282708893 291208992 304274330 309232712
1573 309232712 304111958 273942223 245044231 245161057 255053291 264244080 274187088 282359600
1581 282359600 290213585 299026718 306796074 311224937 314471722 318508377 321594009 321790466 321659546
1590 321659546 324073067 326161880 325332413 323629837 322046738 321146011 322483788 324071426 324404945
1599 324404945 323582878 320460815 317261696 316448441 316155910 315508614 313997746 310334930 305981865
1608 305981865 301230431 298301697 299916992 304865360 317002773 323848953 306660652 288081894
1616 288081894 287812710 295941830 313130608 327359200 321874161 311535358 306037178 304122925
1624 304122925 310990810 316967735 309729805 302425861 306358109 314741135 326560020 335802307
1632 335802307 336060524 327503204 300873756 278036594 285744667 300073395 302236328 303569069
1640 303569069 310464134 318962097 330834389 335278740 313987961 291245461 286940098 295946846
1648 295946846 331670532 358410110 331100464 291236877 265850296 253265610 268050671 288504601
1656 288504601 294123878 295883656 300253391 300244102 286550522 272588959 270836601 274805546 285116920
1665 285116920 292919388 286866417 275063515 258466949 247174492 259419918 271749496 260570297
1673 260570297 244533768 234805832 230249882 236836910 244407425 240926743 237991333 251494408
1681 251494408 256510963 218839874 182201862 190939903 208985329 211214294 209134331 204500923
1689 204500923 201446056 207854500 214221230 213174591 206199169 187487831 171541214 180381298
1697 180381298 185635090 154786348 122286081 119805336 123164654 116911888 106535196 90419054
1705 90419054 74421883 65642357 58743715 49911261 41675329 35516500 30767441 27447701 24977446
1714 24977446 22679329 20864487 19575119 18937349 19300699 20035028 20671606 21075010 20648956 20303965
1724 20303965 21035433 21990776 22430420 23010492 24352074 25817633 27120829 27829170 26458025
1733 26458025 25877714 29267550 34215689 39196968 44729471 49938440 57473660 70934057 86594105
1742 86594105 100984812 116933823 137792587 158519983 174811363 187808762 196004639 203041801
1750 203041801 211878548 223059177 241275558 257043114 258159161 257469902 266692638 277008533
1758 277008533 283589840 286180019 278974533 273786545 285394192 299096832 302447796 303460598
1766 303460598 306547890 310064316 316283703 317858696 302318096 287306061 290746212 299328575
1774 299328575 304758301 309910774 316169262 319713821 314066887 308583488 313904533 319692841 316406727
1783 316406727 312297592 313082466 316820374 325165253 333047409 336257477 333867302 318926582 305291653
1792 305291653 308570385 316558113 321676483 325652122 327959518 327775002 322528114 316932907 315495014
1801 315495014 316267967 319493294 323110580 324761162 325581551 326269608 325779190 322415352 318820000
1810 318820000 317199230 317163467 320016136 322882156 322439194 321331749 321224442 321734924 322896500
1819 322896500 325125923 330678482 334072113 326952934 320189247 325370331 331977844 332559128 329503059
1828 329503059 319855213 312191486 317656288 325588951 327588310 328019371 328626404 328867187 327551842
1837 327551842 328365555 337282639 346244812 349085312 346100311 330835800 317374954 322654495
1845 322654495 331656456 332778931 332709312 335084190 337451477 338141441 338442574 339274635 340074081
1854 340074081 340616684 340803871 340255508 339590530 339216461 339385529 340405960 342514496 346845856
1863 346845856 351011047 353653908 352807274 343271980 333387375 331105003 332386475 336788406 341474991
1872 341474991 342684975 342750092 342823982 342678070 342470894 342192154 341789703 341546288 341938248 342329979
1882 342329979 341608772 341680527 345770607 348804703 345053444 339706879 335749397 334067345 338670502
1891 338670502 343170395 340523224 336705208 336112022 336440315 336791534 337343674 338178406 338686714
1900 338686714 337913055 336978912 336810837 337037086 337933769 338483582 337411423 335763474 333801041
1909 333801041 332603226 333793869 335997353 338958740 340937386 339597473 336466789 330971718 327079048
1918 327079048 331086159 335426331 332679520 328702698 327324638 327206612 328876953 330559959 330105057
1927 330105057 329164276 328916321 328628082 327825317 326908340 326131363 325457802 324810486 324563255 325319748
1937 325319748 326312790 327654114 327310104 321436157 315576077 315424194 316682587 316477547 316228638
1946 316228638 316627274 316982498 316549778 316179504 316790810 317433128 317152500 316877594 317565193 318173409
1956 318173409 317634354 316980362 316968193 317354431 318206310 319346905 321008911 322030563 320530663
1965 320530663 318896523 319268456 320505867 322568893 324292412 323951721 323183289 323230972 323547592
1974 323547592 324019928 324587822 325172195 325714111 326167336 326411743 326096535 325865021 326485863 327230453
1984 327230453 327373734 327672501 329131851 330279350 329688568 328225861 325634003 323855171 325771561
1993 325771561 328304062 328862915 328859558 328871727 328808784 328694344 328760376 329482307 330150833 329902420 329672585
2004 329672585 330426941 331211548 331186752 330973396 330926666 331000099 331209412 331722260 333254318 334176559
2014 334176559 332201233 330019226 330060959 330819130 331674805 332392464 332321625 332085609 332141151 332334290
2024 332334290 332772751 333127022 333003273 332698822 332294235 332042465 332438965 332836876 332618942 332189789
2034 332189789 331649551 331294060 331698189 332124939 331891289 331408997 330756683 330247650 330388565 330676575
2044 330676575 330686798 330690842 330823441 331068039 331669083 331975708 331100235 329996338 329408188 329075584
2054 329075584 328978539 329138031 329854240 330267181 329131851 327901611 328020096 328269005 327672234 326946716
2064 326946716 326527824 326283455 326305389 326356888 326221695 325928192 325314751 324734917 324586639 324574966
2074 324574966 324567070 324473610 324035187 323626289 323616753 323759804 323982697 324129562 323985100 323652992 323099594
2085 323099594 322521439 322161903 321846237 321402779 321065674 321107864 321240425 321254272 321181068 320868721
2095 320868721 320656281 321007004 321394424 321398010 321160545 320527802 319967747 320044289 320312500 320502777
2105 320502777 320650826 320729027 320655365 320224304 319778671 319718361 319665680 319196224 318847179 319170227 319696903
2116 319696903 320165634 320506096 320504189 320327988 320025673 319740067 319619408 319694042 320197830 320666313
2126 320666313 320629845 320337753 319767952 319264889 319288979 319469681 319534302 319649925 319939613 320261955
2136 320261955 320484886 320701828 320972900 321264496 321620712 321866035 321829300 321539154 320772896 320109863
2146 320109863 320232162 320606232 320978889 321188698 320801735 320381622 320459595 320697060 320927849 321163635
2156 321163635 321340332 321515808 321779480 321970215 321908493 321735611 321494102 321300735 321339836 321450462
2166 321450462 321531754 321587334 321544876 321530113 321648827 321888199 322353592 322792511 322903137 322936287 323097229
2177 323097229 323218117 323163261 323038330 322924385 322758179 322434425 322159271 322150459 322266350 322473755
2187 322473755 322664719 322722206 322639008 322284927 321909180 321760902 321708908 321740646 321748276 321540375 321354637
2198 321354637 321474075 321570892 321306953 320994873 320885162 320825119 320691605 320644608 320878029 321165810
2208 321165810 321358185 321419716 321233025 320893288 320425758 319921017 319423904 319093475 319179535 319453716
2218 319453716 319820633 320130348 320124130 320030441 320092926 320006599 319319248 318714142 318982353 319346199 319158325
2229 319158325 318816414 318487396 318213940 318111191 318125954 318289280 318461647 318500996 318443298 318245888
2239 318245888 318002472 317809830 317612877 317318916 317135086 317360401 317623138 317600479 317442665 317061424
2249 317061424 316847801 317363739 318006516 318323860 318423996 318190575 317843437 317586422 317350388 317106018
2259 317106018 316937675 316940308 317049980 317326317 317490349 317159882 316704025 316395035 316141129 315957298
2269 315957298 315793762 315597305 315389862 315221062 314951420 314388752 313740730 313030968 312616825 313039780
2279 313039780 313771248 314469109 315114975 315556049 315852890 315978775 316040993 316103210 316267014 316676865
2289 316676865 317264328 318100452 318910122 319412231 319694996 319646606 319584846 319876900 320260773 320400009
2299 320400009 320885162 322426796 324325333 326260338 327801704 328234444 328092575 327751617 326969604
2308 326969604 325237503 323728333 323534470 324388962 326736679 329532623 331960678 333777199 334373016
2317 334373016 334028473 332470665 330749054 330090752 329689751 328903656 328467865 329524040 330209007
2326 330209007 328958054 326016655 319679031 314232826 314822426 317171574 318824768 319461098 316767464
2335 316767464 314265022 316167603 318083534 316797028 312994232 306431046 296680679 279064903
2343 279064903 266090870 271073341 286908379 314995041 343138695 358263969 364409218 358481178
2351 358481178 348798294 343757858 340026627 338028679 334887276 326840897 316967735 306541443
2359 306541443 297213554 291723022 288078308 285314789 283089161 280632248 278254738 275957108 273897400
2368 273897400 271969070 270963898 272275925 273990631 274099827 274277458 275823593 277849674 279789200
2377 279789200 281974564 284658432 287511349 290228844 292986870 296061287 298844566 300682068 301991234
2386 301991234 302899590 303619156 304522991 305254707 305464268 305504322 305554867 305780411 306600800 307426682
2396 307426682 307700386 307746658 307698479 307573547 307418346 307277451 307251701 307215214 306985378 306833496 307006836
2407 307006836 307391891 308111668 308701515 308545341 308219910 308115482 308174133 308651695 308995972 308502674
2417 308502674 307883034 307699203 307693481 307858944 308004150 307810555 307648888 307883263 308212280 308421860
2427 308421860 308613548 308856487 309032440 309005966 308896790 308744202 308651199 308776627 308992386 309290886
2437 309290886 309467793 309136868 308832893 309079170 309522400 310071220 310461521 310241699 309879780 309762478
2447 309762478 309680710 309543381 309382210 309134254 308989048 309256077 309509754 309333801 309007645 308621883
2457 308621883 308325539 308371544 308536530 308710327 308803787 308624744 308368683 308204651 308016300 307700386
2467 307700386 307386627 307173004 307051182 307120800 307155609 306863556 306540012 306411018 306389809 306498299
2477 306498299 306633472 306747437 306695709 306151619 305611610 305621147 305703888 305499077 305202961 304865112 304561386
2488 304561386 304460754 304330597 303853760 303452263 303609619 303824196 303629875 303400040 303411961 303487301
2498 303487301 303626537 303570023 302820435 302090645 302110443 302330017 302408943 302446842 302400818 302357197 302450180
2509 302450180 302490234 302260170 301975727 301840305 301672211 301289082 300896416 300641060 300515900 300664425
2519 300664425 300781250 300514221 300147057 299841404 299611568 299552193 299583206 299625874 299767265 300172577
2529 300172577 300525436 300446281 300288677 300373554 300416718 300112247 299844742 299983978 300266037 300648689
2539 300648689 300833702 300304413 299672604 299457550 299418449 299509277 299662361 299797535 299904594 299922218
2549 299922218 299923172 299966335 300030231 300183525 300213814 299768219 299336910 299462318 299632549 299387703 299113750
2560 299113750 299118042 299176445 299159775 299087753 298936844 298707962 298272858 297993889 298336983 298861980 299276829
2571 299276829 299600372 299737453 299735546 299579144 299358597 299149513 298979282 298889885 298909912 299182415 299404621
2582 299404621 299224377 298930168 298686752 298511276 298537483 298577309 298415413 298266411 298341026 298434486 298364868
2593 298364868 298274517 298181763 298273563 298888931 299586525 299996853 300240288 300313721 300218353 299902687 299519062
2604 299519062 299190521 298952827 298912773 298976898 299081326 299243202 299488544 299723625 299853096 299906731
2614 299906731 299857368 299780121 299767017 299738159 299643040 299483299 299223671 298922062 298609734 298331490 298085690
2625 298085690 298041344 298531532 299062004 299188614 299093723 298684597 298340073 298535118 298887253 299163094
2635 299163094 299389114 299483299 299537182 299678802 299715042 299282074 299017906 299721241 300545464 300850143
2645 300850143 300815582 300331593 299627533 298746586 298136711 298442364 299115658 299889336 300564766 300823936
2655 300823936 300754318 300143013 299572945 299722672 300088882 300426254 300638199 300424347 300148487 300151596
2665 300151596 300199986 300110588 300071716 300288200 300524483 300579300 300553799 300463448 300363770 300406227 300316334
2676 300316334 299650917 299064407 299286366 299644947 299629936 299485207 299268246 299027672 298863640 298678875
2686 298678875 298338661 298054695 298004379 298153400 298637867 299120903 299240341 299205055 299118271 298932552
2696 298932552 298594952 298224449 297987461 297685623 296957016 296457062 296989670 297745934 298115253 298304787
2706 298304787 298268795 298155060 298171768 298089504 297615280 297144890 297025909 297109833 297476768 297786942 297614098
2717 297614098 297295570 297005424 296805859 296956062 297039509 296562920 296015511 295763493 295679817 295787334
2727 295787334 295999527 296319008 296499729 296156158 295707474 295501709 295366058 295245895 295134068 295000305
2737 295000305 294857750 294676552 294551849 294668674 294727554 294342270 293956032 293978214 294124374 294291267
2747 294291267 294343719 293930779 293594131 293985844 294421921 294339905 294026146 293452034 292999268 293170929
2757 293170929 293572197 293933392 294379711 295123100 295631886 295204163 294560204 294286499 294081459 293836117
2767 293836117 293556690 293122292 292802811 292914619 293194542 293489227 293782959 294033775 294164886 294051647
2777 294051647 293795586 293392906 293033600 293014297 293008327 292702675 292349586 292072525 291943073 292219162
2787 292219162 292463074 292174568 291798115 291736832 291610947 291041374 290427685 290026665 289884796 290275345
2797 290275345 290771713 291053543 291075478 290502777 289882660 289760361 289806843 289857140 289961338 290174713
2807 290174713 290313244 290128231 289866924 289762020 289605370 289125214 288744926 288998375 289281368 288954258
2817 288954258 288654327 288986206 289405098 289499512 289472103 289415359 289246788 288847446 288416862 288158894
2827 288158894 287938595 287619820 287407875 287555923 287783146 287889481 287883987 287637939 287364731 287351379
2837 287351379 287246475 286658764 285994301 285614491 285261154 284829140 284219265 283139458 282061806 281480789
2847 281480789 281034698 280504951 279956818 279308319 278780937 278720856 278671989 278181076 277583847 277121773
2857 277121773 276623249 275911560 275241375 274917603 274610996 273979187 273363113 273034821 272855282 272833824
2867 272833824 272796402 272635937 272158852 270856380 269565105 269178391 269017448 268614044 268227100 267982006
2877 267982006 267810822 267832279 267609119 266473045 265232315 264606476 264191628 263827324 263500443 263037910
2887 263037910 262757072 263035297 263519516 263982048 264423370 264782677 265013218 264965286 264883995 265101662
2897 265101662 265206814 264737358 264176140 263901711 263763657 263748169 263823738 263932705 264139404 264474640
2907 264474640 264979362 265756378 266650677 267538795 268426418 269346008 270092487 270397186 270480156 270413628
2917 270413628 270371666 270722618 270953178 270421257 269880295 270041237 270388603 270706654 270805359 270281792
2927 270281792 269557476 269028435 268366814 267224083 266057968 265450706 264679909 263051033 261060486
2936 261060486 258944283 256788731 254852295 252851257 250629654 248059998 244786034 241337776 238193512
2945 238193512 235150814 232130527 229238510 226543903 224077454 221972466 219988098 217800140 215789318
2954 215789318 214257469 213116646 212429276 212044716 211858521 211792717 211710453 211682091 211630096 211860180
2964 211860180 212816963 214004517 214950790 216027489 217387676 219211807 222055664 224946499 226849327
2973 226849327 228505611 230407715 232267380 233886948 235485306 237262249 239077339 240870705 242599258
2982 242599258 244301071 245671272 246138802 246538162 247669697 249063969 250685463 252031326 252271423
2991 252271423 252349854 253049126 254020691 255343666 256516685 256828785 256984940 257558594 258233795 258851776
3001 258851776 259510994 260211716 261087189 262445450 263760796 264564514 264991760 264860153 264652481 264787903
3011 264787903 265273571 266429176 267732849 268661499 269535065 270542622 271551361 272523155 273361683
3020 273361683 273916721 274309387 274520397 274820099 275530338 276476860 277780304 278875351 279063950 278864384
3030 278864384 278452148 278156757 278582802 279079914 279151192 278939018 278278122 277593136 277432213 277259350
3040 277259350 276606331 275816917 275165081 274389496 273278008 271956444 270366192 268846512 267765274
3049 267765274 266976833 266460896 266206017 266233444 266424656 266610374 266962528 267708778 268511295 269115219
3059 269115219 269498825 269501209 269282112 269002914 268496990 267399788 266463757 266504765 266966343 267643452
3069 267643452 268294811 268476257 268588791 269015312 269362926 269333363 269025326 268329849 267570267 266990891
3079 266990891 266716480 267092705 267697334 268101215 268669357 269827843 270963898 271411419 271755943 272470474
3089 272470474 273224831 273985863 274334679 273482800 272502670 272418747 272583961 272821198 272742271 271515617
3099 271515617 270293713 270144463 270488262 271156082 271983871 272766113 273457050 273892879 274219990 274463882
3109 274463882 274820099 275653114 276478996 276824474 277022133 277322998 277498016 277302265 277034035 276929855
3119 276929855 276926765 277097473 277270088 277297497 277175903 276682377 276325455 276701927 277322292 277942429
3129 277942429 278421879 278452644 278292427 278078079 277863979 277654877 277734528 278618088 279612541 280122032
3139 280122032 280367126 280260315 280129910 280357590 280695686 281113148 281340370 280891418 280383339 280392418
3149 280392418 280554543 280667534 280818710 281098843 281294823 281099091 280885925 280998955 281220665 281418571
3159 281418571 281679382 282100906 282517662 282840252 282938232 282507420 281976929 281675110 281599522 281924248
3169 281924248 282445183 283131599 283636322 283561478 283028374 281746387 280553093 280325661 280651569 281714668
3179 281714668 282600174 282148361 281276474 280463696 279862175 279970398 280228386 280094147 280011177 280269146
3189 280269146 280786285 281790257 282639275 282627335 282173157 281314850 280487061 280233383 280265331 280588150
3199 280588150 280861626 280527840 280242195 280702591 281221619 281200886 281071186 281073093 281177044 281575680
3209 281575680 281841278 281382332 280880203 281021118 281197319 280936241 280518761 280006409 279582748 279479256
3219 279479256 279611588 280133476 280560722 280312309 279830456 279351959 278911591 278563976 278484821 278988838
3229 278988838 279710541 280497074 281022072 280746937 280153503 279507866 278915882 278511524 278476486 279345284
3239 279345284 280189991 280082932 279556503 278576622 277911415 278756142 279795876 279934883 279708862 279187679
3249 279187679 278672447 278608322 278630486 278427849 278283348 278423080 278703918 279127350 279484978 279509315
3259 279509315 279377460 279169083 278905869 278638115 278359184 277960300 277798176 278414249 279142380 279453754
3269 279453754 279475441 279044876 278501034 278160572 277927876 277853489 277813187 277698040 277511120 277145615
3279 277145615 276821365 276824951 276849270 276585579 276321888 276261101 276349545 276738892 277012596 276643276 276114464 275732040
3291 275732040 275498161 275579453 275787830 276001701 276187668 276242981 276250610 276246071 276268005 276440144 276540031
3302 276540031 276250839 275978088 276183128 276380768 276111603 275757561 275614510 275477886 275150299 274904480
3312 274904480 275051117 275276184 275383472 275329113 274776230 274404297 275043964 275903931 276523113 276738892
3322 276738892 275948296 275008202 274682999 274645081 274945984 275211105 274971733 274560204 274130344 273747215
3332 273747215 273558617 273470154 273403168 273457756 273777008 274150124 274435520 274566650 274399033 274022579
3342 274022579 273221970 272766838 273723602 274983883 275797615 276153793 275503159 274707069 274679661 274711609
3352 274711609 274170399 273738632 274040947 274615765 275298347 275819302 275742760 275401840 274983177 274487724
3362 274487724 273863564 273454666 273779869 274261246 274351845 274477234 274978867 275562057 276105652 276430359
3372 276430359 276187897 275761127 275403748 275154343 275238514 275347710 275161266 274938354 274915924 274839172
3382 274839172 274458160 273992538 273433685 273216248 274132957 275099983 275100231 274726391 274168739 273615837
3392 273615837 273425579 273280144 272872925 272527218 272644043 272683144 272018909 271307220 271197090 271081924
3402 271081924 270429840 269664536 268975487 268530369 268751373 269062042 268920422 268644104 268454323 268097401
3412 268097401 267292023 266340027 265590439 264619350 262920380 261088371 259441376 258303642 258403778
3421 258403778 258843651 258939743 258774033 258091450 257217178 256341209 255611420 255253315 255223503 255640507
3431 255640507 256243706 256779671 257343521 257891884 258583546 259712944 260826836 261425018 261942387 262882957
3441 262882957 263538589 263240089 262373695 260586739 259426594 260975609 263275623 264970551 266333580
3450 266333580 267100563 267523994 267737389 267832031 267927895 268071651 268428574 268759727 268860588 268790474
3460 268790474 268407097 268107891 268454075 268809547 268482208 268197784 268633842 269241810 269682655 270003319
3470 270003319 270047665 270083904 270290852 270778179 272029400 273100128 273062706 272348633 270692101 269256592
3480 269256592 269495010 270273437 271067619 271498680 270644188 269607773 269305706 269376984 269878387 270471096
3490 270471096 270881882 270969162 270202408 269474754 269553413 270283222 272435665 273994923 272534847 270054588
3500 270054588 267407646 265603294 266690025 268400192 269103050 268933773 266876450 264752388 264337540
3509 264337540 264748802 265877953 267173996 267988205 268504372 268469582 268542061 269680023 270727634 270731697
3519 270731697 270040283 268437157 266660213 265614510 264581909 262906075 261305332 260137787 259825706
3528 259825706 261459122 263392677 264250526 264312267 262990475 261507759 260761032 261139870 264143219
3537 264143219 267337570 268533936 268495083 267193317 264809837 260847816 257310638 256405830 257021179
3546 257021179 259551277 261680126 260282516 258180847 257115364 257207146 259836197 262964249 264819622
3555 264819622 265980492 265805473 266180267 269571075 273593426 277695885 278844357 272385368 262625217
3564 262625217 250373363 241463890 244738808 251981010 257788887 262555599 264414787 264741421 263978481
3573 263978481 263054123 263210068 263945580 264890442 266894817 271212578 276262054 282066116 285063019
3582 285063019 280480385 271972885 259374619 249374161 251013756 257063866 264199028 269749165
3590 269749165 268281937 264757385 262434959 260983467 261877060 262958527 261864185 260686646 260358334
3599 260358334 261992931 268630028 275422821 278497467 277971039 270740738 262588978 258804798 257763634
3608 257763634 260661354 264325371 264959812 265629768 269906044 272473812 267719269 260107994 250529766
3617 250529766 244095325 247726669 256878853 271162987 285029640 293768158 294471512 279178143
3625 279178143 258338699 237199554 223408222 232192993 246056328 250151157 251752377 253118744
3633 253118744 254448891 257293472 259853363 259678612 260270119 264824142 271804581 281913528 291629066
3642 291629066 299680710 300013771 281556606 258089066 238654613 226388206 230700264 241807461
3650 241807461 254992008 264465809 258992424 250195732 246481171 246266594 252568474 259994736 262737751
3659 262737751 265058517 269487858 275405407 284965992 292373657 291394234 285495758 273109436 263111343
3668 263111343 267792702 275338402 279551506 275866985 249405136 224913368 229014168 241200924
3676 241200924 248269806 254933834 261056900 267982483 278323650 288133392 295507660 296930790
3684 296930790 285619011 269472351 252340317 239588737 240643730 247172127 253886223 261074295
3692 261074295 267453423 272448540 274698982 275278816 275442848 273286343 264696121 257550011 260049820
3701 260049820 267109871 278031826 287853012 291118393 288604736 277348747 263115654 249314079
3709 249314079 240048409 242485275 250843048 263209114 275141716 280530453 282466660 281705132
3717 281705132 279143562 275843620 272065887 268162003 264920235 262868652 263138542 267225266 274561653
3726 274561653 288099060 298775444 296200523 287308922 274991512 260985851 245864391 236012230
3734 236012230 239831696 251843452 272832146 292404900 299305191 296906242 280940056 263070583
3742 263070583 253420830 252343903 271511803 287090073 270567169 247645855 235832443 231201401
3750 231201401 237843513 249215355 261603127 270606766 267860889 261545906 256662369 254382610
3758 254382610 259257545 266149521 271762371 275121918 272776604 268861046 267556667 265270004 257726440
3767 257726440 251148453 251264095 255279541 263768425 272354126 276367912 277257442 274399757 269336224
3776 269336224 261978149 256590118 259767532 264426231 264637470 263528347 261804810 260799179 262766361
3785 262766361 265642891 267822266 270186195 273325443 276504040 279423714 281361580 280844917 279821625
3794 279821625 280490646 280625572 279398918 274810066 260623455 248715878 253419876 261132011 261934280
3803 261934280 259102345 249039879 242441177 252884636 268120289 280679226 289794693 291389236
3811 291389236 287924767 278242340 269125214 269865990 271777382 268766403 262341270 248142471 237678757
3820 237678757 245778809 258120537 263899574 267390251 268505573 269523621 273949146 278014183
3828 278014183 277805805 277260780 280614853 283055305 280845642 274990807 263257027 251622677 246189117
3837 246189117 244350204 246289253 249735603 251307964 254518738 262111187 273010254 289007664
3845 289007664 304243317 315223217 316640854 298418274 271372795 238055229 213184357 218689919
3853 218689919 235487709 252216110 267636070 275890350 279471169 278202782 274231434 268666039
3861 268666039 264440536 266242256 269918442 274273148 275121689 264411697 252548695 248546600
3869 248546600 248527050 252231827 257812500 263211250 268797646 275671959 279581795 274062386 266847839
3878 266847839 264497757 264070282 266022205 266716003 259633541 253870010 259742508 267066956 268186340
3887 268186340 265836239 257482052 251274338 257308006 267213345 276385784 283622513 285958519 284072647
3896 284072647 276192665 266703835 260247955 254282475 246618500 240834465 240384579 243449211 250482559
3905 250482559 258115540 262447128 265524635 268143883 270155430 272207737 272701263 269498348 264859676
3914 264859676 259632339 255918026 257301331 260178089 262088299 263180504 262217045 260895252 260364304
3923 260364304 261027565 264903545 268296242 267480373 264560699 259534359 254997025 254002571 255172501
3932 255172501 258860359 262921562 264909744 266082287 267226696 267303238 264823189 261918545 260262012
3941 260262012 259740353 261721840 263432026 261576653 259081612 257958641 257653713 258554459 259847164
3950 259847164 260801792 261553288 261923313 262121201 262345543 262446632 262384644 262026558 260944595 259981632
3960 259981632 260072479 260511398 260911465 261250973 261285553 261294136 261492729 261825562 262515297 262941132 262232780
3971 262232780 261359215 261112213 261150837 261552582 261853447 261476994 260836372 259988308 259424210 259847641
3981 259847641 260676384 261607895 262505302 263168106 263481617 263153076 262515545 261770248 261018982 260393620
3991 260393620 260004520 260101795 260397682 260715008 260971298 260925293 260876427 261198044 261425743
4000 261425743
##END=$$ End of the data block
