##TITLE=$$ Begin of the data block
##JCAMP-DX=5.00 $$ ACD/SpecManager v 10.08
##SPECTROMETER/DATA SYSTEM=16PC
##DATE=Mon Sep 16 15:21:03 2013
##DATA TYPE=INFRARED SPECTRUM
##DATA CLASS=XYDATA
##ORIGIN=
##OWNER=
##NPOINTS=3601
##FIRSTX=400.00000000
##LASTX=4000.00000000
##MAXX=4000.00000000
##MINX=400.00000000
##MAXY=37.16030121
##MINY=3.93421650
##XFACTOR=1.0000000000
##YFACTOR=0.000000100000000
##FIRSTY=20.11330032
##DELTAX=1.00000000
##XUNITS=1/CM
##YUNITS=TRANSMITTANCE
##XYDATA=(X++(Y..Y))
400B01133003J5665779J2762299j82858J806508K0813446K3526916J5614510P714500
408B98854103j0925751p934570K4870625K2385578j7167321k1575202L570327Q420697
416C00498486j330128J387348J7008534J6720046K058754m310607q290520q935452
424C14806461o165981j247635J0231018J1888962M465370J381836j273842j274109
432C32812080L711205K132416o700516q478394o242523k138138P726670R926071N886345
441C38635216L327827j96457k620697n086670n096435k343407n54771K806167J318207
450C30188980o517181q285027o903877l114700O540298Q969040O288300L123054l876228
459C26412659n937577m437904k644539J779328K750854L12347L76931K982597K060928
$$ y = [201133003, 216798782, 229561081, 229378223, 231184731, 251998177, 275525093, 291139603, 298854103, 287928352, 279993782, 304864407, 327249985, 310082664, 288507462, 292077789, 300498486, 299168358, 300555706, 317564240, 334284286, 336343040, 332032433, 323741913, 314806461, 308640480, 307392845, 317623863, 329512825, 333978195, 335360031, 334086189, 332812080, 336523285, 338655701, 331955185, 323476791, 317234268, 315096130, 322822800, 332748871, 338635216, 341963043, 341766586, 339145889, 334059219, 328962784, 326619377, 326064606, 328870773, 330188980, 323671799, 315386772, 308482895, 305368195, 311908493, 320877533, 327165833, 330288887, 326412659, 320475082, 316037178, 313392639, 315171967, 317922821, 318235168, 318612099, 321594696, 323655624]
468C23655624k384681m302502m776249n523186o395836o269207n294799l994942j852989
477B82861233m16279J000404J201153q36849J71184M736195N528202L524304K143135
486B99912682J27563r13620k190819m73022N749931P205238O024361K954025n556602
495C12839737o054154J224747L772278M771233L997802Q55446k047310p562160o891251
504C04906368N23815L648987N517731N029678J222115r55811l950844k927055L472328
513C16487312M980812L126145K063751k06490J60218M280357L841629j484642k072792
522C31176300J018028K395401L919106L539352P50504l78113n74341r98993k125969
531C38721275q99315M080048M158249n88379j813431n10444j051903l526459l210068
$$ y = [323655624, 321270943, 316968441, 312192192, 306669006, 300273170, 294003963, 288709164, 284714222, 282861233, 282444954, 283445358, 284646511, 283809662, 283980846, 288717041, 294245243, 297769547, 299912682, 300040245, 299126625, 296935806, 296462784, 302212715, 309417953, 315442314, 318396339, 312839737, 306785583, 308010330, 311782608, 316553841, 320551643, 321407089, 319359779, 311797619, 304906368, 305430183, 309079170, 314596901, 319626579, 320848694, 319892883, 315942039, 313014984, 316487312, 321468124, 324594269, 326658020, 326451530, 326611748, 330892105, 334733734, 333249092, 331176300, 332194328, 334589729, 338508835, 342048187, 342798691, 342420578, 341846237, 340847244, 338721275, 337821960, 341902008, 346060257, 345471878, 343658447, 343148003, 342096100, 338569641, 335359573]
540C35359573k09350J175651K529145J811523k691765k083282M964332M242668m489173
549C40609322o062737k642670p40966K345771K314797k089234j542816M261742M768600
558C41221809J384735r62715m569320n180588l118286j352310J713752K663155K020569
567C33820801J103897j515617j443139J604538K097855P49588K35291j61629k51770
576C36239815J71661R1324j73836q85467l438225j995354M834671N647660J670608
585C42162857o01311m090309l604660J881867L072242J052628P75566J502991J231460
594C43383331K67029o12259k422600j878013K188453J821976l570785l663063J244545
603C36758614K027282k10533p64389n41191o18706r42230o55174L40957P92733J078834
$$ y = [335359573, 335150223, 336325874, 338855019, 340666542, 337974777, 335891495, 340855827, 345098495, 340609322, 334546585, 331903915, 331162949, 333508720, 335823517, 333734283, 332191467, 336453209, 341221809, 342606544, 341643829, 337074509, 331893921, 328775635, 327423325, 329137077, 331800232, 333820801, 334924698, 333409081, 331965942, 333570480, 335668335, 336417923, 336653214, 336491585, 336239815, 336411476, 336502800, 336328964, 335443497, 332005272, 330009918, 334844589, 340492249, 342162857, 341561546, 337471237, 333866577, 335748444, 338820686, 339873314, 340648880, 342151871, 343383331, 343650360, 343038101, 340615501, 338737488, 340925941, 342747917, 339177132, 335514069, 336758614, 338785896, 338575363, 337810974, 337269783, 336651077, 335708847, 335053673, 335394630, 336187363, 337266197]
613C37266197R36280K29110k36244j206169n03540K485733L125419J982232J423378
622C45502396O86149M51317R89685N34783j195908j305580J65710M79203L74069l69301
632C46312523k504578k797851j666069o75927J078835J540222J063080K84691j695175
641C40939751j915436n73883J58806J333465R14307j867027j903534N06401J449089
650C39041939K054939J714249j25885o46363k18658j77383k6436m19159j912346j627693
660C37657204N59120J271705o77833K837906J7089119J2865791j3067703j8561859
668C39973450j0256539l744354R428520J1036148N90058j733055J094589P81517j585465
677C45584869k062797j526375m17709K409477K808342Q64029L83148Q47321N19981
$$ y = [337266197, 338202477, 338431587, 338195343, 336989174, 336485634, 338971367, 342096786, 344079018, 345502396, 346188545, 346639862, 347629547, 348164330, 346968422, 345662842, 345828552, 346307755, 346681824, 346312523, 343807945, 341010094, 339344025, 338668098, 339746933, 341287155, 342350235, 342634926, 340939751, 339024315, 338450432, 338609238, 339942703, 340857010, 338989983, 337086449, 337592850, 339041939, 341096878, 342811127, 342685242, 342038879, 341820221, 341642838, 341616402, 341197243, 339284897, 337657204, 338216324, 339488029, 338810196, 341648102, 358737221, 371603012, 358535309, 339973450, 329716911, 325972557, 335401077, 346437225, 347027283, 345294228, 346388817, 347170334, 345584869, 343522072, 341995697, 341577988, 343987465, 346795807, 347659836, 348042984, 348890305, 349410286]
686C49410286n47638q24699j49002p00722k558212l230324k414246l815155p458229
695C27712059r540081j1691341j1193505p860908n156269j917591O66847L065586M590988
704B88675785N127430N822182O593704O619930O075382N081635L272552J990815J875610
713C31135025r72977p094154j0435104j3610115j2217045o083489l03020R298076J1115323
722C00832520N618801K531757o69479l617039p279396q150807p169971m088402L361225
731B81369209N859604M973183L752937N23110j066933j710415k285480k097607l047466
740B86270142m648686o949673j0292758j3262272j7536641j7820110j4262695j1563530
748A89933777q578530n186805q77152K183686M914054N806427M163743M278907N569458
$$ y = [349410286, 348862648, 348037949, 347888947, 347188225, 344630013, 341399689, 338985443, 335170288, 327712059, 318171978, 306480637, 295287132, 287426224, 282269955, 280352364, 281019211, 284084797, 288675785, 293803215, 299625397, 306219101, 312839031, 318914413, 323996048, 327268600, 329259415, 331135025, 330162048, 323067894, 312632790, 299022675, 286805630, 280722141, 280419121, 289717197, 300832520, 306451321, 308983078, 308313599, 304696560, 297417164, 289266357, 282096386, 278007984, 281369209, 287228813, 292201996, 295954933, 296478043, 295411110, 293700695, 291415215, 289317608, 286270142, 281621456, 274671783, 264379025, 251116753, 233580112, 215760002, 201497307, 189933777, 181355247, 176168442, 175291290, 177474976, 182389030, 188195457, 192359200, 196638107, 202207565]
757B02207565O069184O317615O121159N129337M935742N270729N617141O362915O470909
766B54502296O141892N610008M552117M024734L844757L685227L630409L670444M063130
775B93725014L785133K840519K233753J772156J219273M20570K27222O91166P50790
784C07665596N60036N62668Q03222O59485N6019q6308K01226J19209l7422o51131j847038
795C08005562k743721l849030m016151l144989k783280k146968k825985n687218n676518
804B75131702k810230k079010l031502k484321o71387J56403m02451J506081P002372
813B72317657P749062M542351K532253K52018j582394l084659m515877o172428o610394
822B65427589n934486n171776m135132k548923O5555J516114K945671J973152j945267
$$ y = [202207565, 208276749, 214594364, 220715523, 225844860, 230780602, 236051331, 241668472, 248031387, 254502296, 260644188, 266254196, 270806313, 274831047, 278675804, 282361031, 285991440, 289661884, 293725014, 297510147, 300350666, 302584419, 304356575, 305575848, 305996418, 306223640, 306914806, 307665596, 308225632, 308788300, 309591522, 310251007, 310307026, 310220718, 310421944, 310541153, 310503731, 309852600, 308005562, 305261841, 301412811, 297396660, 294251671, 291468391, 289321423, 286495438, 280808220, 275131702, 272321472, 270242462, 267210960, 264726639, 264055252, 264211655, 263809204, 265315285, 272317657, 280066719, 284609070, 287141323, 287393341, 285810947, 282726288, 278210411, 272037983, 265427589, 259493103, 254321327, 250186195, 247637272, 247702827, 249218941, 252164612, 254137764, 252192497]
831B52192497m255771n875588p693043j0110626j0632515r791145p953644m013767
839A91866398k031574j680832k06490J968632L778934N984078O608238N441437N297661
848B17026482N788307N652199N235443M412403K414226K440682M845619N013466L414402
857B56243229K780437K537957K248535J886368J991500K645741K978573L328323L210297
866B79850960K576103K102852J450786J301518J976967J504669n21889n07126J515389
875B91250229K083549K089501J426697n90325j113663n77449r2755J092682J077652
884B96646118p4158p19299j435757j555194j058121o91643O1760j23024j280079j951465
894B87819138k666932k765197k084732j935711k036343k203693k601624k758732k622146
$$ y = [252192497, 247936726, 242061138, 234368095, 224257469, 213624954, 203833809, 195880165, 191866398, 189834824, 188153992, 187947502, 189916134, 193695068, 199679146, 206287384, 211728821, 217026482, 222814789, 228466988, 233702431, 238114834, 240529060, 242969742, 247815361, 252828827, 256243229, 259023666, 261561623, 263810158, 265696526, 267688026, 270333767, 273312340, 276640663, 279850960, 282427063, 284529915, 285980701, 287282219, 289259186, 290763855, 290241966, 289734840, 291250229, 293333778, 295423279, 296849976, 296259651, 295145988, 294568539, 294475784, 295568466, 296646118, 296571960, 295852661, 294416904, 292861710, 291803589, 291111946, 291173706, 291050682, 289770603, 287819138, 285152206, 282387009, 280302277, 278366566, 276330223, 274126530, 271524906, 268766174, 266144028]
903B66144028k877941l781796l627300k574215j690617l61194J9302n92461o30626
912B50027180m26998k21024j16577N38101K149811K437591J499672J220932J351128
921B58459816J006126K31495k73227o79741j000862j311074j300087p10258q84056
930B53538132j882325k119293j527557j962891l735771l751049k041569j573810j812687
939B33131180j933098k147923k431621k964974l053665k780208k509594j982689j873741
948B11453667k018929k401581l343105l574619l016224l259411m379997m484177l704300
957A81271324l406772l253937l233204l663769l283977k235413j213303K69394R56078
966A62206421Q26340J217613K180099K173424J359215O31580m90436r79653p24067
$$ y = [266144028, 263266087, 259484291, 255856991, 253282776, 251592159, 251230965, 251250267, 250657806, 250027180, 249600182, 249379158, 249262581, 249800682, 251950493, 254388084, 255887756, 257108688, 258459816, 259465942, 259697437, 259424210, 258744469, 257743607, 256432533, 255132446, 254422188, 253538132, 251655807, 249536514, 248008957, 246046066, 242310295, 238559246, 236517677, 234943867, 233131180, 231198082, 229050159, 226618538, 223653564, 220599899, 217819691, 215310097, 213327408, 211453667, 209434738, 207033157, 203690052, 200115433, 197099209, 193839798, 189459801, 184975624, 181271324, 177864552, 174610615, 171377411, 167713642, 164429665, 162194252, 160980949, 161250343, 162206421, 163032761, 164250374, 166430473, 168603897, 169963112, 170594692, 170104256, 169124603, 168400536]
975A68400536j199723k404709k873649k752304k924443l444433l213405k155781j672745
984A45759344j477241j316309j350642j191377j111508m07934R69172K114296L575563
993A45563364M065514L051519L949165O495476Q324146J0440121J1189919J0414848
1001B03494072J0401001J0933647J0585556R420147Q607864Q052578O967793N475044
1009B73937702L872166J478901P16915J655579J593360J035691O59713M47026k07424
1018B85189629j601944j941185j616249q59986J340161J166095j801719k067566j00861
1027B77706375M78993M70161K97546m32720n71251m03652O2943J395931J330147q2493
1037B80251980p86534j539478j369228K09560K79904q93364j456013j753330k259026
$$ y = [168400536, 167200813, 164796104, 161922455, 159170151, 156245708, 152801275, 149587870, 147432089, 145759344, 144282103, 142965794, 141615152, 140423775, 139312267, 138904333, 139873505, 141987801, 145563364, 149628878, 152680397, 156629562, 163125038, 171449184, 181889305, 193079224, 203494072, 213895073, 224828720, 235414276, 244834423, 253442287, 261494865, 268462658, 273937702, 277809868, 279288769, 280005684, 281661263, 283254623, 284290314, 284950027, 285397053, 285189629, 283587685, 281646500, 280030251, 279170265, 280510426, 281676521, 279874802, 277807236, 277706375, 278185368, 278655529, 278953075, 278520355, 277949104, 277545452, 277608395, 279004326, 280334473, 280251980, 279465446, 277925968, 276556740, 276766300, 277046204, 276152840, 274696827, 272943497, 270684471]
1046B70684471k952576l443718l439655m503956o930599p981548p972946q381367r099960
1055B15978146r079228q600693p588386n597611m485130m093876l197918k026787q88595
1064A70419922N07126J304855J636753J829147J729966J619091J243839J333237K049446
1073A83673382K012729J226902J053563J288414J384983J780986J268616n09014r17683
1082A92262878k72502N1746O23455N40981q7509p94182k062797k429238k048969j764297
1092A84019566j063347j152745k112159k416382k316704k335548k272835k406845k772808
1101A65170193k951145l054858l051519k789736k908945l406048l656864l993273l715515
1110A35642290k550363k292872k647400l004074l801584l895760l399610l005028k385616
$$ y = [270684471, 267731895, 264288177, 260848522, 256344566, 249413967, 241432419, 233459473, 225078106, 215978146, 206898918, 198298225, 190709839, 185112228, 180627098, 176533222, 173335304, 171308517, 170419922, 170927048, 172231903, 173868656, 175697803, 177427769, 179046860, 180290699, 181623936, 183673382, 185686111, 186913013, 187966576, 189254990, 190639973, 192420959, 193689575, 193180561, 192262878, 191990376, 192042122, 192665577, 193206558, 193119049, 192324867, 190262070, 187832832, 185783863, 184019566, 182956219, 181803474, 179691315, 177274933, 174958229, 172622681, 170349846, 167943001, 165170193, 162219048, 159164190, 156112671, 153322935, 150413990, 147007942, 143351078, 139357805, 135642290, 133091927, 130799055, 128151655, 125147581, 121345997, 117450237, 114050627, 111045599, 108659983]
1119A08659983k157927k222061k363682k858639k820015k063512k213955l383398l499747
1128H5077047k641678k568006l138304l157139k869606k494096j651049j643658k716303
1137F2197208k589225j333237r45568j086235j120568j201391j352548j943589j475572
1146D9149275L48806Q38518K57016K39372M24862O20126R89199J066208R07421P51972
1156E5592775M80414L31163K13146K50101M65155O38962R49860R01460N13077K02417
1166F0538530k95162l39985Q6785K67505K58684N48363J380682J291037J81436r4890
1176F3822985J48773L10898P52210O31094j48296l62873j66655j68085j09196m13417
1186F4297438j253844j514673j500130j109361o1512M17709M21047Q01325J543522
$$ y = [108659983, 106502056, 104279995, 101916313, 99057674, 96237659, 94174147, 91960192, 88576794, 85077047, 82435369, 79867363, 76729059, 73571920, 70702314, 68208218, 66557169, 64913511, 62197208, 59607983, 58274746, 57329178, 56242943, 55122375, 53920984, 52568436, 50624847, 49149275, 49498081, 50336599, 50593615, 50832987, 51257849, 51877975, 52867174, 53933382, 54840803, 55592775, 56073189, 56404352, 56617498, 56867599, 57332754, 57971716, 58921576, 59823036, 60336113, 60538530, 60243368, 59903383, 59990168, 60257673, 60516357, 61064720, 62445402, 63736439, 63917875, 63822985, 63971758, 64282656, 65034866, 65665960, 65517664, 65154791, 64988136, 64820051, 64710855, 64297438, 63043594, 61528921, 60028791, 58919430, 58857918, 59275627, 59696674, 60497999, 62041521]
1195F2041521J853943J835823J869440J766443J898766K194643K566814L111601L527642
1204H2666636L937482M149676M292011M043341L283262K811193K462387K095700J882076
1213A11623764J278400K02418m74692r94920j264811j158714j276255j482725j719952
1222A04732513k073764k261877k289057k418518k688647k683639k356529k313614k570629
1231H3076239k458811k013922j761913j666069j350880q09908m45843j14202J0014
1240G2464705j02520j61887m80413r9898J134635J643419J711607J777649J632213
1249G9519510J670838J966238J830101J345634Q67129J48773j81675j92404k40088
1258H6734056k38418j78814P7724l3617m72307q35657j511812j350880j83344J63079
$$ y = [62041521, 63895464, 65731287, 67600727, 69367170, 71265936, 73460579, 76027393, 79138994, 82666636, 86604118, 90753794, 95045805, 99089146, 102372408, 105183601, 107645988, 109741688, 111623764, 112902164, 113104582, 112629890, 111634970, 110370159, 109211445, 107935190, 106452465, 104732513, 102658749, 100396872, 98107815, 95689297, 93000650, 90317011, 87960482, 85646868, 83076239, 80617428, 78603506, 76841593, 75175524, 73824644, 73014736, 72568893, 72454691, 72464705, 72362185, 72200298, 71719885, 71619987, 72754622, 74398041, 76109648, 77887297, 79519510, 81190348, 83156586, 84986687, 86332321, 87199450, 87348223, 87166548, 86974144, 86734056, 86495638, 86316824, 86394548, 86360931, 85888624, 85052967, 83541155, 82190275, 82006931, 82170010]
1268H2170010j92404R7513R07421J390934J705885K066374K417326K761364L059387
1277I6383810L464222M116058M300595M005909L992796M199504M109383L684282L592730
1286A31849289L776550L798485L785610L665209L376961L235102L254413L060103K659788
1295A62461510K397785K088070K128601K603302K775898K691269K903461L626824L448963
1304A87125683K245655J923561K125282K373696L203621K951622J342296J140347K196083
1313B06627846K343178K059707J598587O46115K01702N5313M4594L71685L90300J28975
1323B14468002J18256K46525M29859Q00381R12189R05266O62346l8872j92413K3613
1333B18335152L14483J159897R32923l43323j134873k347698j892795R47952J210670
$$ y = [82170010, 81977606, 82075119, 82982540, 84373474, 86079359, 88145733, 90563059, 93324423, 96383810, 99848032, 103964090, 108264685, 112270594, 116263390, 120462894, 124572277, 128256559, 131849289, 135625839, 139424324, 143209934, 146875143, 150252104, 153487206, 156741619, 159801722, 162461510, 164859295, 166947365, 169075966, 171679268, 174455166, 177146435, 180049896, 183676720, 187125683, 189371338, 191294899, 193420181, 195793877, 198997498, 201949120, 203291416, 204431763, 206627846, 208971024, 211030731, 212629318, 213275433, 213477135, 213532448, 213577042, 213948727, 214339027, 214468002, 214586258, 214832783, 215262642, 216063023, 216975212, 217880478, 218542824, 218503952, 218311539, 218335152, 218649635, 219809532, 220742455, 220399132, 219264259, 216916561, 215023766, 215971718, 217182388]
1342B17182388q75473j264324n25474m27952o54221p05967o02722p67460j257191j421451
1352B08680153j382599j304378j137734r15527l20683n91736j723060k498627l527641
1361A95278168l589859k871514j848716L04470P59601o29425m49409J184692J317253
1370A89455261N09987n30720k526760l299484k836685l369103m770507n317936n470028
1379A61844025n118142m101514l171921j707316j446008k824545k361298n61237J112699
1388A41664743L361941M842043O355285O033907K822151K809525O281128O004333J832257
1397A82007313J583576M389534N902996P891655P632008M499206L713131M401913M832516
1406B26853848O254196N400180J703740O95934J997490J592636m63486l78856L476619
$$ y = [217182388, 216306915, 215042591, 214517117, 214089165, 213434944, 212728977, 212126255, 211358795, 210101604, 208680153, 207297554, 205993176, 204855442, 203939915, 203619232, 203027496, 201304436, 198805809, 195278168, 191688309, 188816795, 186968079, 187272549, 188032150, 187402725, 186953316, 188138008, 189455261, 189965248, 189434528, 186907768, 183608284, 180771599, 177402496, 172631989, 167314053, 161844025, 156725883, 152624369, 149452448, 147745132, 146299124, 143474579, 141113281, 140552044, 141664743, 145026684, 149868727, 156224012, 162257919, 165080070, 167889595, 174170723, 180175056, 182007313, 183590889, 187980423, 193883419, 201775074, 209407082, 213906288, 217619419, 222021332, 226853848, 233108044, 238508224, 240211964, 240907898, 242905388, 244498024, 244034538, 243655682, 247132301]
1415B47132301P87964r773254j2581101r859314q339176m429111n767327j3850212
1423A83320770j5056152j0333052r512663j1144638j1200666j0884524r411096o263018
1431I9514961m296541k804041j762867j560211o70671J072645J473427P35521K38657
1440I1940880o09636q20876k58207m57525j382113j644850j627445j193285j71661
1449H3775282O14881J515389J955271K158403J801491N42164P0095O4134J18733N31912
1459I3147755N13792o3658J01566Q60691J504422K447366K738953K645492K051831
1468A05948210R80139n45025m187107l317118K876758M516125L059149K550840J969576
1477A13851547J356125M82321K18391M29631P82489J559019J964331K038479K413511
$$ y = [247132301, 247920265, 238147011, 225565910, 215706596, 207367420, 202938309, 197170982, 183320770, 168264618, 157931566, 148418903, 137274265, 126073599, 115189075, 105777979, 99514961, 95218420, 92414379, 90651512, 89091301, 88420630, 89493275, 90966702, 91702223, 91940880, 91331244, 90510368, 90252161, 89794636, 88412523, 86767673, 85140228, 83946943, 83775282, 84390163, 85905552, 87860823, 90019226, 91820717, 92362881, 92432976, 92497110, 92615843, 93147755, 93661547, 93597889, 93699455, 94560146, 96064568, 98511934, 101250887, 103896379, 105948210, 106928349, 106383324, 102196217, 98879099, 101755857, 106271982, 109331131, 111881971, 113851547, 115207672, 115689993, 115908384, 116338015, 117120504, 118679523, 120643854, 122682333, 125095844]
1486A25095844K761603L761768N283594P166147J0312796J1269798J0288010R815693
1494A85755253Q869877Q932113J0147591J0453453R484520J0762215J4792442J6026745
1502B75224209J9330273J0787467j7028560k0497570k406349M771232R946594R945622
1510B90072918J092911J261959J1849861R391556q513222q799553Q738060J0210266
1518C15304756j82628n355359j2918701r516258J0200043J1481743n200844o980667
1526B96832085K103576N338898P635117O064415o76156m450073j1224746n268345J9939422
1535C16294193K2584896P939377l271828k3618946k3548374N8670N171051l652801
1543B97956238k617836N976429P529964M100342K055626j650314j204262M630089N091896
$$ y = [125095844, 127857447, 131619215, 136902809, 144068956, 154381752, 165651550, 175939560, 185755253, 194625130, 203557243, 213704834, 224158287, 233642807, 244405022, 259197464, 275224209, 294554482, 305341949, 288313389, 267815819, 265409470, 270180702, 280127296, 290072918, 291165829, 292427788, 304277649, 313669205, 305155983, 296356430, 305094490, 315304756, 315122128, 309766769, 296848068, 287331810, 297531853, 309013596, 303812752, 296832085, 298935661, 304274559, 311909676, 317974091, 317297935, 312847862, 301623116, 296354771, 316294193, 338879089, 346818466, 343546638, 319927692, 296379318, 296437988, 301609039, 297956238, 295338402, 301314831, 308844795, 312945137, 315000763, 313350449, 312146187, 316776276, 321868172]
1552C21868172j494637K331505K4664383J5663414l2131691l9039612j4241695o94275
1560B76925564J7949810J9256592q35648l646126P411957P309647l69530m933586j2941361
1569C06127319q852005J1777382J5634537Q826981K35328k0969391k0351905L969440
1577B96397686J0030499M666328K500782j301060k025356M15096R54132N59807M25587
1586C12623501K88486M540p15981n71480P90596O57311q97408j457691j663685j370906
1596C07687283q9894P6065n61714j145840k605915k082348P94659J685848J618863
1605C05377007Q21838j652260k244224j927147l71437L246536N302429R925117M223366
1614C22701225j7862320j9205589j922836N323639J1684417R219666o342888r977341
$$ y = [321868172, 320373535, 322705040, 347369423, 363032837, 330901146, 291861534, 277619839, 276925564, 294875374, 314131966, 313296318, 309650192, 317062149, 324371796, 324002266, 319068680, 306127319, 297275314, 309052696, 324687233, 333514214, 333749542, 312780151, 292428246, 296397686, 306428185, 311094513, 313595295, 312294235, 310268879, 310683975, 311638107, 312197914, 312623501, 312911987, 312916527, 312200546, 311629066, 312419662, 313076973, 312179565, 310721874, 309058189, 307687283, 307597389, 307673454, 307111740, 305965900, 303359985, 301277637, 302072296, 303758144, 305377007, 306198845, 304546585, 302302361, 300375214, 300003777, 303250313, 308552742, 318477859, 322701225, 304838905, 285633316, 283710480, 289034119, 300718536, 309938202, 303595314, 293617973]
1622B93617973n759239k412796N538693M910221o608010o594162L301373P257709J0470391
1631C03722153P974853j177788q227825k0801544j7153492P217407J2558937K775422
1639B86888123J999130O499061P063866P645378J644592j7146816j7297993j147975
1647B76147366R226093K8326740K0219326k3874512l2908439j7169247o559372J2102127
1655B65510082J5992413N072594K317428M696846J353722r517670r839058m40349L916988
1664B79062996Q781662O717682m187813q847733j2880325q900642R469757R329567
1672B78545151r708653j3195991o287575k811909K055397K842903j345634j453857
1680B48639832N325317j293678k8531075k7221680M031678J0474910q69999l336410
$$ y = [293617973, 287858734, 285445938, 290984631, 295894852, 289286842, 282692680, 285994053, 293251762, 303722153, 311697006, 310519218, 302291393, 281489849, 264336357, 271553764, 284112701, 286888123, 288887253, 295386314, 302450180, 310095558, 311740150, 294593334, 277295341, 276147366, 285373459, 313700199, 333919525, 310045013, 277136574, 259967327, 253407955, 265510082, 281502495, 286575089, 288892517, 293589363, 294943085, 285425415, 275586357, 275146008, 279062996, 287844658, 294562340, 290374527, 281526794, 268646469, 259745827, 269215584, 278545151, 268836498, 255640507, 249352932, 246541023, 248596420, 251439323, 250093689, 248639832, 253965149, 252671471, 224140396, 196918716, 200950394, 211425304, 210555305, 207218895]
1688B07218895l431091j795044M608860M271755k671967n253791o620408n156745L399848
1697A94570312L81928j8091908j7831563J590490M273414n575656q887530j0473728
1705A39955759j0160685o313085n646467p436514p866144p747889p650852p315397
1713G9818726p214070p557392p033586n974532m366159j393795l30925r17912r21964
1722D4108391j020193p39336N1260L55720K77996L97206P32183O25134L22580n04732
1732D4606209k867699k396345J359940K226591J024961O42061J38998L83139J411915
1741D6529770K205849K886295L986120N758762O655217O622553P418871Q846759R935141
1750A00845337J1248112J1500597J0601997J0199308R518385J0007849J2653351J2062569
$$ y = [207218895, 203787804, 201992760, 206601620, 210873375, 208201408, 202947617, 196327209, 191170464, 194570312, 194952240, 176860332, 159028769, 160619259, 164892673, 159317017, 150429487, 139955759, 129795074, 123481989, 117835522, 110399008, 102532864, 94784975, 87134123, 79818726, 72604656, 65047264, 58013678, 52039146, 47672987, 46279192, 45948267, 45030355, 44108391, 43088198, 42348862, 42400122, 42755842, 43033838, 43431044, 44163227, 44788361, 45110941, 44606209, 41738510, 39342165, 40702105, 42928696, 43953657, 44595718, 44734716, 45117855, 46529770, 48735619, 51621914, 55608034, 61366796, 68022013, 74644566, 82063437, 90910196, 100845337, 112093449, 123594046, 134196043, 144395351, 153913736, 163921585, 176574936, 188637505]
1758A88637505Q376579O423244M050007N035897J1383285J1301270M860878L566284
1766B43634949O214370O111145N302430K299080o093026n610714M311810P146587N756626
1775B69073257N217782M543075K601624k471466k088299N057583N151748j615772k193451
1784B83276081J744976L842354O856213O113052J812687k173424j0208588q713970
1792B82549381M107723P487755M582177L534088K547264O62307l290634l673553p52945
1801B97753563Q97407K860070L376732K437362J837006J300583J31607k502690k577075
1810C05514565k84901J118660L089428L058204O01998j8845L86486P92504J506328
1819C15764427K322426M823456K883911o062737n626220N125541O073952m70161l633995
$$ y = [188637505, 197014084, 203437328, 207487335, 212523232, 223906517, 235207787, 240068665, 243634949, 249849319, 255960464, 261262894, 263561974, 257468948, 251858234, 256170044, 263316631, 269073257, 274291039, 278834114, 281435738, 278964272, 276875973, 281933556, 287085304, 285469532, 283276081, 285021057, 288863411, 295719624, 301832676, 303645363, 301471939, 291263351, 282549381, 286657104, 294144859, 298727036, 302261124, 304808388, 305470695, 302180061, 298506508, 297753563, 298650970, 301511040, 304887772, 307325134, 309162140, 310462723, 310594330, 308091640, 305514565, 305229664, 306348324, 309437752, 312495956, 313097954, 313079109, 313465595, 314258099, 315764427, 318086853, 322910309, 325794220, 319731483, 314105263, 319230804, 325304756, 324834595, 321200600]
1828C21200600q105030o008149N331288P337322J697788K36016O42776L31650j085282
1837C21578979N26658O847877P020455K856750k034454j3389817j1874427M840850
1845C16372871Q101921J023789k02408J531105J601944P94640N93185Q32100O86379
1854C31335526J74064M7455K38647K65847J14212L22075O43272J523972L745803L734322
1864C42145195K672691n99861r207496r495507j838913J605034M354019M493218R50355
1873C35078735p1067L43322L31650M01497L81927K99454K19345J98136n8174j229744
1883C35895081l04947M156341L380280l038407m708252l860473j962662L601303L833046
1892C36991310j581917k387771J70479Q15162O23474N60990L60260J22528l86696l31154
$$ y = [321200600, 313095570, 307087421, 312418709, 319756031, 321453819, 321689835, 322332611, 322664261, 321578979, 322105637, 328953514, 335973969, 338830719, 336796265, 323406448, 311532021, 316372871, 324474792, 325498581, 325296173, 326827278, 328429222, 329223862, 329817047, 330649147, 331335526, 331509590, 331557045, 331795692, 332061539, 332175751, 332497826, 333141098, 334665070, 338410873, 342145195, 344817886, 344218025, 335010529, 325515022, 323676109, 325281143, 329635162, 334128380, 335078735, 335007668, 335350990, 335682640, 336084137, 336466064, 336765518, 336984863, 337182999, 337124825, 335895081, 335590134, 339746475, 343126755, 340088348, 335380096, 331519623, 329556961, 333158264, 336991310, 335409393, 333021622, 333192101, 334007263, 334630737, 335191727, 335551987, 335674515, 335287819, 334956665]
1902C34956665L49274N74341P48634L31154r62487j454353j682052j176339K93007
1911C31977844J332283K992401K462387m68483k149353m585037l407249L374100L428230
1920C34957123l319740m239541j003761M47502K001763K048492K03133l87192k64397
1929C30443382m10576p04269o51360r4413j59035j150360p24297J397820J756210J356125
1939C31059227l67394n382080n255203L54271J647720j20163j72843R18350O59485
1948C23341370j071701j294861k07176r54l95279l23563K13623J50948n30491o92120
1958C19189796n80081l48797J90487M36782P72229K67276j655101j757393k25525M46777
1968C16736450R94683R70382R2259o7234L47614L41415J6213m2916Q7033J27792J64032
$$ y = [334956665, 335305939, 335880280, 336628914, 336960068, 335997581, 334543228, 332861176, 331684837, 331977844, 333310127, 336302528, 338764915, 338296432, 336147079, 331562042, 328154793, 331528893, 334957123, 331637383, 327397842, 326394081, 326841583, 328843346, 330891838, 331094971, 330707779, 330443382, 330032806, 329328537, 328677177, 328582764, 328423729, 327273369, 326549072, 327946892, 329703102, 331059227, 330691833, 325309753, 320054550, 320408821, 322056541, 321936378, 321763535, 322681885, 323341370, 322269669, 320974808, 320767632, 320766678, 320371399, 320047836, 320261459, 320412407, 319881916, 319189796, 318609715, 318260918, 318451405, 318888187, 319660416, 319927692, 318272591, 316515198, 316289673, 316736450, 317731133, 318701515, 318793774, 318726540, 319074154, 319415569, 319431782, 319388866, 319475899, 319603691, 319767723]
1979C19767723J32313k9564j0014K74887J75705n10902l25699R55582R77058K5025
1989C21432114o90003k150516j640320J436939J976738M62761O2256J06544R9182K51313
1999C21347008K11448N494j18485l27110k05040L36418N25246N28564M48685J63345
2009C22915573N7449m043J31340Q53081M48227j463166j648941l67126J80931N98183
2019C21701508O71882K76795J26381J01318l6469l22342l80287j98593k00996l26157
2029C21413040l95546n11398m44908j57337l4810n1269P4158N04264L05634p01904
2039C19999924q67348l97930j19209L18775L39012r4643k63939l78608l17574O5804
2049C18284264O0329l77655l62644R2048J53046j71890q2970M24385N30968L47595
$$ y = [319767723, 319900036, 319870472, 319860458, 320135345, 320311050, 319800148, 319474449, 320430031, 321407089, 321432114, 320742111, 318591595, 316951275, 318388214, 320364952, 320827713, 320889969, 320996513, 321095695, 321347008, 321558456, 321563950, 321445465, 321118355, 320913315, 321249733, 321774979, 322303543, 322752228, 322915573, 322973022, 322968979, 323100319, 323953400, 324401627, 322938461, 321289520, 320922394, 321103325, 321701508, 322373390, 322650185, 322776566, 322877884, 322841415, 322519073, 322138786, 321940193, 321739197, 321413040, 321017494, 320506096, 320061188, 319903851, 319869041, 319817772, 319891930, 320396194, 320701828, 319999924, 319132576, 318734646, 318615437, 318934212, 319273224, 319178581, 318914642, 318536034, 318218460, 318284264, 318344593, 317966938, 317604294, 317696342, 317849388, 317677498, 317594528, 318018913, 318549881, 318897476]
2059C18897476K47498J64032j0262m47273l52860L53089N56240M31538L91235L57170
2069C20587883K26479q4382j38778K8381J19438K77291K26249n5542k06489l70484
2079C20610046l34739p5569R9639L54538L40233O447r7046m3182q9874k67029j97640
2090C20305824K00272K19574j28975j83563m1504K2659O6986J32332K36969K65389
2100C21095963J80931K42729N45006M50630p8430k55356k94228j27792N13573M83245
2110C22756271k34832m31290l68843k08130K16026M03137N27878L90511j48773l33519
2120C22568436k95639k63939j76659n4130J51863K66075M04854K77481k40784l61938
2130C22275620j61133j27564k12669j23520J60942K63939K52495K35290J67618J16806
$$ y = [318897476, 319144974, 319309006, 319298744, 318851471, 318498611, 318851700, 319407940, 319839478, 320230713, 320587883, 320814362, 320729980, 320591202, 320619583, 320739021, 321016312, 321242561, 321187019, 320980530, 320610046, 320275307, 320199738, 320299377, 320653915, 320994148, 321000595, 320903549, 320860367, 320770493, 320503464, 320305824, 320506096, 320725670, 320596695, 320413132, 320371628, 320394287, 320461273, 320593605, 320830574, 321095963, 321276894, 321519623, 322064629, 322515259, 322436829, 322181473, 321887245, 321759453, 322273026, 322756271, 322521439, 322090149, 321721306, 321513176, 321729202, 322132339, 322660217, 323050728, 322901955, 322568436, 322272797, 322008858, 321832199, 321778069, 321929932, 322196007, 322600861, 322878342, 322637558, 322275620, 322114487, 321986923, 321774254, 321650734, 321811676, 322075615, 322328110, 322563400, 322731018, 322847824]
2140C22847824J07308k7657l60031m35562l19977k05040l319J27068K06489L09677
2150C22246780M66347M81606M29382K05994l95050m46320k594K25525N19028M61807
2160C24192505l3112k02903j92147j85508p5112j07765l44048k96325J7852J77384
2170C22950821K78244L55492M68483L41911j03722k76565l06359k68478q4648N264
2180C23360443J04447L7651k14119m00772p50771o01540J46180M31060M67987M58718
2190C23039284L16887J85928m0283q0795O6490J10893J32065R9907L3378j13487m85916
2201C23264351m59671l7651J66397L88145K97318k57988l42598j09177J15853N73425
2211C23598404O25343K77291J41601J57128m5281n84602o17523j85013L3149K83967
$$ y = [322847824, 322955132, 322927475, 322567444, 322131882, 321811905, 321606865, 321603546, 321730614, 321937103, 322246780, 322713127, 323194733, 323624115, 323830109, 323435059, 322988739, 322986145, 323211670, 323730698, 324192505, 324159393, 323956490, 323764343, 323578835, 323503723, 323395958, 323051910, 322755585, 322773437, 322950821, 323229065, 323584557, 324053040, 324394951, 324291229, 324014664, 323708305, 323439827, 323355179, 323360443, 323464890, 323502541, 323288422, 322887650, 322136879, 321535339, 321681519, 322112579, 322580566, 323039284, 323356171, 323542099, 323501816, 323421021, 323487511, 323598404, 323730469, 323830376, 323863754, 323750267, 323264351, 322804680, 322767029, 322933426, 323321571, 323618889, 323360901, 323018303, 322909126, 323024979, 323598404, 324223747, 324501038, 324642639, 324799767, 324754486, 324169884, 323552361, 323367348, 323400497, 323684464]
2221C23684464K57263j93367j73836L65295L29705k52495m01001k76795k17208j26343
2231C22995682n1995J0033R0561K40822K25563K4300m8638o5307n5314M4785J0261
2242C23420753k05268j95275O4125P0114j63078j90964q2016r803J38054Q5601k01454
2253C22730789l12576l58353l08761j15624n226J22070R1057j54228k14844j32561
2263C21341743j41868k28615k15073j00364o5575m7912j18981l72162l64303o8665
2273C19618225l7670k06471k82058l91712l19958o5804J49002M47998N58854M85191
2283C19955597M82063N70297M11034p7476k32468j69258q9874J86424J36604k86789
2293C20886154l74107l06587p1297N65758O53534Q4838K38190J145134J298905R70840
$$ y = [323684464, 323941727, 323748360, 323574524, 323939819, 324269524, 324017029, 323616028, 323339233, 323122025, 322995682, 322943687, 322953720, 323044281, 323285103, 323510666, 323534966, 323486328, 323421021, 323365707, 323410492, 323420753, 323215485, 323020210, 323084335, 323154449, 322991371, 322800407, 322718391, 322708588, 322846642, 322932243, 322730789, 322418213, 322059860, 321751099, 321635475, 321630249, 321752319, 321843376, 321689148, 321474304, 321341743, 321199875, 320971260, 320756187, 320655823, 320590248, 320542336, 320423355, 320051193, 319686890, 319618225, 319580555, 319374084, 319092026, 318700314, 318380356, 318314552, 318463554, 318911552, 319470406, 319955597, 320437660, 321007957, 321418991, 321341515, 321109047, 320939789, 320849915, 321036339, 321172943, 320886154, 320512047, 320205460, 320134163, 320699921, 321353455, 321438293, 321676483, 322821617, 324120522, 325091362]
2303C25091362N80063j42784n39780o65932r61532j630058j420517k89422L37601P72934
2313C21131935J192093J683464J717339J646995N86281j920929l165741m416466l311386
2322C15143585J288643K462387J076698N83420N85099p81098m465561m804611k444496
2331C08644066m67072L063679L485203R50813m92325j882553l113746m312287n078792
2340C00796986m697323o433487j3680229r601097O147613J5352974K5600891K4757385
2348C38243713J1593590L156891p251244r884605l388176k929459o083221p385979
2356C16071510q673439q068790n163441l471374j516571j691590m796257n241394m368057
2365B73080597k404213K344589L328572J021862P5569r80377r20296M13189J163234
$$ y = [325091362, 325671425, 325528641, 324988861, 324322929, 323361397, 321731339, 320310822, 320021400, 320359001, 321131935, 322324028, 324007492, 325724831, 327371826, 327958107, 326037178, 322871437, 318454971, 315143585, 316432228, 318894615, 319971313, 320554733, 321139832, 320358734, 315893173, 311088562, 308644066, 308176994, 311240673, 314725876, 315676689, 315184364, 313301811, 310188065, 305875778, 300796986, 296099663, 289666176, 275985947, 266384850, 272532463, 287885437, 313486328, 338243713, 349837303, 352994194, 345742950, 335858345, 332470169, 329540710, 323457489, 316071510, 307398071, 299329281, 294165840, 290694466, 289177895, 287486305, 282690048, 277448654, 273080597, 270676384, 273020973, 276349545, 277371407, 277446976, 276466599, 275546303, 275959492, 277122726]
2374B77122726J816521K282868K573967K732505K660027K704620K832413K829800K713203
2383C00268650K626896K714634K257347J084080N94387O23455M27971J12304J183M3640
2393C10754547J15624L63121L24707M4822j93100n88665o27994l45955j18713K62012
2403C09990406L35693J42804j8349l11623l80268k58446j67846j2150M2419L0060k2430
2414C09370270j70708k18391k44847j31130K49634K71301j16577q7261L36895M16984
2424C09676170K78950J55697o5575j66893k60582j18980M27723M72317J411k4548L38078
2435C10713768L53813J05381l338q3694r7275n474l567j10626n6763K16732K01702
2446C11230659j37329j50909J08719J98822K13165K18392K60105Q7738m67301m80175
$$ y = [277122726, 278939247, 281222115, 283796082, 286528587, 289188614, 291893234, 294725647, 297555447, 300268650, 302895546, 305610180, 307867527, 308951607, 309545994, 310169449, 310597420, 310709724, 310710907, 310754547, 310870171, 311233292, 311557999, 311602821, 311409721, 310821056, 310193062, 309847107, 309728394, 309990406, 310326099, 310468903, 310450554, 310138931, 309758663, 309500217, 309332371, 309320221, 309362640, 309392700, 309370270, 309199562, 308981171, 308736324, 308605194, 308854828, 309126129, 309009552, 308922291, 309259186, 309676170, 309955120, 310110817, 310045242, 309878349, 309617767, 309498787, 309926510, 310398827, 310400238, 310375690, 310713768, 311067581, 311172962, 311169624, 311085930, 310988655, 310983181, 310979614, 310868988, 310812225, 311028957, 311230659, 311093330, 310942421, 311051140, 311249962, 311463127, 311681519, 311941624, 312029362, 311562061, 311081886]
2456C11081886N0316J91689J13945O7253q6785m4822K66075K50568k8362k29836n50041
2467C11081886n45501k31972O904M30832L83129k46524l62397j12056j660J16806J57128
2478C10676575J70936L4581l48797m70887m03633l68118l06854k28405j25885j9074
2488C08610439J09921K08130L51429K88715p06j84765m09374m23183k10762q6079P1278
2499C08325043R1552l8852r8706j33514j84288k49157k98023m25110k85149K29378
2509C06933174L42827J78585J5736l09468m23431l71933l47614l08991k30789m9820
2519C05428276m6024k05517l04699m86374m02927Q4648P2479m78744n07851j33019
2529C03020248N5542L01838K19593k69661m65869n72911m77085l8147O7005l2196j76658
$$ y = [311081886, 311132202, 311323891, 311437836, 311505089, 311418304, 311373482, 311639557, 311890125, 311861763, 311631927, 311081886, 310536385, 310304413, 310311317, 310742149, 311125278, 310878754, 310516357, 310404301, 310402641, 310519447, 310676575, 310847511, 310882092, 310533295, 310062408, 309658775, 309290657, 308983803, 308755398, 308629513, 308610439, 308720360, 308928490, 309279919, 309568634, 309567928, 309383163, 308973789, 308550606, 308339844, 308253765, 308325043, 308416595, 308377743, 308279037, 308145523, 307961235, 307712078, 307414055, 306988945, 306703796, 306933174, 307276001, 307454586, 307470322, 307160854, 306737423, 306365490, 306017876, 305708885, 305478096, 305428276, 305382252, 305176735, 304872036, 304385662, 303982735, 304067383, 304139862, 303661118, 303153267, 303020248, 303075790, 303377628, 303597221, 303327560, 302861691, 302288780, 301811695, 301773548, 301840553, 301808357, 301631699]
2540C01631699n88913n41191L6945J32084j42822k28882l70026j51634O43730P28855
2550C01149845K58694j00136p14550p85828l25679q6060J97868K16484q7738j76658
2560B99546242j22795j75934l71227l18528L0518R0122q4152j28994j01566j39466
2570B98224220k55127k62260j73569j25637n5313q1310k26727k82535k81563l04451
2580B96175728l65753l28522k17934p1029K67486K11964l00656m32472l44772k32925
2590B94361115N0544J07765K3613j45912n68638o32286m35829j98841K75383M19617
2600B93256531L43780J72863k58197m15574m27246l15189J3103K07901M55399L57380
2610B93390751k08378l56903k33192j45913Q583J20888K35787K81581L64781J29223
$$ y = [301631699, 301042786, 300501595, 300538540, 300670624, 300527802, 300298920, 299928894, 299777260, 300420990, 301149845, 301408539, 301308403, 300593853, 299808025, 299482346, 299396286, 299594154, 299810638, 299722900, 299546242, 299423447, 299247513, 298876286, 298557758, 298588276, 298678398, 298594246, 298465252, 298363686, 298224220, 297969093, 297706833, 297533264, 297407627, 297352314, 297271004, 297044277, 296761742, 296480179, 296175728, 295809975, 295481453, 295263519, 295192490, 295459976, 295671940, 295371284, 294938812, 294594040, 294361115, 294411659, 294519424, 294543037, 294397125, 293828487, 293196201, 292760372, 292561531, 292836914, 293256531, 293600311, 293773174, 293514977, 293099403, 292672157, 292356968, 292370071, 292577972, 293033371, 293390751, 293182373, 292825470, 292592278, 292446365, 292454948, 292575836, 292811623, 293093204, 293457985, 293587208]
2620B93587208o24409p45773l23792j53045L5286m1962n06649n88169m83055j76182
2630B89979458O13460P44572L08991P9631j81675k95639k62012k62509k82039j99318
2640B90242920n970J42345L69530L34034k1458j29699p153j55201p24087o12011K60582
2651B89693832M72069K18868J34945Q9875k9316l26863k75383J16577L54538P08104
2661B91157246N89847j35422l40461k28405j16825J41143K74430M06723L12576q5602
2671B91975250k55584l49751k93255L9578P1048j73339k19803j86463p5340K55127
2681B90787468K40555j10398k71072m33922l58581L7422J80492J87626J64280K7905
2691B90451775K136N4836Q8444K31743O5345o01539n89600P5341L14216L57876L58829
$$ y = [293587208, 292962799, 292217026, 291893234, 291740189, 291775475, 291733513, 291226864, 290638695, 290155640, 289979458, 290592918, 291337490, 291646481, 291726112, 291544437, 291248798, 290986786, 290724277, 290442238, 290242920, 290236950, 290379295, 290748825, 291082859, 291061401, 290931702, 290924549, 290769348, 290045261, 289433250, 289693832, 290165901, 290384769, 290519714, 290609589, 290580273, 290253410, 289978027, 290094604, 290449142, 291157246, 291747093, 291611671, 291271210, 291042805, 290925980, 291067123, 291341553, 291748276, 292060852, 291975250, 291719666, 291369915, 291076660, 291116238, 291187286, 291013947, 290794144, 290607681, 290532341, 290787468, 291028023, 290917625, 290646553, 290212631, 289854050, 289891472, 290071964, 290259590, 290423870, 290451775, 290453911, 290508747, 290597191, 290828934, 290894279, 290292740, 289703140, 289778481, 290092697, 290450573, 290809402]
2702B90809402L41416N4588p54585q25653r9659p5817p39575o53019J05362M11034
2712B88573494N89867M62989j18255l82176n73406m86832N6019J33763j03722l36647
2722B87815094q20160q55923m47979k80151j64261j70708l86486l96480k27223j88121
2732B83877602j80951k91824o65665o37760k09808m1504N6515j4553m10786m09126
2742B81072140q5831J39237N14507M65164q7986k54154j76201j76659k04086j42097
2752B81064034J10855L1471m26521n57671n05676m02680j09443n4360j69029l01361
2762B78679619o38008n85099o7939K1209j49955l62397q91685q57353j94779m6272
2772B74907341k87285k74658q3447n8651j02767k61059o39210p71523q09898o15597
$$ y = [290809402, 291150818, 291205406, 290450821, 289625168, 289525509, 289449692, 288710117, 288057098, 288162460, 288573494, 289163361, 289626350, 289508095, 289125919, 288552513, 288065681, 288121700, 288255463, 288151741, 287815094, 286994934, 286139011, 285691032, 285410881, 285246620, 285075912, 284689426, 284292946, 284065723, 283877602, 283696651, 283404827, 282739162, 282101402, 281891594, 281850090, 281906605, 281892052, 281481266, 281072140, 280986309, 281125546, 281640053, 282105217, 282017231, 281763077, 281586876, 281410217, 281206131, 281064034, 281174889, 281206360, 280779839, 280222168, 279716492, 279313812, 279204369, 279150009, 278980980, 278679619, 278041611, 277456512, 277388573, 277409782, 277259827, 276897430, 276005745, 275148392, 274953613, 274907341, 274620056, 274345398, 274261951, 274203300, 274100533, 273839474, 273200264, 272428741, 271618843, 271003246]
2782B71003246L9101J03245l73383n40962o13689n87464l27358l77159p97997q03222
2792B66724358m34647l14236j52836m86602j643658j778126j038322o78520j96953
2801B60000458l46890j396427j522293p28378q22773j736641j938114j619568j546631
2810B48342743j595497j496773j096020j281032k142906k429715k395153k276897j781464
2819B31847286j847267k432823k766132k999077l297558l780365l808270l158321l361225
2828B04396248m345665m869690n197525n516281n728264o038666o435146o764412o988525
2837A52512074p413149q052588q546829r073734r284020r468078q816004p581234n560160
2846G8716278k279758J61886K549410L842354L854751M369259N065918N440235N630493
$$ y = [271003246, 271042347, 271145592, 270772209, 270231247, 269617558, 269030094, 268702736, 268325577, 267527580, 266724358, 266289711, 265975475, 265822639, 265336037, 263692379, 261914253, 260875931, 260197411, 260000458, 259653568, 258257141, 256734848, 256006470, 255183697, 253447056, 251508942, 249889374, 248342743, 246747246, 245250473, 244154453, 242873421, 240730515, 238300800, 235905647, 233628750, 231847286, 230000019, 227567196, 224801064, 221801987, 218504429, 214724064, 210915794, 207757473, 204396248, 200050583, 195180893, 189983368, 184467087, 178738823, 172700157, 166265011, 159500599, 152512074, 145098925, 137046337, 128499508, 119425774, 110141754, 100673676, 91857672, 84276438, 78716278, 76436520, 76598406, 79147816, 82990170, 86844921, 91214180, 96280098, 101720333, 107350826]
2855A07350826N587340N255699M903078M475832L918171L190279K504825J647711J261473
2864A40095234J565456J039505k75373j025438j628161j770973j308680j134872j067877
2873A34488821r42707p46250o97136p50303q67606j083374j300096j631022j724004
2882A24746323j480103j650095k228498k489090k666474k550125j991510j795054j812458
2891A06082916j834869k016783j949549j615762j495838j447201j559496j966477k046585
2900I0150356j828193j820088j942634k006531k042532k119541k069235k496243l743171
2909G0082188l835917k857923k450467k360820j959086j409530o87600N43118R12666
2918E5976629M23670M35114P54356P91073O30617N21660K10285M60625J471520J683235
$$ y = [107350826, 112938166, 118193865, 123096943, 127572775, 131490946, 134681225, 137186050, 138833761, 140095234, 141660690, 142700195, 142424822, 141399384, 139771223, 138000250, 136691570, 135556698, 134488821, 133546114, 132799864, 132102728, 131352425, 130484819, 129401445, 128101349, 126470327, 124746323, 123266220, 121616125, 119387627, 116898537, 114232063, 111681938, 109690428, 107895374, 106082916, 104248047, 102231264, 100281715, 98665953, 97170115, 95722914, 94163418, 92196941, 90150356, 88322163, 86502075, 84559441, 82552910, 80510378, 78390837, 76321602, 73825359, 70082188, 66246271, 63388348, 60937881, 58577061, 56617975, 55208445, 54520845, 55063963, 55976629, 56400299, 56835413, 57589769, 58380842, 59011459, 59533119, 59743404, 60204029, 61675549, 63358784]
2928F3358784J350879J012087K93732J49250M54187P50780J444340J368523M59194
2937G0641756J36852K45333j2159n97716q69512r63927r80854q08477p94411j049041
2947F4947844p85351j908N07117R72986J261711J354456J457691J437187J621485K074719
2957G4847937K208709K035857K093792K208948K536058L230333L515959L554344L475428
2966I9707365L202438K909899K444744K243519K385378K114534J488448J029491O24657
2975A18150473K02655j96933o61373j389027j499891p96795r51290j943112k184391
2984A08730316k047777j631498n99861j99557k57253k21491l70980j42336N90802P59363
2994A04609728L60489M71592J007557J231432J173973J449108K080202K359867K446413
$$ y = [63358784, 64709663, 65721750, 66015482, 66164732, 66618919, 67369699, 68814039, 70182562, 70641756, 70778608, 71023941, 71011782, 70414066, 69544554, 68580627, 67599773, 66791296, 65996885, 64947844, 64162493, 64160585, 64667702, 65640688, 66902399, 68256855, 69714546, 71151733, 72773218, 74847937, 77056646, 79092503, 81186295, 83395243, 85931301, 89161634, 92677593, 96231937, 99707365, 102909803, 105819702, 108264446, 110507965, 112893343, 115007877, 116496325, 117525816, 118150473, 118353128, 118156195, 117494822, 116105795, 114605904, 113809109, 112857819, 110914707, 108730316, 106682539, 105051041, 104451180, 104251623, 103994370, 103772879, 103401899, 103259563, 103850365, 104609728, 104970217, 105441809, 106449366, 107680798, 108854771, 110303879, 112384081, 114743948, 117190361]
3003A17190361K413034K063990K107859K538681K668381K597808K608300K680301K607584
3012A39476299K357722K263307K268315K262830K205849K368450K969742K858877J950264
3021A60981655J737118J902351K217999K967834L241291L168354L136635K862454L090629
3030A85306320M001618M126548L507119L443966L756046L866195L993035L839493L360023
3039B19200363L030777K640495K555371K898464K808075K364407K106189J764298J873970
3048B41242409K709865K637158J780510J276245Q10394N00908K50092L29742Q64258
3057B52401581J083622J223087J111508M99477N53131J364708J396675P55310N50976
3066B60940075M77085O47297J273861J391411J222858Q41141r6569k92282J88579L09468
$$ y = [117190361, 119603395, 121667385, 123775244, 126313925, 128982306, 131580114, 134188414, 136868715, 139476299, 141834021, 144097328, 146365643, 148628473, 150834322, 153202772, 156172514, 159031391, 160981655, 162718773, 164621124, 166839123, 169806957, 173048248, 176216602, 179353237, 182215691, 185306320, 189307938, 193434486, 196941605, 200385571, 204141617, 208007812, 212000847, 215840340, 219200363, 222231140, 224871635, 227427006, 230325470, 233133545, 235497952, 237604141, 239368439, 241242409, 243952274, 246589432, 248369942, 249646187, 250456581, 250957489, 251207581, 251537323, 252401581, 253485203, 254708290, 255819798, 256319275, 256872406, 258237114, 259633789, 260389099, 260940075, 261417160, 262064457, 263338318, 264729729, 265952587, 266793728, 266697159, 266404877, 266593456, 266902924]
3076B66902924L31401K46296q7986r7522J94320L06855K90374M23432P39822Q22544
3086B70072460P83444N89847M77J1215O84490P71275L33328L72162Q56400R07421P78198
3097B76160717L34034q54034r35784R9659L57380R8953J70479M54903N72204O40145
3107B77098656N67436L10669J33018j29928q3447M13418M00772p1525k46277l58353
3117B78034439k29111K61307M51813M96616M37031K05994K7160l49750j47343Q56629
3127B80044785R95178M23889J87168L5038p8430j90258j06335L07312L19252r8953
3137B81838646j04408K48413L31878L14713J46408k91595m78268o07243m28199J76181
3147B81146526M83990Q10852O12755l84827n41687L0518J35422O1283j50681p93209
$$ y = [266902924, 267234325, 267480621, 267392635, 267295113, 267489433, 267796288, 268086662, 268510094, 269249916, 270072460, 270855904, 271445751, 271446228, 271457443, 272141933, 272913208, 273246536, 273618698, 274475098, 275382519, 276160717, 276494751, 275640717, 274704933, 274804592, 275161972, 275260925, 275431404, 275886307, 276458511, 277098656, 277666092, 277976761, 278109779, 277979851, 277896404, 278309822, 278710594, 278639069, 278392792, 278034439, 277805328, 278066635, 278518448, 279015064, 279452095, 279658089, 279685249, 279335499, 279188156, 280044785, 281039963, 281463852, 281651020, 281686058, 281607628, 281417370, 281311035, 281618347, 281937599, 281838646, 281734238, 281982651, 282314529, 282629242, 282775650, 282484055, 282005787, 281398544, 280970345, 281146526, 281630516, 282441368, 283054123, 282669296, 282127609, 282158127, 282293549, 282354832, 282204151, 281410942]
3157B81410942p36961L8376L19023L52611L60737K68211J51864o4126j56631k08855
3167B81735191j12781K55585K89440m77n2452P8449M9095k00977q8215M15077O11077
3178B82979012P18345N56946K1706k88010o43005n62668J18484K56768p9861k0733
3188B83056984L69072M76589N15232K41280o03218p44095l28541m4575L36647N84603
3198B83859978Q73794P34806L4809k26020k12441k66781k96592l33081m93507k78721
3208B83396244N70774N18074m36535p58171r07898n77678O27975Q16345K9335j0719
3218B83267746N33562N90095L38555J28974k72026k83012J86691J92871k67486k38190
3228B84177780L06854L05634j97411l18279k47002j08013K94457K98271j96457j28517
$$ y = [281410942, 280673981, 280712357, 281031380, 281383991, 281744728, 282012939, 282164803, 282100677, 281944046, 281735191, 281622410, 281877995, 282167435, 282166958, 282114506, 282192955, 282242050, 282041073, 281952858, 282367935, 282979012, 283697357, 284254303, 284276009, 283987999, 283344994, 282782326, 282900810, 283157578, 283077717, 283056984, 283426056, 283902645, 284417877, 284659157, 284055939, 283311844, 282983303, 282938728, 283275375, 283859978, 284733772, 285468578, 285503387, 285277367, 285064926, 284798145, 284501553, 284168472, 283674965, 283396244, 283967018, 284485092, 284048557, 283290386, 282382488, 281804810, 282432785, 283249130, 283278465, 283267746, 283801308, 284391403, 284729958, 284858932, 284586906, 284303894, 284490585, 284683456, 284415970, 284177780, 284484634, 284790268, 284592857, 284274578, 284027576, 283919563, 284214020, 284512291, 284315834, 284187317]
3238B84187317N84602N51224q8215n04017j206627r84439L58333Q26607Q91914O60191
3248B85276890k19097m51088j04447k02636p46727p12395j81198J45187N47638O01540
3258B83953667L10669Q4152l28064l38078Q6537K26516K19574K31972L14961R7274
3268B84859180o23455o68525l2673Q2264j37825k35062m14142l15419J87149K28405
3278B82929897j59969k40822j55201p9155P1278J33285J64261R5139j53542j97639
3288B82407532j11122J7414L37600L39261N9127j40896m57763m65641j61629J6918
3298B81840801K25067K80133J45454J49002L01838K30312o0081k18391l78380l57857
3308B82157898n9605n6266l81470l28541J23978J83334p1278j63555k45094j85738
$$ y = [284187317, 284771919, 285323143, 285234928, 284730911, 283524284, 282539845, 282898178, 283724785, 284616699, 285276890, 285057793, 284606705, 284502258, 284299622, 283552895, 282840500, 282659302, 282804489, 283352127, 283953667, 284264336, 284348488, 284020424, 283682346, 283768883, 283995399, 284214973, 284446945, 284761906, 284859180, 284235725, 283567200, 283534527, 283616791, 283478966, 283243904, 282829762, 282514343, 282701492, 282929897, 282769928, 282529106, 282373905, 282294750, 282366028, 282499313, 282663574, 282758713, 282605171, 282407532, 282296410, 282313824, 282651424, 282990685, 283049812, 282908916, 282451153, 281985512, 281823883, 281840801, 282065868, 282346001, 282491455, 282640457, 282942295, 283172607, 283112526, 282894135, 282515755, 282157898, 282098293, 282042027, 281660557, 281332016, 281455994, 281639328, 281568050, 281404495, 281159401, 280973663]
3318B80973663M8180J89533L84083L16162q2016k24838k40555k01950m1008M0779J17054
3329B81279087R3212p1029j20888j53313l7651M38690K91577o05107p64847l90281
3339B79959450j59989J47343L24955L93410M76341P08828M26044n78384q15391m96636
3349B80385971k65121J46865L10669K36016L09486O59218L83854o63757r93977r27677
3359B79581547o71139R6073K98748K6207o904j6442J44005P12147N87940l17574n52177
3370B79882431m12216j67847M91371N91507J88122L0766q2741r3937J26839P05n57403
3381B79997597o29196l21866j24931J39485K49614K69184J63536j25637l30219n90782
3391B78696785o13461m22954k14577J66168K95639L58582L6735j039752j074315j20639
$$ y = [280973663, 281021843, 281211376, 281595459, 281911621, 281829605, 281604767, 281364212, 281162262, 281121254, 281162033, 281279087, 281372299, 281301270, 281180382, 281027069, 280989418, 281428108, 281719685, 281114578, 280349731, 279959450, 279799461, 279946804, 280271759, 280665169, 281141510, 281850338, 282276382, 281697998, 280882607, 280385971, 280120850, 280267715, 280578384, 280814400, 281123886, 281783104, 282166958, 281503201, 280509224, 279581547, 278910408, 279006481, 279305229, 279331436, 279324532, 279308090, 279452095, 280164242, 280752182, 280434608, 279882431, 279470215, 279302368, 279793739, 280385246, 280573368, 280604134, 280521393, 280427456, 280554295, 280555000, 279997597, 279368401, 279046535, 278921604, 279061089, 279310703, 279579887, 279743423, 279617786, 279287567, 278696785, 278083324, 277660370, 277445793, 277611961, 277907600, 278266182, 278302917, 277263165, 276188850, 276068211]
3401B76068211K36759M25091L18527k35310n04265o53991p55062q60215o88800o1493
3411B73289452K2392l73116n06630l84578p25041j663666j941680j937409j399269
3420B64380455K57721M40597p64598j111031j074791j001835o27746o67115j198043
3429B58633614j194725p37648n30739l79792l60717o14662n03541J0491J35670j34945
3439B54323006J5258P18117O27289k38914o10104j066208n60055J422653J776925O91413
3449B57099380N15481Q26587R65119J183261J128693Q31108N23110o1760r0599N00908
3459B63421288O22520K74887N45044J631012J651993P56035K31018m36287m81854J76182
3469B68391838M44660N66006O63757N82695Q19435J716385J407624j60447r08622j582375
$$ y = [276068211, 276304970, 276730061, 277048588, 276813278, 276309013, 275655022, 274899960, 274039745, 273350945, 273289452, 273311844, 272938728, 272432098, 272047520, 271322479, 269658813, 267717133, 265779724, 264380455, 264638176, 265078773, 264314175, 263203144, 262128353, 261126518, 260498772, 259831657, 258633614, 257438889, 256701241, 256170502, 255790710, 255429993, 254815331, 254311790, 254322281, 254457951, 254323006, 254338264, 255056381, 255683670, 255444756, 254834652, 253768444, 253208389, 254631042, 256407967, 257099380, 257614861, 258441448, 259406567, 260589828, 261718521, 262549629, 263072739, 263010979, 262920380, 263421288, 264043808, 264318695, 264863739, 266494751, 268146744, 268902779, 269133797, 268697510, 268215656, 268391838, 268836498, 269402504, 270066261, 270648956, 271468391, 273184776, 274592400, 274431953, 273523331, 271940956]
3479B71940956j281032M56810Q85009M04110J58081l32107k94457L55244N07355L30448
3489B73130417K58446K53448L2883o30379n46684J93825P58419J957416J381397j420498
3499B75368690k235889k000809j184215J264801J610527J95255o16779j915932j708031
3508B68777618L51410Q89550M50859K28157k46525k96841o2694L35941J359940J284599
3518B73072014K65121n97248k025127k229920j072883q98609j400242j463166j591682
3527B62058258q83827J119385J677513J320610O68030r63440j461754j463394n35965
3536B61535416K229690K762299J741409N18341j667747l127327n050659m369030n10464
3545B54061928J167297K212067J788845j018047j712323j199722l55721J734982K284756
$$ y = [271940956, 270659924, 271116734, 272001743, 272405853, 272563934, 272231827, 271937370, 272292614, 272799969, 273130417, 273388863, 273642311, 273675194, 273044815, 272498131, 272691956, 273450375, 275407791, 276789188, 275368690, 273132801, 271131992, 269947777, 271212578, 272823105, 273018360, 272401581, 270485649, 268777618, 269129028, 270018578, 270469437, 270697594, 270451069, 270154228, 270091534, 270427475, 271787415, 273072014, 273337135, 272739887, 270714760, 268484840, 267411957, 266513348, 265113106, 263649940, 262058258, 261174431, 262293816, 263971329, 265291939, 265959969, 264996529, 263534775, 262071381, 261535416, 263765106, 266527405, 268268814, 268787155, 267119408, 263992081, 258941422, 254572392, 254061928, 255229225, 257441292, 259230137, 258212090, 256499767, 255300045, 254944324, 256679306, 258964062]
3554B58964062J551151J290092P08333J219997L382683L550529L191700P7725p917633
3563B66018639j0063420q698215n199928L519554O483783N470276M345646J128445
3571B63004780j23978m3392j60217j21842J88599N36690J741161M554272N145302M937896
3581B79659271K065430n005837q275032j0848045q303413J599083N476226O732216
3589B63099899N133877j798382l916740l009796k073288P31697J042366j221180j379013
3598B56609440n92938J102200N511990N449066J520633j516819o454467o886483k755890
3607B51986732o99501J242638J865139O10104R13620L744373J790047n990029q123150
3616B47339973p423400m108925M061947Q340835J1914730J0782471N244255j900673
$$ y = [258964062, 260515213, 261805305, 262513638, 263733635, 267116318, 270666847, 273858547, 273936272, 266018639, 255955219, 247257004, 242057076, 245576630, 252060413, 257530689, 261876335, 263004780, 262880802, 262837410, 262677193, 262555351, 262743950, 263280640, 265021801, 269576073, 274721375, 279659271, 281724701, 276718864, 268443832, 257595787, 249292374, 250891457, 256367683, 263099899, 268233776, 266435394, 262518654, 259508858, 257435570, 258167267, 259209633, 257988453, 256609440, 256016502, 257118702, 262630692, 268079758, 269600391, 268083572, 261629105, 254742622, 251986732, 251287231, 252529869, 254395008, 255005112, 255918732, 259663105, 261453152, 255463123, 247339973, 239916573, 235807648, 239869595, 248210430, 260125160, 270907631, 276151886, 274251213]
3624B74251213j5686493j8777141j3978482p403850P495632J0635624K790928R42955
3632B40270386J641025J706372K373695J880646p52220J53312M503956O993046J0144234
3641B68914452R167919N370140j685143j6829014k0301342j5373935q719940N400199
3649B25943336J0699502J0832786P467499m099350o725311k791176Q3923N610943O563187
3658B53585339K568950K338658M506588N822410Q841057O593208j827697n826951r378204
3667B67223358p181644M112243N802861J569748m607430k0782700j8719921L473034
3675B30889549R989987O265392O365070O802311P456551R418487Q445740N802879O70891
3684B92106857r423256j3771515j6105651j2207032J474133O518841N712280O332626
$$ y = [274251213, 258564720, 239787579, 225809097, 218405247, 225900879, 236536503, 239327431, 240270386, 241911411, 243617783, 245991478, 247872124, 247119904, 247273216, 251777172, 258770218, 268914452, 278082371, 283452511, 281767368, 264938354, 244637012, 229263077, 220543137, 225943336, 236642838, 247475624, 254943123, 250843773, 244118462, 241327286, 241411209, 247022152, 253585339, 256154289, 258492947, 262999535, 268821945, 277663002, 284256210, 282428513, 276601562, 267223358, 260041714, 264153957, 269956818, 271526566, 266919136, 246136436, 227416515, 230889549, 240879536, 247144928, 253509998, 260312309, 267768860, 277187347, 285633087, 291435966, 292106857, 282683601, 268912086, 252806435, 240599403, 242073536, 248592377, 254304657, 260637283]
3692B60637283O944886O009101L359795J197586j071205l275871p338772n743027K151013
3701B62870789O264209J0346661R475212L462334k021332j0589600j3459434j2881279
3709B53467560q638859K239475P650376J1041145J0723362N105267K241840L33786
3717B84163952j478195l178120l973236m122276l384343j764774N13077L950119O765842
3726B77492046J2058506R214402l104210q932610j2108307j3248939j3113251q050919
3734B40206718L892899J1247158J9670239J7998943N123138l355274j4656773j5501976
3742B64625072o045589J049290J5319576J1278152j6179313k1151314j0052681l128052
3750B35715141P069588J0993729J0809669P399559l180504o037712l596802j054267
$$ y = [260637283, 267582169, 273591270, 276951065, 278148651, 277077446, 273801575, 266462803, 260719776, 262870789, 269134998, 279481659, 288956871, 292419205, 290397873, 279808273, 266348839, 253467560, 244828701, 247068176, 254718552, 265759697, 276483059, 281588326, 283830166, 284163952, 282685757, 279507637, 275534401, 271412125, 268027782, 266263008, 266776085, 270726204, 277492046, 289550552, 298764954, 295660744, 286728134, 274619827, 261370888, 248257637, 240206718, 244099617, 255346775, 275017014, 293015957, 298139095, 294783821, 280127048, 264625072, 258579483, 259628773, 274948349, 286226501, 270047188, 248895874, 238843193, 235715141, 242784729, 253778458, 264588127, 271987686, 268807182, 262769470, 259172668, 258118401]
3758B58118401M769325O350517N051365K944946k100944l633499j835823k430668n626450
3767B61607170m869938o87351K470245P193795P569313L767738J016140k589226m663944
3776B70813942o739140n077362K269497L768215O93570n22614k134094j557350J869430
3785B63384094K914677K117863K552280M365921L890286R63211j01338k33402k7657
3794B79825935J785031P21225k890129n884399j1905193r543419L932247O185760j48773
3803B62078285l274917r248505n644550J0497341J4908294J1964093Q429050O56853
3811B90365944l534088o745568o389160j13945Q6289m506817p027149j1850128q342019
3820B41943359O530285J0000229M586220K980480J768341J913548M557857M167557
$$ y = [258118401, 262887726, 269238243, 274289608, 277234554, 275133610, 271500111, 269664288, 267233620, 261607170, 256737232, 256049881, 258520126, 265713921, 273283234, 277050972, 278067112, 275477886, 270813942, 264074802, 258997440, 261266937, 265035152, 265728722, 265206108, 263072014, 261514664, 263384094, 266298771, 268416634, 270968914, 275334835, 279225121, 280188332, 280086994, 279853592, 279825935, 281610966, 282332191, 279442062, 273557663, 261652470, 252109051, 256041298, 262227058, 262078285, 258803368, 249554863, 243910313, 254407654, 269315948, 281280041, 289709091, 290365944, 286831856, 280086288, 273697128, 273583183, 273669472, 269162655, 262135506, 250285378, 241943359, 248473644, 258473873, 263060093, 266040573, 267808914, 269722462, 274280319, 278447876]
3828B78447876O27022p0801K185593R54857l169537o120434j0491867r978046m146328
3837B48238335j034985J619587K800217J395950K866497O431103R749641J5829811
3845B87896156J4979363R295463Q0338j7574062k5338173l0277958k2462139M590988
3853B21189976J5022030J5847702J4858951Q186588L513794k171020m506111m250298
3861B67691612k733230K223014L234139K014885r12190q752117r208183k891312L42846
3870B51009464L256798M653683M235267M389534N712986L429661l964424n678673k950420
3879B64093876j623631P48406K21481m991531l797531M888057N632649n3177k782345
3888B62336254o775856m539490N738736R316444R574661P728081K129097j848221o320724
$$ y = [278447876, 279074898, 279004097, 281189690, 282144547, 278975010, 272854576, 262362709, 252384663, 248238335, 247203350, 248822937, 251623154, 253019104, 255885601, 262316704, 272066345, 287896156, 302875519, 312170982, 312251320, 294677258, 269339085, 239061127, 216598988, 221189976, 236212006, 252059708, 266918659, 275105247, 278619041, 276448021, 271941910, 267691612, 264958382, 267181396, 270415535, 272430420, 271518230, 262766113, 253557930, 250666618, 251009464, 254266262, 258919945, 263155212, 267544746, 273257732, 276687393, 272722969, 267044296, 264093876, 262470245, 263218651, 263440132, 258448601, 254651070, 259539127, 265171776, 265118599, 262336254, 255560398, 251020908, 256759644, 266076088, 275650749, 283378830, 285507927, 283659706, 277338982]
3897B77338982q195153p507324p208118p071247n053521j035938K460957P619629Q229007
3906B59577274L859043K440682K525825J974106J596203K88963k297153l660927n091190
3915B61212826l933659R07402K394448J868724R99699j610756k041359r53178L75747
3924B59219894L555756L420372K54631j915932n249977n139847j539936P59373L626099
3933B56990433M377842L175487K057324K10514j153946k881050k803078q44479N21908
3942B59650955K928963K315521k115974l115158j905938q43277J298180J969109J456985
3951B61639366J158714N65529L14942N34782P3662j308441j499653p51019j70707P37915
3961B61295090J092910J181603P35283o56128j084328r17682n92709L75519M83017
$$ y = [277338982, 269143829, 261636505, 254428387, 247357140, 242303619, 241267681, 243728638, 251348267, 259577274, 263436317, 265876999, 268402824, 270376930, 271973133, 272262096, 269964943, 266304016, 261212826, 257279167, 258186569, 260581017, 262449741, 263449440, 261838684, 259797325, 258844147, 259219894, 262775650, 266196022, 266450653, 264534721, 259284744, 254144897, 252604961, 253364334, 256990433, 261368275, 264543762, 266601086, 266811600, 265657654, 262776604, 259973526, 259129047, 259650955, 262579918, 264895439, 262779465, 259664307, 257758369, 256915092, 258213272, 260182381, 261639366, 262798080, 263363609, 263678551, 264213333, 264286995, 262978554, 261478901, 260727882, 260557175, 261295090, 262388000, 263569603, 264304886, 263648758, 262564430, 261646748, 261054039, 261429558, 261912575]
3970B61912575k01454m52042o31809n14984R7274J83583k38896k21004J35422K86102
3980B60354767M22935L20206j44005k58446r5367p9632j35898j41869j58062o7234
3990B60017395K60353J85013m29382m00792K72046L98635N2910J28994O16780O60896
4000B61762848
$$ y = [261912575, 261711121, 261259079, 260627270, 260112286, 260209560, 260393143, 260154247, 259933243, 260068665, 260354767, 260777702, 261097908, 260953903, 260695457, 260600090, 260520458, 260384560, 260242691, 260084629, 260017395, 260277748, 260462761, 260033379, 259632587, 259904633, 260303268, 260356178, 260485172, 261101952, 261762848]
##END=$$ End of the data block
