##TITLE=$$ Begin of the data block
##JCAMP-DX=5.00 $$ ACD/SpecManager v 10.08
##SPECTROMETER/DATA SYSTEM=16PC
##DATE=Mon Sep 16 15:12:25 2013
##DATA TYPE=INFRARED SPECTRUM
##DATA CLASS=XYDATA
##ORIGIN=
##OWNER=
##NPOINTS=3601
##FIRSTX=400.00000000
##LASTX=4000.00000000
##MAXX=4000.00000000
##MINX=400.00000000
##MAXY=45.67787552
##MINY=0.02310276
##XFACTOR=1.0000000000
##YFACTOR=0.000000100000000
##FIRSTY=38.01698685
##DELTAX=1.00000000
##XUNITS=1/CM
##YUNITS=TRANSMITTANCE
##XYDATA=(X++(Y..Y))
$$ plain form
400 380169868 393198471 398383141 392161865 380904694 368089447 358827820 361716499 369777451
408 369777451 376165161 389076233 423773270 452211380 444475632 421437263 387957344 362149963
416 362149963 372774582 392754326 403079033 408305397 405679932 398122063 384412766 374212265
424 374212265 379286270 392097931 411744118 430085907 437833061 437534332 425695419 411151428
432 411151428 402432671 396955948 396386642 396506805 391117096 387827377 396407852 404177437 398442497
441 398442497 389008026 381380806 375759850 375508080 376638641 374208908 374448776 385787964 396681061
450 396681061 395762444 390921822 384553680 381777267 393298645 404749374 401446342 395039062 393201599
459 393201599 393174896 396014938 397948265 393817902 388828506 387342453 386728516 384584885 384584198 392077675
$$ packed form
400C80169868J3028603N184670o221276j1257171j2815247r261627K888679Q060952
408C69777451O387710J2911072L4697037K8438110p735748k3038369l3479919k5807381
416C62149963J0624619J9979744J0324707N226364k625465p557869j3709297j0200501
424C74212265N074005J2811661J9646187J8341789P747154k98729j1838913j4543991
432D11151428q718757n476723n69306J20163n389709l289719Q580475P769585n734940
441C98442497r434471p627220n620956k51770J130561k429733K39868J1339188J0893097
450C96681061r18617m840622o368142k776413J1521378J1450729l303032o407280j837463
459C93201599k6703K840042J933327m130363m989396j486053o13937k143631o87P493477
$$ plain form
469 392077675 399625053 399960747 397908936 396109352 393849373 390474091 388450165 391393890 395201187
478 395201187 395813713 396708488 400914192 405714989 409634361 411982765 411346207 408421745 401813278
487 401813278 396383286 398303528 402249107 404416084 406413307 408999672 410920868 410658607 409760704
496 409760704 408704529 409181137 414604645 420281181 422452469 421724319 416104546 409626465 406193962
505 406193962 404200783 403102417 403615952 406869431 411084900 415102959 418192863 418428421 418233414
514 418233414 420421143 421896210 419527283 416233063 414406052 412489891 408893127 406110992 406718979
523 406718979 408882141 412388306 414944153 413049927 410110931 408576012 407811890 408180466 409143219
532 409143219 410537491 411596069 411317101 410238266 407778015 406290779 409824829 412715454 407934647
$$ packed form
469C92077675P547378L35694k051811j799584k259979l375282k023926K943725L807297
478C95201187O12526Q94775M205704M800797L919372K348404o36558k924462o608467
487D01813278n429992J920242L945579K166977J997223K586365J921196k62261q97903
496D09760704j056175M76608N423508N676536K171288p28150n619773o478081l432503
505D06193962j993179j098366N13535L253479M215469M018059L089904K35558j95007
514D18233414K187729J475067k368927l294220j827011j916161l596764k782135O07987
523D06718979K163162L506165K555847j894226k938996j534919p64122L68576R62753
532D09143219J394272J058578k78968j078835k460251j487236L534050K890625m780807
$$ plain form
541 407934647 403619308 408224564 413765678 414016266 412153969 408750992 405395966 404832382 404165039
550 404165039 400285492 396575203 395917664 396697998 398033142 400608521 405573616 410653343 414219627
559 414219627 415478210 411952019 407061081 403826218 400966873 397953758 395552139 394188881 394348145
568 394348145 397696724 401110649 401342850 400425682 398931503 397992859 399780731 401748657 401561737
577 401561737 400753021 400183449 399532089 398154259 397881279 402306061 405496368 400159836 393969307
586 393969307 393709908 394748917 393916855 393605957 395736694 398554573 401394844 402906876 400512924
595 400512924 397226562 395368118 394438019 395317307 396182785 394616623 393282166 394760857 396877518
604 396877518 398054848 399079094 400379639 401449432 401942482 401802521 400926590 399106750 395032654
$$ packed form
541D07934647m315339M605256N541114K50588j862297l402977l355026n63584o67343
550D04165039l879547l710289o57539P80334J335144K575379M965095N079727L566284
559D14219627J258583l526191m890938l234863k859345l013115k401619j363258J59264
568C94348145L348579L413925K32201r17168j494179r38644J787872J967926j86920
577D01561737q08716n69572o51360j377830k72980M424782L190307n336532o190529
586C93969307k59399J039009q32062l10898K130737K817879K840271J512032k393952
595D00512924l286362j858444r30099Q79288Q65478j566162j334457J478691K116661
604C96877518J177330J024246J300545J069793M93050j39961q75931j819840m074096
$$ plain form
613 395032654 391905060 393818359 396778564 397455215 397951584 399358521 401381264 404881248 407478333
622 407478333 405657997 403684158 405814171 408551941 409495354 409619827 409407845 407932510 403294563
631 403294563 398891907 398278465 399083633 400472870 401389351 399728317 397796860 397509804 397939911
640 397939911 399118881 400083084 399181824 398505211 400478592 402443886 401930580 400799980 400755653 399800072
650 399800072 395289917 390863647 390059242 390533447 390986214 391823273 393287201 394567947 394641418 394392014
660 394392014 394349594 394551277 393535156 396326790 414380798 426948090 408633728 384828339 374025574
669 374025574 371520538 383006096 395781517 395625610 392790070 394138565 395613899 394946823 393635521
678 393635521 392114868 391302567 393144379 394990196 393932571 392689476 393659592 394892921 395214806
$$ packed form
613C95032654l127594J913299K960205O76651M96369J406937K022743L499984K597085
622D07478333j820336j973839K130013K737770R43413J24473k11982j475335m637947
631D03294563m402656o13442Q05168J389237R16481j661034j931457k87056M30107
640C97939911J178970R64203r01260o76613J973381J965294n13306j130600m4327r55581
650C99800072m510155m426270q04405M74205M52767Q37059J463928J280746P3471k49404
660C94392014m2420K01683j016121K791634J8054008J2567292j8314362k3805389j0802765
669C74025574k505036J1485558J2775421j55907k835540J348495J475334o67076j311302
678C93635521j520653q12301J841812J845817j057625j243095R70116J233329L21885
$$ plain form
687 395214806 394694328 392354507 390158424 389962921 391109924 394603500 397312164 395421982 391981354
696 391981354 388398895 385779381 386862030 388150711 386284828 383594742 381828766 379370689 374462585
705 374462585 369274368 366174927 362807045 357290993 350560684 343238831 334377747 323751221 309816360
714 309816360 291274071 267165413 230850449 198071480 183181286 183705559 207885265 237926006
722 237926006 257584343 270445099 274802685 270284424 251753578 231793880 219690800 220199108
730 220199108 247074852 282597542 313886166 340176353 354582558 362586975 367073784 368951340
738 368951340 370075455 370487442 370485535 371154785 374422073 378057480 380134811 381669044 383197327
747 383197327 384225845 383957863 383837929 385764351 387576332 387048950 386273155 387104988 388020515 387955437
$$ packed form
687C95214806n20478k339821k196083j95503J147003L493576K708664j890182l440628
696C91981354l582459k619514J082649J288681j865883k690086j765976k458077m908104
705C74462585n188217l099441l367882n516052o730309p321853q861084j0626526j3934861
714C09816360j8542289k4108658l6314964l2778969j4890194N24273K4179706L0040741
722B37926006J9658337J2860756M357586m518261j8530846j9959698j2103080N08308
730B20199108K6875744L5522690L1288624K6290187J4406205Q004417M486809J877556
738C68951340J124115M11987j907O69250L267288L635407K077331J534233J528283
747C83197327J028518k67982j19934J926422J811981n27382p75795Q31833R15527o5078
$$ plain form
757 387955437 387386551 386280785 385102997 384170074 383892059 384999275 386847725 389659653 391565094
766 391565094 389813194 387266388 386198273 385621796 385342827 385254135 384960175 385131607 386731873 388484001
776 388484001 389128685 389573097 390510330 391320229 391507378 391390076 391031036 390698433 390519638 390977402
786 390977402 393063316 395377388 396999359 397479782 395446320 392746696 390779953 389517059 389629364
795 389629364 390411148 391517410 392534485 393003922 392711868 390748978 388743172 388251076 388575325
804 388575325 389614563 391134987 393250465 394814491 394420853 392961731 390041122 388117294 390903015
813 390903015 394236565 394284744 393772850 394612541 395408401 395005722 394590378 395339241 396124344 395936737
823 395936737 395596008 395862350 395904083 394724121 393577118 393663864 394147148 394548874 394989243 395664444
$$ packed form
757C87955437n68886j105766j177788r32923k78015J107216J848450K811928J905441
766C91565094j751900k546806j068115n76477k78969q8692k93960J71432J600266J752128
776C88484001O44684M44412R37233Q09899J87149j17302l59040l32603j78795M57764
786C90977402K085914K314072J621971M80423k033462k699624j966743j262894J12305
795C89629364P81784J106262J017075M69437k92054j962890k005806m92096L24249
804C88575325J039238J520424K115478J564026l93638j459122k920609j923828K785721
813C90903015L333550M8179n11894Q39691P95860m02679m15344P48863P85103j87607
823C95936737l40729K66342M1733j179962j147003Q6746M83284M01726M40369O75201
$$ plain form
833 395664444 395867348 394474258 392930984 392673264 392604828 391782532 391182404 391766548 392631760 393331757
843 393331757 393455276 392013779 390290489 389198532 388857613 390210648 391700516 391765594 391362190
852 391362190 390879402 390457153 390564423 390601654 389810333 389133453 389536133 390191078 390585670 390740395
862 390740395 390400391 389878769 389214516 388973694 390017281 391496201 392897606 394070854 394616852
871 394616852 394767036 394540558 394172211 393837433 393733253 394423256 394979935 394213676 393473129 394069443
881 394069443 394925346 395437965 395494232 394522438 393293381 392282715 391802063 392730713 393840561 394083252
891 394083252 393797150 392626038 391603012 391937714 392740707 393571396 394291382 394526253 394541969 394389648
901 394389648 394338150 394783249 395392418 396023254 396501083 396455765 396327744 396386871 396772385 398013115
$$ packed form
833C95664444K02904j393090j543274k57720o8436q22296o00128N84144Q65212O99997
843C93331757J23519j441497j723290j091957l40919J353035J489868O5078m03404
852C91362190m82788m22249J07270L7231p91321o76880M02680O54945L94592J54725
862C90740395l40004n21622o64253k40822J043587J478920J401405J173248N45998
871C94616852J50184k26478l68347l34778j04180O90003N56679p66259p40547N96314
881C94069443Q55903N12619N6267r71794j229057j010666m80652R28650J109848K42691
891C94083252k86102j171112j023026L34702Q02993Q30689P19986K34871J5716j52321
901C94389648n1498M45099O09169O30836M77829m5318j28021N9127L85514J240730
$$ plain form
911 398013115 399208069 399320145 399283905 399823418 400531540 401211739 401955376 402859688 403709183 404402962
921 404402962 404692879 403971443 403215408 403455734 403919220 404055099 404223671 404744873 405187607 405077934
931 405077934 404862900 404973259 404983292 404397011 403855095 403995056 404328117 404568901 404742470 404739609 404675980
942 404675980 404580116 404603729 405011406 405489693 405906677 405980606 405102005 404119492 403750916 403778801 404488068
953 404488068 405088654 404689331 403877716 402789841 401889572 401904602 402178040 402282715 402256966 401859512
963 401859512 401498795 401624680 401869545 401931992 402060509 402440567 402956009 403641701 404228210 404380074
973 404380074 404329071 404165497 403975487 403851738 403863182 404221306 404590607 404737930 404566765 403630981
983 403630981 402745018 402704697 403117905 403991699 404923935 405546417 405763397 405214081 404323807 403210411
$$ packed form
911C98013115J194954J12076l6240N39513P08122O80199P43637R04312Q49495O93779
921D04402962K89917p21436p56035K40326M63486J35879J68572N21202M42734j09673
931D05077934k15034J10359J0033n86281n41916J39961L33061K40784J73569k861o3629
942D04675980r5864K3613M07677M78287M16984P3929q78601r82513l68576K7885P09267
953D04488068O00586l99323q11615j087875r00269J5030K73438J04675k5749l97454
963D01859512l60717J25885K44865O2447J28517L80058N15442O85692N86509J51864
973D04380074n1003j63574j90010j23749J1444L58124L69301J47323j71165r35784
983D03630981q85963m0321M13208Q73794R32236O22482K16980n49316q90274j113396
$$ plain form
993 403210411 402434349 402874718 403691521 404409866 404811401 404265900 403531570 403225670 403141022 403228760
1003 403228760 403628349 404649734 405732384 406513214 406710129 405586014 404142380 403306732 402563324
1012 402563324 401585808 400732994 400308380 400151482 400304337 400463104 400103073 399926682 400864105 401706696
1022 401706696 401114693 400410156 400890121 401286354 400313148 399319420 399538498 400028229 400093079 400223503
1032 400223503 400746841 401456604 402530670 403141975 402160645 400672684 399266243 398301353 398661118
1041 398661118 399362564 399661064 399721375 399387360 398874512 398335953 397801895 397306900 396987915 397092590
1051 397092590 397321243 397472153 397498627 397214661 396835556 396484833 396251221 396399994 396521072 396179657
1061 396179657 395715714 395144691 395005226 396245232 397650719 398016205 398262024 399122238 399948349 400284042
$$ packed form
993D03210411p76062M40369Q16803P18345M01535n45501p34330l05900q4648Q7738
1003D03228760L99589J021385J082650P80830J96915j124115j443634q35648p43408
1012D02563324r77516q52814m24614j56898J52855J58767l60031j76391R37423Q42591
1022D01706696n92003p04537M79965L96233r73206r93728K19078M89731O4850J30424
1032D00223503N23338P09763J074066O11305r81330j487961j406441r64890L59765
1041C98661118P01446K98500O0311l34015n12848n38559n34058m94995l18985J04675
1051C97092590K28653J50910K6474k83966l79105l50723k33612J48773J21078l41415
1061C96179657m63943n71023j39465J240006J405487L65486K45819Q60214Q26111L35693
$$ plain form
1071 400284042 400287170 399810333 399309883 399353027 399456253 399099121 398956299 399984131 400816917 399905701
1081 399905701 398756752 398450394 398714523 399889717 401217461 402087212 402395973 401506653 400408974
1090 400408974 399929276 399917145 400630951 401667099 402782669 403753510 404270897 404345741 403700104 402891617
1100 402891617 402487984 402178040 401843300 401473541 400999527 400479546 399816513 399406662 399865150 400435944
1110 400435944 400470276 400259743 399737587 399327507 399657478 400048027 399886856 399599075 399392624 399303894
1120 399303894 399584770 399794083 399437180 398925323 398537407 398173828 397675743 397495995 398378830 399287720
1130 399287720 399163742 398815155 398869019 398807755 398080826 397412529 397579651 397872925 397689362 397486191
1140 397486191 397559662 397787819 398103714 398638000 399835815 400685081 399981728 398745308 397469521 396525154
$$ packed form
1071D00284042L128m76837n00450M3144J03226l57132j42822J027832Q32786r11216
1081C99905701j148949l06358K64129J175194J327744Q69751L08761q89320j097679
1090D00408974m79698j2131P13806J036148J115570R70841N17387P4844o45637q08487
1100D02891617m03633l09944l34740l69759m74014n19981o63033m09851M58488N70794
1110D00435944L4332k10533n22156m10080L29971L90549j61171k87781k06451q8730
1120C99303894K80876K09313l56903n11857l87916l63579m98085j79748Q82835R08890
1130C99287720j23978l48587N3864o1264p26929o68297J67122K93274j83563k03171
1140C97486191P3471K28157L15895N34286J197815Q49266p03353j236420j275787r44367
$$ plain form
1150 396525154 396690598 397236595 397696991 398059616 398120422 397989044 397674332 397271652 396789093 396494370
1160 396494370 396662216 397276878 398715515 400072098 400389900 400197258 399477005 398905983 399507065 400224457
1170 400224457 400157928 399863014 399470329 399351120 400168648 401176224 401865959 402183762 401616821 401032448
1180 401032448 401389351 401901016 402098656 401986847 401059380 400378227 401334038 402432442 402457962 401962509
1190 401962509 400937080 399846802 399253845 398856659 398526688 398303528 398296814 398165703 397450943 396614799
1200 396614799 396011810 395503998 395076294 394713402 394416580 394118538 393631935 393318634 393646698 394108047
1210 394108047 394338837 394371262 394085388 393571129 392862091 392007103 390934944 390038719 389751205 389882317
1220 389882317 390427094 391260147 392272224 393408546 394776115 395779114 395534744 395007629 394952316
$$ packed form
1150C96525154J65444N45997M60396L62625O0806j31378l14712m02680m82559k94723
1160C96494370J67846O14662J438637J356583L17802j92642p20253n71022O01082P17392
1170D00224457o6529k94914l92685j19209Q17528J007576O89735L17803n66941n84373
1180D01032448L56903N11665J97640j11809r27467o81153R55811J098404K5520m95453
1190D01962509j025429j090278n92957l97186l29971k23160o714j31111p14760q36144
1200C96614799o02989n07812m27704l62892k96822k98042m86603l13301L28064M61349
1210C94108047K30790L2425k85874n14259p09038q54988j072159q96225k87514J31112
1220C89882317N44777Q33053J012077J136322J367569J002999k44370n27115n5313
$$ plain form
1229 394952316 395114670 395655136 396083374 395799179 395290833 394861450 394466400 394138565 393948555 394005547
1239 394005547 394223709 394738693 394994507 394111862 393194427 393336296 393685837 393663864 393545609 393359184
1249 393359184 393265953 393640976 393870125 393160095 392422676 392620811 392806053 392227402 391255150 389784813
1259 389784813 388488312 388303528 388325920 387908936 387212982 385844727 384817581 385438919 386430969 386840096
1269 386840096 387000580 386906624 386623154 386180878 385673981 385163536 384777527 384886017 384821663 383787613
1279 383787613 382542381 381571045 380894165 380834122 380968819 380996475 380876312 380387077 379768143 379351845
1289 379351845 378635406 376806488 375123024 374993095 375151138 374658813 373939972 373035431 372152557 371583481
1299 371583481 371114960 370497932 370132446 370593071 371105194 370804291 370532036 370853882 371730804 373643646
$$ packed form
1229C94952316J62354N40466M28238k84195n08346m29383l95050l27835j90010N6992
1239C94005547K18162N14984K55814q82645r17435J41869L49541k1973j18255j86425
1249C93359184r3231L75023K29149p10030p37419J98135J85242n78651r72252j470337
1259C89784813j296501j84784K2392m16984o95954j368255j027146O21338R92050M09127
1269C86840096J60484r3956k83470m42276n06897n10445l86009J08490o4354j034050
1279C83787613j245232r71336o76880o0043J34697K7656j20163m89235o18934m16298
1289C79351845p16439j828918j683464j29929J58043m92325p18841r04541q82874n69076
1299C71583481m68521o17028l65486M60625N12123l00903k72255L21846Q76922J912842
$$ plain form
1309 373643646 375597458 376571426 377121201 377216110 377593765 379572144 381377220 381249199 380462189 379551163
1319 379551163 378970375 379687538 380693893 381142387 381512146 382112503 382604370 382688751 382553329 382204285
1329 382204285 381887207 381891022 382090073 382470627 382983437 384007225 384242058 382317314 378821144 372772675
1339 372772675 367505302 367263336 368331451 368012199 367495041 367303391 366738091 364953995 362911224
1348 362911224 361136932 360083084 360974808 362019310 361333618 360412827 360306740 360467186 360613098
1357 360613098 360990295 362775345 362892876 357193451 350075226 344295731 340625038 342279892 344675522
1366 344675522 342837830 341151466 343277702 346410522 350123177 350938568 342980881 333018303 326371689
1375 326371689 321506042 318440914 317832470 320547104 325971146 333876381 343971252 357494812
$$ packed form
1309C73643646J953812R73968N49775R4909L77655J978379J805076j28021p87010r11026
1319C79551163n80788P17163J006355M48494L69759O00357M91867Q4381j35422l49044
1329C82204285l17078L815J99051L80554N12810J023788K34833j924744l496170o048469
1339C72772675n267373k41966J068115l19252n17158j91650n65300j784096k042771
1348C62911224j774292j053848Q91724J044502o85692r20791j06087J60446J45912
1357C60613098L77197J785050J17531n699425p118225n779495l670693J654854K395630
1366C44675522j837692j686364K126236L132820L712655Q15391p957687r962578o646614
1375C26371689m865647l065128o08444K714634N424042P905235J0094871J3523560
$$ plain form
1383 357494812 369625549 374917259 376480103 374088058 372300873 376868744 383994331 393884430
1391 393884430 400276184 392735252 383983383 386629333 390577774 388370972 384703636 380910149 379612923
1400 379612923 387007484 393708725 389477005 383070946 380462646 379771729 382105827 384470215 383138428
1409 383138428 381409874 381731262 382934799 384237518 386928101 394916306 399554024 390133858 376743317
1418 376743317 364469070 357602615 367653122 378052940 370840302 361703148 363570709 366754303
1426 366754303 365517845 360930939 349963684 339176178 335289955 334787827 339701424 340103378 320900917
1435 320900917 299620857 291129589 288315773 290613403 293249855 289349785 284654846 283732643 283227444
1444 283227444 281710625 277966022 268341293 258712997 256161213 253421307 243104706 232659817
$$ packed form
1383C57494812J2130737N291710J562844k392045j787185M567871P125587R890099
1391C93884430O391754p540932q751869K645950L948441k206802l667336l793487j297226
1400C79612923P394561O701241m231720o406059k608300o90917K334098K364388j331787
1409C83138428j728554L21388J203537J302719K690583P988205M637718r420166j3390541
1418C76743317j2274247o866455J0050507J0399818p212638r137154J867561L183594
1426C66754303j236458m586906j0967255j0787506l886223n02128M913597M01954j9202461
1435C20900917k1280060q491268k813816K297630K636452l900070m694939r22203n05199
1444B83227444j516819l744603r624729r628296k551784k739906j0316601j0444889
$$ plain form
1452 232659817 231254101 226339111 203345776 177502403 162304878 148380041 129595041 109724760
1460 109724760 87998152 71919680 71303368 78448534 89669228 102733135 114223957 124007702
1468 124007702 132491350 134634018 115916252 105178356 134632111 179640045 228811741 274615288
1476 274615288 302907715 322131882 335798264 344559898 348973503 352837067 361740341 370861511
1484 370861511 377158890 380879173 381752472 378284912 364530792 353574524 360509415 373362541
1492 373362541 387168427 395996552 387782097 375961533 371424446 369744530 368958969 372564774
1500 372564774 384748001 401476364 427699318 440657845 405057449 363451958 352497101 354589691
1508 354589691 367609024 381762733 381727676 381973991 398336411 411395302 398648033 385177155
$$ packed form
1452B32659817j405716m914990k2993335k5843373j5197525j3924837j8785000j9870281
1460A09724760k1726608j6078472o16312P145166J1220694J3063907J1490822R783745
1468A24007702Q483648K142668j8717766j0737896K9453755M5007934M9171696M5803547
1476B74615288K8292427J9224167J3666382Q761634M413605L863564Q903274R121170
1484C70861511O297379L720283Q73299l467560j3754120j0956268O934891J2853126
1492C73362541J3805886Q828125q214455j1820564m537087j679916p85561L605805
1500C72564774J2183227J6728363K6222954J2958527l5600396m1605491j0954857K092590
1508C54589691J3019333J4153709l5057K46315J6362420J3058891j2747269j3470878
$$ plain form
1516 385177155 395635376 408809891 410489082 404320488 382545471 365169525 379369736 395871887
1524 395871887 386929512 375134468 376470108 383013954 394198914 403941154 405209541 400276642
1532 400276642 381984253 371590614 399234772 431115875 441737404 436325073 401660194 367576370
1540 367576370 368680000 377431412 373255234 369861374 376885643 385973206 391817322 394907722 391606102
1549 391606102 388987045 395882111 403382530 400338402 402304153 435302963 456778755 415236473
1557 415236473 363514404 340797882 336549759 362416992 391030083 390698929 386031647 396058807
1565 396058807 405819893 405585518 398689728 379037628 365186234 381783714 404458542 418116570
1573 418116570 419569740 390199890 361201515 365844269 379284630 386679878 391294250 389821281
$$ packed form
1516C85177155J0458221J3174515J679191o168594k1775017j7375946J4200211J6502151
1524C95871887q942375j1795044J335640O543846J1184960R742240J268387m932899
1532D00276642j8292389j0393639K7644158L1881103J0621529n412331l4664879l4083824
1540C67576370J103630Q751412m176178l393860P024269R087563N844116L090400l301620
1549C91606102k619057O895066P500419l044128J965751L2998810K1475792m1542282
1557D15236473n1722069k2716522m248123K5867233K8613091l31154m667282J0027160
1565C96058807R761086k34375o895790j9652100j3851394J6597480K2674828J3658028
1573D18116570J453170k9369850k8998375M642754J3440361P395248M614372j472969
$$ plain form
1581 389821281 387126465 388029556 389360199 389049530 388608932 389195938 389801483 389467468 389199257 390176773
1591 390176773 390916595 389870148 388411522 387352448 386827469 387453537 388592720 390109787 391113281
1600 391113281 390018921 388769150 389129181 390044708 391418686 392141800 390505066 388209572 385637283
1609 385637283 385033836 389240990 396852036 412838936 420904617 396342506 369350662 366404762
1617 366404762 373962631 391651154 406436920 399817963 387823830 380361786 377295494 386076698
1625 386076698 393844833 384618530 375212173 379935989 390319595 405123215 416962395 418028603
1633 418028603 408353348 376415977 349062691 359074364 377125740 380171776 382150192 390881042
1641 390881042 401670685 416844597 423164139 398468018 371849785 366944809 377964973 421276093
$$ packed form
1581C89821281k694816R03091J330643l10669m40598N87006O05545l34015k68211R77516
1591C90176773P39822j046447j458626j059074n24979O26068J139183J517067J003494
1600C91113281j094360j249771L60031R15527J373978P23114j636734k295494k572289
1609C85637283o03447M207154P611046J5986900Q065681k4562111k6991844k945900
1617C66404762P557869J7688523J4785766o618957j1994133p462044l066292Q781204
1625C86076698P768135r226303r406357M723816J0383606J4803620J1839180J066208
1633D18028603r675255l1937371k7353286J0011673J8051376L046036J978416Q730850
1641C90881042J0789643J5173912O319542k4696121k6618233m904976J1020164M3311120
$$ plain form
1649 421276093 454049835 422460327 375865211 346285591 331905594 349969864 375315666 384415398
1657 384415398 389608154 398394585 401761055 387386322 372690659 373959541 382276535 397400360
1665 397400360 409588318 406291237 395686378 376674423 364532928 384835243 405591507 395036240
1673 395036240 378069382 369514694 367833633 380356789 395297050 399468422 404396782 428308945
1681 428308945 437915802 384724846 332572212 346570244 374395142 379916191 379665604 375763664
1689 375763664 375314484 391451111 408204079 412415504 408782501 391358376 378915787 402320137
1697 402320137 419343224 378942719 338424911 352554092 377911797 386103859 386821747 376520615
1705 376520615 366513748 370335579 377774239 382087479 386399994 392155151 397652130 403285255
$$ packed form
1649D21276093L2773742l1589508m6595116k9579620j4379997J8064270K5345802R099732
1657C84415398N192756Q786431L366470j4374733j4695663J268882Q316994J5123825
1665C97400360J2187958l297081j0604859j9011955j2141495K0302315K0756264j0555267
1673C95036240j6966858q554688j681061J2523156J4940261M171372M928360K3912163
1681D28308945R606857n3190956n2152634J3998032K7824898N521049k50587l901940
1689C75763664m49180J6136627J6752968M211425l633003j7424125j2442589K3404350
1697D02320137J7023087m0400505m0517808J4129181K5357705Q192062P17888j0301132
1705C76520615j0006867L821831P438660M313240M312515N755157N496979N633125
$$ plain form
1713 403285255 404208908 393717766 377784500 355847130 340803871 352494469 369531403 374418488
1721 374418488 375318756 373304367 372151604 378091583 384829292 386414757 388042908 393981476 401061287
1730 401061287 413119812 413404236 370229263 332229614 353940239 385974655 391082993 387389183
1738 387389183 378328781 370713959 376306992 383692017 382403870 381350288 389151802 396203270 394190063
1747 394190063 387860069 377590904 368178596 364630699 366687546 380179405 391841660 384618301
1755 384618301 375710258 380503654 387386780 389800568 387972603 375445862 365712395 375712624
1763 375712624 388642311 390508194 389814377 390726089 392266998 397871246 398470154 379437447 360879173
1772 360879173 362900963 370876312 376002312 380912552 386602173 389183273 381607780 374351730 379488220
$$ packed form
1713D03285255R23653j0491142j5933266k1937370j5043259J1690598J7036934M887085
1721C74418488R00268k014389j152763N939979O737709J585465J628151N938568P079811
1730D01061287J2058525K84424m3174973l7999649K1710625L2034416N108338l693810
1738C87389183r060402p614822N593033P385025j288147j053582P801514P051468k013207
1747C94190063o329994j0269165r412308l547897K056847J3491859J1662255p223359
1755C84618301q908043M793396O883126K413788j827965j2526741r733467J0000229
1763C75712624J2929687J865883o93817R11712J540909N604248N98908j9032707j8558274
1772C60879173K021790P975349N126000M910240N689621K581100p575493p256050N136490
$$ plain form
1781 379488220 385178070 380371323 374771118 375283012 379249802 388162842 396479378 399565468 396185150
1790 396185150 378173828 361680260 364877472 373525391 378585091 382626305 385706177 386322975
1798 386322975 381348839 375716438 373928070 374145279 376646500 379580994 380776901 381472816 382829437
1807 382829437 382907867 378907204 374573212 373023987 373340378 376738319 379927864 378873100 377026787
1816 377026787 376674423 377278328 379087677 382026215 387932053 391310463 383463631 375838776 380644798
1825 380644798 386896133 386921158 382985840 371628036 362358551 367314339 375153313 377168198 377590179
1834 377590179 377923737 377641907 375263672 375154495 384125710 393356781 396372299 392946014 375317802
1843 375317802 359611053 364993324 374570847 375471115 374796638 376014481 377157211 377143135 376780281
$$ packed form
1781C79488220N689850m806747n600205N11894L966790Q913040Q316536L086090l380318
1790C96185150j8011322j6493568L197212Q647919N059700M041214L079872O16798
1798C86322975m974136n632401j788368K17209K501221K934494J195907O95915J356621
1807C82829437P8430m000663m333992j549225L16391L397941L189545j054764j846313
1816C77026787l52364O03905J809349K938538N905838L378410p846832p624855M806022
1825C80644798O251335K5025l935318j1357804r269485M955788P838974K014885M21981
1834C77590179L33558k81830k378235j09177Q971215R231071L015518l426285j7628212
1843C75317802j5706749N382271R577523R00268o74477J217843J142730j4076l62854
$$ plain form
1852 376780281 376502037 376349945 376656036 376979599 376933823 376685143 376026154 375690460 376204491 377979050
1862 377979050 382518768 387065887 390136948 389412880 379079361 368136177 364958992 365603447 370069733
1871 370069733 374896049 375649681 375243416 375302315 375254631 374999771 374747276 374666214 374777565 375423203
1881 375423203 375809669 374332428 373765945 378408890 382083168 378109436 372287979 367858162 365822296
1890 365822296 370480537 375175705 372729073 369002838 368050575 368117332 368916283 370094070 371348152
1899 371348152 372239342 371824036 371310463 371845970 372666359 373595009 374014359 372871399 371294250 369844894
1909 369844894 369168510 370422134 372629395 375806808 378132095 377335052 374774208 369727859 366163712
1918 366163712 370257149 374663124 372178574 368551483 367607841 367909431 369901886 371758232 371082077
$$ packed form
1852C76780281k78244j52092L06091L23563m5776k48680o58989l35694N14031J774559
1862C77979050M539718M547119L071061p24068j0333519j0943184l177185O44455M466286
1871C70069733M826316P53632m06265N8899m7684k54860k52495q1062J11351O45638
1881C75423203L86466j477241n66483M642945L674278l973732n821457m429817k035866
1890C65822296M658241M695168k446632l726235r52263O6757P98951J177787J254082
1899C71348152Q91190m15306n13573N35507Q20389R28650M19350j142960j577149j449356
1909C69844894o76384J253624K207261L177413K325287p97043k560844n046349l564147
1918C66163712M093437M405975k484550l627091r43642L01590J992455J856346o76155
$$ plain form
1927 371082077 370027084 370259056 370842438 371464500 371919403 371754875 371396561 370819817 370920181 373235703
1937 373235703 375813484 377624741 377432594 371885529 366296043 366219025 367572556 367667198 367878189
1946 367878189 368959656 370083580 370527267 370727768 370987167 370984802 370239716 369534721 369745026 370111694
1956 370111694 370086441 369909286 369528770 369268417 369407425 370024185 372000198 373203735 370772858 367776146
1966 367776146 366608620 366429100 367624741 368905792 368718872 368239174 368290901 368372917 368122826 367946625
1976 367946625 368268509 368669052 368874550 368871231 368391037 367919922 367983322 368191490 368126144 368396034 370050430
1987 370050430 371347885 370561371 368695984 365470657 363015175 364394417 366519470 366919289 366802444
1996 366802444 366563568 366171341 365608673 365226288 365634193 366034737 365597954 365028152 364958267 364772072
$$ packed form
1927C71082077j054993K31972N83382O22062M54903j64528l58314n76744J00364K315522
1937C73235703K577781J811257j92147n547065n589486p7018J353531R4642K10991
1946C67878189J081467J123924M43687K00501K59399k365p45086p04995K10305L66668
1956C70111694k5253j77155l80516k60353J39008O16760J976013J203537k430877k996712
1966C67776146j167526j79520J195641J281051j86920m79698N1727Q2016k50091j76201
1976C67946625L21884M00543K05498l319m80194m71115O3400K08168o5346K69890J654396
1987C70050430J297455p86514j865387l225327k455482J379242K125053L99819j16845
1996C66802444k38876l92227n62668l82385M07905M00544m36783n69802o9885j86195
$$ plain form
2006 364772072 363728027 362832794 363176575 363764038 363820305 363772888 364058266 363874207 362084389 360126953
2016 360126953 359201660 358884354 359325638 359999657 360382309 360616913 360583801 360545883 360792885 361123314
2026 361123314 361426582 361717224 361998062 362190971 362199554 362077484 361757507 361503601 361651192 361917038
2036 361917038 362199326 362286339 361751556 361136932 360851517 360865097 361451378 362105865 362283478 362379303
2046 362379303 362749825 362964401 362544289 361987114 361702690 361473808 361149292 360940208 361026993 361348152
2056 361348152 362049828 362687836 362680206 362583885 363078346 363212128 361693611 360222588 360488892 361230392
2066 361230392 361731758 362041931 361829529 361519585 361491928 361548653 361673126 361700783 361314774 360952606
2076 360952606 361150284 361293564 360729675 360110512 359910240 360006104 360579987 361188889 361367455 361362915
$$ packed form
2006C64772072j044045q95233L43781N87463N6267m7417K85378j84059j789818j957436
2016C60126953r25293l17306M41284O74019L82652K34604l3112l7918K47002L30429
2026C61123314L03268K90642K80838J92909Q583j22070l19977k53906J47591K65846
2036C61917038K82288Q7013n34783o14624k85415J3580N86281O54487J77613R5825
2046C62379303L70522K14576m20112n57175k84424k28882l24516k09084Q6785L21159
2056C61348152P01676O38008p630r6321M94461J33782j518517j471023K66304P41500
2066C61230392N01366L10173k12402l09944k7657N6725J24473K7657l86009l62168
2076C60952606J97678J43280n63889o19163k00272R5864N73883O08902J78566m540
$$ plain form
2086 361362915 361260910 361081123 360863190 360629807 360400696 360222092 360178947 360175362 360119820 360083084 360122223
2097 360122223 360185623 360237579 360288162 360384712 360377808 359985580 359651794 359921684 360207329 359958878 359605560
2108 359605560 359423866 359320412 359297752 359342117 359501343 359592896 359306335 359070053 359392891 359720688
2118 359720688 359578857 359235992 358754387 358275185 357970963 357807159 357848167 357967834 358160477 358128777
2128 358128777 357370377 356494446 355961075 355713844 356022339 356367569 356174698 355879059 355742455 355710258
2138 355710258 355847359 356055031 356318970 356447678 356195908 355711212 354898911 354237061 354329605 354704132
2148 354704132 355151405 355484734 355275650 355039139 355307350 355597267 355489502 355322838 355377426 355409622
2158 355409622 355235100 354955215 354527473 354197731 354293823 354526062 354723701 354854813 354814987 354649544
$$ packed form
2086C61362915j02005j79787k17933k33383k29111j78604m3145l585n5542l6736L9139
2097C60122223O3400N1956N0583R6550o904l92228l33786K69890K85645k48451l53318
2108C59605560j81694j03454k2660M4365J59226R1553k86561k36282L22838L27797
2118C59720688j41831l42865m81605m79202l04222j63804M1008J19667J92643l1700
2128C58128777p58400q75931n33371k47231L08495L45230j92871k95639j36604l2197
2138C55710258J37101K07672K63939J28708k51770m84696q12301o61850R2544L74527
2148C54704132M47273L33329k09084k36511K68211K89917j07765j66664N4588L2196
2158C55409622j74522k79885m27742l29742R6092K32239J97639J31112l9826j65443
$$ plain form
2168 354649544 354297638 353970032 353859901 353958588 354420662 354946594 355293999 355445137 355194817 354861259
2178 354861259 354795456 354691505 354271889 353802681 353459358 353234787 353224983 353294601 353360901 353358765 353090286
2189 353090286 352869034 353044510 353309174 353432884 353530159 353624802 353755226 354087372 354259491 353761215
2199 353761215 353202362 353147278 353219261 353231659 353176842 352875214 352652779 352886925 353242874 353583336 353692284
2210 353692284 353098869 352426758 352286110 352243652 351967583 351762772 351986389 352148781 351628304 351175766
2220 351175766 351540794 352104187 352467537 352717400 352800598 352735977 352505684 352166405 351721268 351310005
2230 351310005 351108551 351011505 350999832 350988159 350816498 350688477 350801697 351011276 351334343 351480484 350982208
2241 350982208 350385666 350140572 350068321 350225449 350353699 350124588 349805603 349507828 349371414 349693298
$$ packed form
2168C54649544l51906l27606j10131R8687M62074N25932L47405J51138k50320l33558
2178C54861259o5803j03951m19616m69208l43323k24571r804O9618O6300k136k68479
2189C53090286k21252J75476K64664J23710R7275R4643J30424L32146J72119m98276
2199C53761215n58853n5084P1983J2398n4817l01628k22435K34146L55949L40462J08948
2210C53692284n93415o72111j40648m2458k76069k04811K23617J62392n20477m52538
2220C51175766L65028N63393L63350K49863Q3198o4621k30293l39279m45137m11263
2230C51310005k01454r7046j1673Tj71661j28021J13220K09579L23067J46141m98276
2241C50982208n96542k45094p2251J57128J28250k29111l18985k97775j36414L21884
$$ plain form
2251 349693298 350112686 350298882 350456009 350828171 350963593 350290527 349411469 348715782 348269958 348355522
2261 348355522 348716011 349300385 349773178 349673996 349326630 348916550 348397026 347756615 347071648 346324463
2271 346324463 345782776 345904121 346099625 345813522 345401993 344976425 344715576 344827881 345335960 346453171
2281 346453171 347813377 349280586 350377083 350332985 349886894 349535217 349234581 349193802 349150429 348754654
2291 348754654 348475227 348841667 349321594 349422913 349550705 350098381 350607376 350493927 350526581 351463547
2301 351463547 352751961 354291458 355481644 355447540 354910622 354421387 353615761 352046509 350513229
2310 350513229 349524269 349504700 351337204 354154358 357796173 361020813 362654915 362329025 358389626
2319 358389626 353514900 349694748 347339401 348717918 350243797 347799301 345246811 346368332 347283859
$$ packed form
2251C49693298M19388J86196J57127L72162J35422o73066q79058o95687m45824Q5564
2261C48355522L60489N84374M72793r9182l47366m10080n19524o40411o84967p47185
2271C46324463n41687J21345J95504k86103m11529m25568k60849J12305N08079J117211
2281C46453171J360206J467209J096497m4098m46091l51677l00636m0779m3373l95775
2291C48754654k79427L66440M79927J01319J27792N47676N08995j13449L2654R36966
2301C51463547J288414J539497J190186l4104n36918m89235q05626j569252j533280
2310C50513229r88960j9569J832504K817154L641815L224640J634102l25890l939399
2319C58389626m874726l820152k355347J378517J525879k444496k552490J121521R15527
$$ plain form
2328 347283859 344013672 340636749 340142021 341817856 347547531 352533569 351188660 347763290 344790459
2337 344790459 341832657 340511551 337181091 327816238 315172195 296692123 284286976 291883698
2345 291883698 310874939 341522675 371142616 384938011 389507294 384190331 375964890 373554687
2353 373554687 371061783 364959946 356857529 346497040 335947266 327395935 320228806 314671993
2361 314671993 310392609 307114124 304891815 303919315 303503990 302721024 302458992 303702583 305236816
2370 305236816 306001892 306513786 306892395 307265511 307660828 308496246 310238609 312767506 316355476
2379 316355476 320289841 323957672 327329865 330079308 332486649 334724884 336786995 338953018 340532074
2388 340532074 340562592 340135574 340106735 340217819 340594063 340940475 340893250 340784302 340918312 341009598 340809822
$$ packed form
2328C47283859l270187l376923m94728J675835N729675M986038j344909l425370k972831
2337C44790459k957802j321106l330460r364853j2644043j8480072j2405147P596722
2345B91883698J8991241L0647736K9619941J3795395M569283n316963q225441k410203
2353C73554687k492904o101837q102417j0360489j0549774q551331p167129n556813
2361C14671993m279384l278485k222309r72500m15325p82966k62032J243591J534233
2370C05236816P65076N11894L78609L73116L95317Q35418J742363K528897L587970
2379C16355476L934365L667831L372193K749443K407341K238235K062111K166023J579056
2388C40532074L0518m27018k8839J11084L76244L46412m7225j08948J34010R1286j99776
$$ plain form
2399 340809822 340510864 340181808 339941483 340031624 340149384 339998016 339799156 339706650 339625587 339515686
2409 339515686 339364052 339083900 338853378 338895798 338985672 338930855 338851204 338847160 338783989 338498611 338173866
2420 338173866 337903252 337788582 338012466 338425865 339082947 339555283 339172821 338711510 338889847 339208145
2430 339208145 339365234 339480896 339596519 339643021 339512825 339361420 339337120 339351883 339454880 339382896 338639488
2441 338639488 337971191 338216782 338602791 338520279 338314056 338158836 337953339 337486992 337259293 337976456
2451 337976456 338805199 339103928 339001884 338232765 337340126 336857071 336546898 336336594 336266289 336371422
2461 336371422 336592178 336961021 337235680 337101440 336805344 336524963 336150169 335532913 334961166 334731598
2471 334731598 334669342 334741592 334819565 334725151 334572067 334371109 334250946 334415436 334646683 334801445 334859390
$$ packed form
2399C40809822k98958l29056k40325R0141J17760j51368j98860r2506q1063j09901
2409C39515686j51634k80152k30522M2420Q9874n4817p9651m044o3171k85378l24745
2420C38173866k70614j14670K23884M13399O57082M72336l82462m61311J78337L18298
2430C39208145J57089J15662J15623M6502j30196j51405k4300J4763J02997p1984p43408
2441C38639488o68297K45591L86009q2512k06223j55220k05497m66347k27699P17163
2451C37976456Q28743K98729j02044p69119q92639m83055l10173k10304p0305J05133
2461C36371422K20756L68843K74659j34240k96096k80381l74794o17256n71747k29568
2471C34731598o2256P2250P7973r4414j53084k00958j20163J64490K31247J54762N7945
$$ plain form
2482 334859390 334770203 334479332 333783150 333077660 332804184 332620850 332224350 331938744 332107544 332367172
2492 332367172 332394829 332410583 332628479 332742691 332463036 331956635 331148605 330474129 330490341 330755234
2502 330755234 331110001 331258774 330599556 329891434 329849014 330000877 330119858 330185165 330039749 329863777
2512 329863777 329846382 329801331 329592705 329255600 328714371 328163605 327801208 327540894 327358475 327264328
2522 327264328 327302933 327345848 327355385 327102661 326053848 325083733 325163612 325469513 325412292 325255890 325027924
2533 325027924 324844818 324859619 324987640 325246811 325482140 325566521 325431595 324857712 324169388 323656540
2543 323656540 323203316 322724571 322416763 322594414 322816620 322624931 322384834 322421074 322397232 321951866
2553 321951866 321481934 321307182 321297150 321511993 321697960 321569672 321279068 320871582 320378075 319758644
$$ packed form
2482C34859390q9187k90871o96182p05490k73476j83334l96500k85606J68800K59628
2492C32367172K7657J5754K17896J14212k79655n06401q08030o74476J6212K64893
2502C30755234L54767J48773o59218p08122m2420J51863J18981O5307j45416j75972
2512C29863777j7395m5051k08626l37105n41229n50766l62397k60314j82419r4147
2522C27264328L8605M2915R537k52724j048813r70115P9879L05901n7221j56402k27966
2533C25027924j83106J4801J28021K59171K35329Q4381j34926n73883o88324n12848
2543C23656540m53224m78745l07808J77651K22206j91689k40097L6240k3842m45366
2553C21951866m69932j74752j0032K14843J85967j28288k90604m07486m93507o19431
$$ plain form
2563 319758644 319267750 319268951 319391727 319354286 319254398 319060326 318878403 318830013 318838596 318905830 318914890 318701973
2575 318701973 318406334 318127632 317820549 317476044 317081451 316590309 316092720 315659046 315301170 315098763
2585 315098763 314916611 314570904 314286232 314309349 314388275 314340115 314202785 313945541 313590050 313168049
2595 313168049 312618732 311753044 310985336 310792923 310794830 310783615 310714493 310435066 310059547 309671879 309209595
2606 309209595 308492661 307956924 308192730 308556328 308617115 308322430 307253361 306074867 305353165 304961929
2616 304961929 305089226 305356503 305382957 305361519 305476418 305370331 304601192 303606262 302624474 301805496
2626 301805496 301477432 301341057 301227341 301070690 300730476 300260315 299568653 298949966 298711300 298723221
2636 298723221 299054375 299417496 299520721 299443245 299036751 298689613 298885822 299189568 299374809 299294701
$$ packed form
2563C19758644m90894J201J22776l7441r9888j94072j81923m8390Q583O7234R060k12917
2575C18701973k95639k78702l07083l44505l94593m91142m97589m33674l57876k02407
2585C15098763j82152l45707k84672K3117P8926m8160j37330k57244l55491m22001
2595C13168049n49317q65688p67708j92413J907j1215o9122k79427l75519l87668m62284
2606C09209595p16934n35737K35806L63598O0787k94685j069069j178494p21702l91236
2616C04961929J27297K67277K6454k1438J14899j06087p69139r94930r81788q18978
2626C01805496l28064j36375j13716j56651l40214m70161o91662o18687k38666J1921
2636B98723221L31154L63121J03225p7476m06494l47138J96209L03746J85241q0108
$$ plain form
2646 299294701 298466206 297670841 297721863 298041115 298381329 298562527 298187256 297659149 297237396 296956291
2656 296956291 297041664 297174931 297045479 296852837 296675682 296563625 296669006 296758652 296604156 296340714
2666 296340714 295917034 295663109 296048641 296602726 297004471 297270546 297200432 297122231 297430763 297723770
2676 297723770 297644844 297448158 297234764 297107697 297267189 297519913 297729969 297922134 298095474 298190346
2686 298190346 298091164 297964821 297941208 298012733 298244247 298548470 298904648 299178123 299179802 299049854 298851490
2697 298851490 298623562 298432827 298258553 298091660 297963371 297950516 297905197 297626266 297348747 297297707
2707 297297707 297298660 297314167 297154903 296516895 295704842 294848442 294167042 294085274 294115543 293769360 293470612
2718 293470612 293589821 293796062 293932686 293845177 293177834 292376289 291823864 291349411 290893326 290501595
$$ packed form
2646B99294701q28495p95365N1022L19252L40214J81198l75271n28107m21753k81105
2656B96956291Q5373J33267j29452j92642j77155j12057J05381Q9646j54496k63442
2666B96340714m23680k53925L85532N54085M01745K66075p0114p8201L08532K93007
2676B97723770p8926j96686k13394j27067J59492K52724K10056J92165J73340R4872
2686B98190346r9182j26343k3613P1525K31514L04223L56178K73475J679j29948j98364
2697B98851490k27928j90735j74274j66893j28289j2855m5319k78931k77519n1040
2707B97297707R53J5507j59264o38008q12053q56400o81400q1768L0269l46183k98748
2718B93470612J19209K06241J36624q7509o67343q01545n52425m74453m56085l91731
$$ plain form
2728 290501595 290197849 289989243 289960136 289902687 289493561 289162636 289343109 289701233 290085068 290379047
2738 290379047 290349236 290195236 290080299 289876461 289421806 288979053 288774490 288755417 288961887 289341698
2748 289341698 289968967 290501366 290549755 290326118 289857635 289309502 288915634 288495541 287864456 287269115
2758 287269115 287015438 286740532 286065826 285341988 284782639 284417152 284472237 284568310 284433365 283970356
2768 283970356 282829514 281494865 280312538 279343605 278942108 278573513 277706146 276685715 275723457
2777 275723457 274690628 273472061 272234917 271152973 270087719 268957863 267765522 266451836 265117416
2786 265117416 263903389 262628784 261115074 259493103 257835159 256134987 254364967 252661228 251261711
2795 251261711 249830475 248044243 246103287 244065285 242033958 240156403 238358974 236624489 234929085
$$ packed form
2728B90501595l03746k08606k9107n7449m09126l30925J80473L58124L83835K93979
2738B90379047k9811j54000j14937k03838m54655m42753k04563j9073K06470L79811
2748B89341698O27269N32399M8389k23637m68483n48133l93868m20093o31085n95341
2758B87269115k53677k74906o74706p23838n59349l65487N5085R6073j34945m63009
2768B83970356j140842j334649j182327r68933m01497l68595q67367j020431r62258
2777B75723457j032829j218567j237144j081944j065254j129856j192341j313686j334420
2786B65117416j214027j274605j513710j621971j657944j700172j770020j703739j399517
2795B51261711j431236j786232j940956k038002k031327j877555j797429j734485j695404
$$ plain form
2804 234929085 233336449 231563568 229194641 226689816 224412918 222235680 220240116 218158245 215684166
2813 215684166 213011742 210250130 207344055 204389095 201039085 196644554 192210674 188882828 185588837
2822 185588837 181594124 177030334 171627522 165854931 160275936 154335022 147645235 140263796 132114172
2831 132114172 123208046 113545418 103083372 91747284 79628706 66506863 53242207 40413857
2839 40413857 28641701 18659353 10704994 5479336 2327442 1121998 979662 954390 1105785
2848 1105785 1180410 1171350 888109 627518 482559 873566 2300978 4615068 7901907 11953592
2858 11953592 16628027 21811247 27529478 33219814 38256884 42853117 47115564 50732613 53322315
2867 53322315 55200100 56548595 57382584 57805538 57733774 57053089 55956602 54581642 52979469
$$ packed form
2804B34929085j592636j772881k368927k504825k276898k177238j995564k081871k474079
2813B15684166k672424k761612k906075k954960l350010m394531m433880l327846l293991
2822A85588837l994713m563790n402812n772591n578995n940914o689787p381439q149624
2831A32114172q906126r662628j0462046j1336088j2118578j3121843j3264656j2828350
2839D0413857j1772156r982348p954359n225658l151894j205444j42336k5272J51395
2848A105785P4625r060k83241k60591j44959L91007J427412K314090L286839M051685
2858A1953592M674435N183220N718231N690336N037070M596233M262447L617049K589702
2867E3322315J877785J348495Q33989M22954p1764o80685j096487j374960j602173
$$ plain form
2876 52979469 51292419 49382210 47218084 44618607 41231394 37538290 33844233 30327082 27397871
2885 27397871 24659872 21721125 18975019 16704559 14847279 13605833 12465000 10833979 9141922
2894 9141922 7583141 6267786 5425215 4889965 4647017 4471540 4145145 3632545 2675295 1724243
2904 1724243 1195431 931978 982761 1144409 1201630 1237869 1297474 1281261 982761 767231 1124859
2915 1124859 1471519 1192093 868082 1009941 1215935 1177549 1123190 1270294 1340389 1017809 630140
2926 630140 436068 324011 231028 268221 514507 1000166 1780510 2859116 4146099 5974770
2936 5974770 8736610 12164831 16092777 20610571 25882244 31518698 37244320 42879581 48247576
2945 48247576 53064823 57022095 60019255 61602116 62520266 63422680 64156055 64680099 65303564
$$ packed form
2876E2979469j687050j910209k164126k599477l387213l693104l694057l517151k929211
2885B7397871k737999k938747k746106k270460j857280j241446j140833j631021j692057
2894I141922j558781j315355q42571n35250k42948j75477l26395n12600r57250r51052
2904A724243n28812k63453N0783J61648N7221L6239N9605j6213k98500k15530L57628
2915A124859L46660k79426l24011J41859K05994l8386n4359J47104P0095l22580l87669
2926F30140j94072j12057r2983L7193K46286M85659P80344J078606J286983J828671
2936E974770K761840L428221L927946M517794N271673N636454N725622N635261N367995
2945D8247576M817247L957272K997160J582861R18150R02414P33375N24044O23465
$$ plain form
2954 65303564 66324711 67732573 69546700 71974039 75284958 79306841 83899021 89234114 95378876
2963 95378876 102507830 111136436 120305061 129103899 137899160 146787167 155666828 164575806 173192749
2972 173192749 181183338 188622704 195415268 201739082 207745552 213415623 218798409 223839989 228591690
2981 228591690 232785950 235880852 238749504 242379913 245882988 248485336 250828266 253453979 255884171
2990 255884171 257793903 259263515 260023842 260797501 262438049 264281998 265926132 267440567 268752098
2999 268752098 269885292 270867577 271615257 271804333 272180328 273697624 275403500 276586761 277474632
3008 277474632 277955284 278334389 278944969 279591084 280180702 280732880 281230698 281687737 282034645 282502403
3018 282502403 283499947 284422150 284615288 284631500 284763107 285135746 286176453 287271500 287932873 288210392
$$ packed form
2954F5303564J021147J407862J814127K427339L310919M021883M592180N335093O144762
2963I5378876P128954Q628606R168625Q798838Q795261Q888007Q879661Q908978Q616943
2972A73192749P990589P439366O792564O323814O006470N670071N382786N041580M751701
2981B28591690M194260L094902K868652L630409L503075K602348K342930K625713K430192
2990B55884171J909732J469612P60327P73659J640548J843949J644134J514435J311531
2999B68752098J133194R82285P47680J89076L75995J517296J705876J183261Q87871
3008B77474632M80652L79105O10580O46115N89618N52178M97818M57039L46908M67758
3018B82502403R97544R22203J93138J6212J31607L72639J040707J095047O61373K77519
$$ plain form
3028 288210392 287680149 287273178 288092384 289196014 289915314 290532837 291143417 291638851 291806450 292053223
3038 292053223 292886734 293791771 294373283 294778099 294962158 295102844 295414925 295739403 295851231 296159744
3048 296159744 297249069 298367977 298831463 299024353 299109688 299066067 298826694 298689365 298971653 299546967
3058 299546967 300558319 301511040 301850319 301899433 301765442 301540852 301317444 301204681 301380882 301727772
3068 301727772 302262783 302755585 302875519 302938690 303162804 303511848 304165115 304691792 304581165 304251194
3078 304251194 303896675 303675175 303899994 304296494 304634571 305093765 305924416 306683311 306848755 306906223
3088 306906223 307196140 307629356 308376541 308995476 308894157 308690796 308893929 309238911 309689999 310065994
3098 310065994 310068130 310013294 310145607 310384521 310748825 311182976 311660767 312112331 312467804 312698593
$$ packed form
3028B88210392n30243m06971Q19206J103630P19300O17523O10580M95434J67599K46773
3038B92053223Q33511R05037N81512M04816J84059J40686L12081L24478J11828L08513
3048B96159744J089325J118908M63486J92890Q5335m3621k39373j37329K82288N75314
3058B99546967J011352R52721L39279M9114j33991k24590k23408j12763J76201L46890
3068C01727772N35011M92802J19934O3171K24114L49044O53267N26677j10627l29971
3078C04251194l54519k21500K24819L96500L38077M59194Q30651P58895J65444N7468
3088C06906223K89917M33216P47185O18935j01319k03361K03133L44982M51088L75995
3098C10065994K136n4836J32313K38914L64304M34151M77791M51564L55473K30789
$$ plain form
3108 312698593 312662601 312629223 312953224 313236465 313143730 312838078 312218189 311741600 312010536 312488079
3118 312488079 312770119 313060532 313502541 313870907 313903580 313851833 313843002 313985825 314598560 315179825 315266132
3129 315266132 315061569 314459076 313928127 314177036 314378738 313689461 312867393 312473068 312252998 312152386
3139 312152386 312135696 312136421 312190781 312294483 312501183 312942982 313377857 313573608 313632965 313538780 313415298
3150 313415298 313438892 313433647 313237915 312981606 312738190 312512398 312315712 312199116 312140694 312368622 313340187
3161 313340187 314344635 314776192 314775238 314162483 313287964 312321663 311623573 311714172 312281380 313404560
3171 313404560 314429054 314534912 314295292 313995132 313676834 313458672 313397636 313698540 314034939 314150581
3181 314150581 314038048 313487530 312846661 312366009 312124023 312354317 312841892 313612461 314173698 313747406
$$ packed form
3108C12698593l5992l3378L24001K83241r2735l05652o19889m76589K68936M77543
3118C12488079K82040K90413M42009L68366L2673n1747q831J42823O12735N81265Q6307
3129C15266132k04563o02493n30949K48909K01702o89277q22068l94325k20070j00612
3139C12152386j6690P25N4360J03702K06700M41799M34875J95751N9357r4185j23482
3150C13415298K3594n245j95732k56309k43416k25792j96686j16596n8422K27928R71565
3161C13340187J004448M31557r54o12755q74519r66301o98090R0599N67208J123180
3171C13404560J024494J05858k39620l00160l18298k18162o1036L00904L36399J15642
3181C14150581j12533n50518o40869m80652k41986K30294M87575P70569N61237m26292
$$ plain form
3191 313747406 313215027 313450813 313696384 313298950 312813034 312586308 312583447 312997341 313489189 313722610
3201 313722610 313882103 314090958 314195404 314018478 313752651 313539734 313353767 313192139 313124657 313212166
3211 313212166 313477993 314161777 314672470 314302444 313637962 312955379 312475204 312632790 313057671 313632965
3221 313632965 314033031 313729057 313210716 312789192 312469711 312344074 312462578 313045731 313674202 314055214
3231 314055214 314026108 313016663 311956406 311741829 311900616 312293053 312817802 313412437 313819656 313652515
3241 313652515 313235760 312682877 312240601 312346458 312540531 312425613 312247753 312131405 312042465 312064896
3251 312064896 311966896 311386833 310797215 310638905 310642014 310737610 310763836 310445557 310052872 309725533 309576988
3262 309576988 309840202 310294876 310837021 311349144 311678886 311824322 311740875 311404457 310643425 309854031
$$ packed form
3191C13747406n32379K35786K45571l97434m85916k26726k861M13894M91848K33421
3201C13722610J59493K08855J04446j76926k65827k12917j85967j61628o7482Q7509
3211C13212166K65827O83784N10693l70026o64482o82583m80175J57586M24881N75294
3221C13632965M00066l03974n18341m21524l19481j25637J18504N83153O28471L81012
3231C14055214k9106j009445j060257k14577J58787L92437N24749N94635M07219j67141
3241C13652515m16755n52883m42276J05857J94073j14918j77860j16348q8940K2431
3251C12064896r8000n80063n89618j58310L109R5596K6226l18279l92685l27339j48545
3262C09576988K63214M54674N42145N12123L29742J45436q3447l36418p61032p89394
$$ plain form
3272 309854031 309371223 309203625 309612274 310172806 310593834 310736179 310120583 309475174 309469452 309797287
3282 309797287 310554981 311203480 311059952 310650101 310285797 309922447 309654465 309374809 308900108 308552513
3292 308552513 308698883 309020767 309351921 309601059 309638023 309412956 308604240 307897091 307980766 308518639
3302 308518639 309664497 310633659 310435772 309840927 309277534 308778534 308611145 308500290 308182945 307888985
3312 307888985 307810555 307796478 307734966 307698021 307761421 307798862 307641506 307489624 307456741 307631493 308382263
3323 308382263 308983574 308587551 307929516 307515144 307184944 307012787 306803703 306256065 305760860 305675030
3333 305675030 305798759 306055069 306430588 306969414 307422161 307520142 307365189 306827068 306330452 306414604
3343 306414604 306604156 306605110 306408882 305696259 305102825 305415630 305858135 305736065 305586338 305852413
$$ packed form
3272C09854031m82808j67598M08649N60532M21028J42345o15596o45409n722L27835
3282C09797287P57694O48499j43528m09851l64304l63350k67982k79656m74701l47595
3292C08552513J46370L21884L31154K49138L6964k25067q08716p07149Q3675N37873
3302C08518639J145858R69162j97887n94845n63393m99000j67389j10855l17345k93960
3312C07888985p8430j4077o1512l6945O3400L7441j57356j51882l2883J74752P50770
3323C08382263O01311l96023o58035m14372l30200j72157k09084n47638m95205q5830
3333C05675030J23729K56310L75519N38826M52747R7981j54953n38121m96616Q4152
3343C06414604J89552R54j96228p12623n93434L12805M42505j22070j49727K66075
$$ plain form
3353 305852413 306120396 306110153 305862427 305180550 304496288 304187775 304216862 304856300 305550575 305769196
3363 305769196 305708160 305400620 304802895 303715229 302639008 301898956 301822186 303335419 304964542 305280457
3373 305280457 305071106 304572105 304010620 303744087 303617477 303669930 303676834 303318501 302919388 302644253
3383 302644253 302650452 303281555 304140568 305073967 305692902 305373917 304666748 303771496 303112507 303424835
3393 303424835 303976784 304193726 304336319 304543018 304603577 304312477 303792477 302829742 302227497 303124428
3403 303124428 304299583 304781189 304958820 304831982 304597855 304479599 304399014 304307461 304336548 304694405
3413 304694405 305100212 305407295 305420647 304868469 303832054 301820030 300275574 300946712 302424202
3422 302424202 304031143 305316696 305379868 304893494 304091225 303386211 303483734 303740273 303656101 303502083
$$ packed form
3353C05852413K67983j0243k47726o81877o84262l08513K9087O39438O94275K18621
3363C05769196o1036l07540n97725j087666j076221p40052p6770J513233J629123L15915
3373C05280457k09351m99001n61485k66533j26610N2453O904l58333l99113k75135
3383C02644253O199O31103Q59013R33399O18935l18985p07169q95252o58989L12328
3393C03424835N51949K16942J42593K06699O0559k91100n20000r62735o02245Q96931
3403C03124428J175155M81606J77631j26838k34127j18256q0585r1553K9087L57857
3413C04694405M05807L07083J3352n52178j036415k012024j544456O71138J477490
3422C02424202J606941J285553O3172m86374q02269p05014R7523K56539q4172j54018
$$ plain form
3432 303502083 303364277 303294907 303448448 303603401 303514252 303405991 303429832 303561687 303997765 304226398
3442 304226398 303742180 302721252 300691128 299091110 299738407 301026821 301906357 302523613 302475204
3451 302475204 302360535 302830467 303326130 303498268 303368092 302669048 301914215 301545372 301508675 302023411
3461 302023411 302709103 303391228 303669930 302650928 301641693 302069187 302679787 302441120 302115440 302278748
3471 302278748 302457333 302147388 302014828 302939186 303775787 303469429 302630653 301268806 300132751 300258865
3481 300258865 300792217 301267853 301550865 301134109 300665855 300723305 301012516 301543465 301981201 301817169
3491 301817169 301579704 301592598 301958561 303067436 304379692 305778980 306384811 304719925 302456131
3500 302456131 300597916 299668083 301315079 303163300 303136101 301984062 299024811 296479950 297007332
$$ packed form
3432C03502083j37806o9370J53541J54953q9149j08261K3841J31855M36078K28633
3442C04226398m84218j020928k030124j600018O47297J288414Q79536O17256m8409
3451C02475204j14669M69932M95663J72138j30176o99044p54833l68843l6697N14736
3461C02023411O85692O82125K78702j019002j009235M27494O10600k38667l25680J63308
3471C02278748J78585l09945j32560R24358Q36601l06358q38776j361847j136055J26114
3481C00258865N33352M75636K83012m16756m68254N7450K89211N30949M37736j64032
3491C01817169k37465J2894L65963J108875J312256J399288O05831j664886k263794
3500C02456131j858215r29833J646996J848221k7199j152039k959251k544861N27382
$$ plain form
3509 297007332 298614731 300242195 301748047 302506924 302906990 303041935 303168526 303648949 304259071
3518 304259071 305174599 305555344 304200897 302365074 301140785 299809685 297660351 295763016 294914474
3527 294914474 295220852 297623863 300410271 302186966 302933922 301600933 299883366 298977623 299327621
3536 299327621 302555809 306321621 308967113 310066452 308200359 304688931 299582481 295269012 294913769
3545 294913769 296233177 298462143 300209999 299108734 297324905 296199570 295840988 297203064 299086571
3554 299086571 300458431 301773300 302835236 304563046 308464775 312573662 316566467 317019939 308423996
3563 308423996 296714783 284595490 276253223 279167175 286161900 292837372 298344135 299443474
3571 299443474 298900604 298426151 297941685 298035393 298418045 298549175 299770584 303896904 308968773 314787388
$$ packed form
3509B97007332J607399J627464J505852P58877M00066J34945J26591M80423O10122
3518C04259071R15528L80745j354447j835823j224289j331100k149334j897335q48542
3527B94914474L06378K403011K786408J776695P46956j332989j717567r05743L49998
3536B99327621L228188L765812K645492J099339j866093l511428n106450m313469l55243
3545B94913769J319408K228966J747856j101265j783829j125335l58582J362076J883507
3554B99086571J371860J314869J061936J727810L901729M108887L992805M53472q595943
3563C08423996j1709213j2119293q342267K913952O994725O675472N506763J099339
3571B99443474n42870m74453m84466R3708L82652J31130J221409M126320N071869N818615
$$ plain form
3581 314787388 317885399 313645592 305316696 292155495 281517258 282999516 289129486 296655655
3589 296655655 302509537 300709248 296741009 294373283 292776108 293044090 293169022 290570488 288059464
3598 288059464 287498245 289152145 295327911 301761150 304938545 304910431 298918953 291874409 288072109
3607 288072109 286595345 288938046 292162666 292839279 293936729 299352875 302870274 297693024 289454231
3616 289454231 279989014 273893127 277818909 287429581 302845726 317344666 324488411 323543320
3624 323543320 308612099 288744926 268579483 255455017 263752708 276981125 281372795 283133984
3632 283133984 283409843 283614635 286442280 289198647 288661480 289106846 294540405 302548637 313216438
3641 313216438 323052177 330458412 329837570 310346603 286123276 266893616 255049934 259495258
$$ packed form
3581C14787388L098011m239807q328896j3161201j0638237J482258O129970P526169
3589B96655655N853882j800289l968239k367726j597175K67982J24932k598534k511024
3598B88059464n61219J653900O175766O433239L177395k8114n991478p044544l802300
3607B88072109j476764K342701L224620O76613J097450N416146L517399n177250q238793
3616B89454231r465217o095887L925782R610672J5416145J4498940P143745r45091
3624C23543320j4931221j9867173k0165443j3124466Q297691J3228417M391670J761189
3632B83133984K75859K04792K827645K756367n37167M45366N433559Q008232J0667801
3641C13216438R835739P406235o20842j9490967k4223327j9229660j1843682M445324
$$ plain form
3649 259495258 270421982 282505264 291199207 287006855 279456615 274850845 273369789 279244194
3657 279244194 286621571 289665222 292556763 297925720 304588795 313944588 320876122 319477558 313511620
3666 313511620 302428970 293259621 296007385 301200390 304302692 300510406 275979271 253292084
3674 253292084 256516228 267350674 274288406 281011810 286774406 293354988 303659210 313557625
3682 313557625 321100006 322652092 311393013 294932365 276450157 262413502 263583183 270256767
3690 270256767 275732040 281765938 288371315 294076443 297151794 298383713 298349380 295944939 287915459
3699 287915459 281291237 283509731 290091743 300632954 310343266 314317226 312494049 301044941
3707 301044941 286365280 272232056 262669563 264959335 273103714 284865150 296243191 301510582
$$ packed form
3649B59495258J0926724J2083282Q693943m192352p550240m605770j481056N874405
3657B79244194P377377L043651K891541N368957O663075R355793O931534j398564n965938
3666C13511620j1082650r169349K747764N193005L102302l792286k4531135k2687187
3674B53292084L224144J0834446O937732O723404N762596O580582J0304222R898415
3682C13557625P542381J552086j1259079j6460648j8482208j4036655J169681O673584
3690B70256767N475273O033898O605377N705128L075351J231919l4333k404441q029480
3699B87915459o624222K218494O582012J0541211R710312L973960j823177j1449108
3707C01044941j4679661j4133224r562493K289772Q144379J1761436J1378041N267391
$$ plain form
3715 301510582 303609848 303380489 301402092 298438549 294774780 290598869 286965370 284594765 284676075
3724 284676075 288907776 296478996 310107708 320905914 318718681 310064793 297136307 282757034
3732 282757034 268942108 260307083 263358116 274437180 296105862 316211224 321592331 317832947
3740 317832947 302789459 286482811 278427601 277996063 294829597 307634583 289997330 266919613
3748 266919613 256231308 253032684 260480881 272233009 284316540 292775631 289594173 282979736
3756 282979736 278212318 276057472 280541897 287160873 293227425 297312260 295967102 292561054 289894333
3765 289894333 286222458 279207706 273426781 273350239 276958466 285217762 293639412 297622204 298466454
3774 298466454 295296898 290038338 283204308 278152237 280252228 283978691 285235176 285103321 282214165
$$ packed form
3715C01510582K099266k29359j978397k963543l663769m175911l633499k370605Q1310
3724B84676075M231701P571220J3628712J0798206k187233q653888j2928486j4379273
3732B82757034j3814926q635025L051033J1079064K1668682K0105362N381107l759384
3740C17832947j5043488j6306648q055210m31538J6833534J2804986j7637253k3077717
3748B66919613j0688305l198624P448197J1752128J2083531Q459091l181458o614437
3756B82979736m767418k154846M484425O618976O066552M084835j345158l406048k666721
3765B89894333l671875p014752n780925p6542L608227Q259296Q421650L982792Q44250
3774B98466454l169556n258560o834030n052071K099991L726463J256485j31855k889156
$$ plain form
3783 282214165 279821167 281696320 284911633 287400723 290350685 294953575 299127350 300590744 301130066
3792 301130066 301905403 302512894 303463211 303171883 300303936 294618607 282577515 272735596 276084900
3801 276084900 281774044 281692734 278606186 269282341 263599396 274268875 289555779 302407494
3809 302407494 311486244 311715355 307256222 299279690 291678200 290690422 290447006 286953697 280823479
3818 280823479 267985821 258496513 264933357 275659332 282537689 287644863 289463043 290637245
3826 290637245 294268131 297469864 297354927 297029266 300103912 302173386 299654236 293690205 282366982
3835 282366982 271274567 266275883 264635086 266141663 269081593 270664215 273906937 280881405
3843 280881405 291633606 309634209 326677780 336876869 336745262 317066917 289143085 257071972
$$ packed form
3783B82214165k392998J875153L215313K489090K949962M602890M173775J463394N39322
3792C01130066P75337O07491R50317k91328k867947n685329j2041092r841919L349304
3801B76084900N689144q1310l086548r323845n682945J0669479J5286904J2851715
3809C02407494R078750K29111m459133p976532p601490r87778k43416l493309o130218
3818B80823479j2837658r489308O436844J0725975O878357N107174J818180J174202
3826B90637245L630886L201733j14937l25661L074646K069474k519150n964031j1323223
3835B82366982j1092415m998684j640797J506577K939930J582622L242722O974468
3843B80881405J0752201J8000603J7043571J0199089j31607j9678345k7923832l2071113
$$ plain form
3851 257071972 233245373 236732712 251596222 269435883 286704540 296134472 300485382 299216995
3859 299216995 294960022 289293289 284832230 286162853 288949242 291169643 290466537 281107674 271193504
3868 271193504 267980804 268267632 271934509 276988506 280889740 285159588 292124748 296825638 292945137
3877 292945137 286879539 283293953 281064510 281826744 281966934 275886059 271173248 276386738 283017635
3886 283017635 284933815 283563385 275342712 269114971 275364399 285602570 295360336 303063869
3894 303063869 305195084 303114414 295929680 286880264 279150734 272011757 265267849 260499954 259251595
3903 259251595 261439323 269077530 277415276 281290779 283947220 287331810 290169239 292054405 292322884
3912 292322884 289743900 285609722 279824028 275319824 276263714 278856277 280600548 281754017 281349182
$$ packed form
3851B57071972k3826599L487339J4863510J7839661J7268657R429932M350910j268387
3859B99216995m256973n666733m461059J330623K786389K220401p03106r358863r914170
3868B71193504l212700K86828L666877N053997L901234M269848O965160M700890l880501
3877B92945137o065598l585586k229443P62234J40190o080875m712811N213490O630897
3886B83017635J916180j370430q220673o227741O249428J0238171R757766P703533
3894C03063869K131215k080670p184734r049416p729530p138977o743908m767895j248359
3903B59251595K187728P638207Q337746L875503K656441L384590K837429J885166K68479
3912B92322884k578984m134178n785694m504204R43890K592563J744271J153469m04835
$$ plain form
3921 281349182 280562630 279981842 280403614 284044266 287229061 286274433 283423424 278979530 275074959
3930 275074959 274319420 275581360 279202461 283370972 286353588 288254509 288425446 287388077 285042763
3939 285042763 282604218 281261921 280988693 283155670 284757614 282039165 278620949 277149677 276788712
3948 276788712 277922153 279533615 280604134 281522026 282467365 283043385 282752991 282076836 281249771
3957 281249771 280509720 280273666 280237427 280116806 280266533 281244507 282156219 282038918 281651974 281555405
3967 281555405 281384468 280750046 280282745 280749550 281350861 281470528 281321526 280773888 280237427 280140400
3977 280140400 280297279 280751228 281244278 281481266 281616211 281673908 281744003 282086143 282214642 281385193
3987 281385193 280631294 281032562 281706085 282108784 282299042 282091866 281672478 281146774 280567169 279927254
$$ packed form
3921B81349182p86552n80788M21772L640652L184795r54628k851009m443894l904571
3930B75074959p55539J261940L621101M168511K982616J900921J70937j037369k345314
3939B85042763k438545j342297k73228K166977J601944k718449l418216j471272l60965
3948B76788712J133441J611462J070519R17892R45339N76020k90394o76155q27065
3957B81249771p40051k36054l6239j20621J49727R77974R11712j17301l86944r6569
3967B81555405j70937o34422m67301M66805O01311J19667j49002n47638n36461r7027
3977B80140400J56879M53949M93050K36988J34945N7697P0095L42140J28499q29449
3987B81385193p53899M01268O73523M02699J90258k07176m19388n25704n79605o39915
$$ plain form
3997 279927254 279509315 279728889 280178070
4000 280178070
$$ packed form
3997B79927254m17939K19574M49181
4000B80178070
##END=$$ End of the data block
