##TITLE=$$ Begin of the data block
##JCAMP-DX=5.00 $$ ACD/SpecManager v 10.08
##SPECTROMETER/DATA SYSTEM=16PC
##DATE=Mon Sep 16 14:32:09 2013
##DATA TYPE=INFRARED SPECTRUM
##DATA CLASS=XYDATA
##ORIGIN=
##OWNER=
##NPOINTS=3601
##FIRSTX=400.00000000
##LASTX=4000.00000000
##MAXX=4000.00000000
##MINX=400.00000000
##MAXY=27.10456467
##MINY=9.99127769
##XFACTOR=1.0000000000
##YFACTOR=0.000000100000000
##FIRSTY=15.82892227
##DELTAX=1.00000000
##XUNITS=1/CM
##YUNITS=TRANSMITTANCE
##XYDATA=(X++(Y..Y))
400 158289223 198824654 230274410 249916439 258780727 260499744 259223347 257803440 257150764
408 257150764 256856422 256397743 255994987 256567307 258944511 263017159 267515526 270625305 271045647
417 271045647 268787231 265193253 262184925 261217060 262569237 265333576 268005981 269257469 268447323
426 268447323 265687218 261577682 256885586 252360764 248695965 246501408 246175728 247699738 250503712
435 250503712 253566570 255770798 256363907 255286274 253184166 251096592 249978542 250296917 251876678
444 251876678 254036789 255915184 256818562 256453590 254974804 252868156 250743237 249122543 248294659
453 248294659 248264999 248799191 249529552 250081120 250182743 249739227 248856754 247815838 246992569 246734810
463 246734810 247222061 248362522 249784260 250952454 251382523 250861702 249569416 248025703 246885090
472 246885090 246673164 247597141 249515877 252064819 254848480 257587509 260151272 262487831 264524288
481 264524288 266117001 267086143 267304916 266782093 265684185 264289761 262906265 261792679 261113930
490 261113930 260925083 261172504 261704063 262298622 262723160 262809811 262520294 261956997 261303444 260718498
500 260718498 260242977 259775810 259137135 258181095 256888561 255382252 253858185 252479134 251299591
509 251299591 250264778 249275017 248261738 247218952 246170559 245104122 243929729 242504539 240716629
518 240716629 238575039 236243172 233984909 232048359 230553303 229445477 228540668 227627144 226561642
527 226561642 225304947 223885574 222326603 220593624 218601646 216279011 213644848 210847397 208132687
536 208132687 205757523 203891888 202564468 201675663 201064816 200589657 200173988 199806042 199502373 199270992
546 199270992 199101791 198984756 198933811 198987732 199179649 199496784 199863930 200177631 200376816 200506802
556 200506802 200724335 201226044 202129250 203377151 204731445 205872116 206555271 206746082 206647739 206611423
566 206611423 206974640 207917156 209406300 211249237 213208771 215110016 216884384 218540878 220100975
575 220100975 221547146 222816830 223839302 224586639 225106277 225518456 225983162 226653671 227633286 228944855
585 228944855 230518074 232199116 233786049 235087185 235988102 236499977 236763020 236995354 237403431
594 237403431 238093414 239026356 240040188 240929832 241543694 241850452 241941853 241974564 242084904 242322941
604 242322941 242640705 242936993 243129406 243211308 243259220 243388596 243683071 244138355 244652176 245065289
614 245065289 245231838 245084629 244665470 244112549 243614159 243351688 243452034 243961983 244847813 246016541
624 246016541 247350750 248743706 250121346 251441154 252668915 253750725 254603443 255138741 255313606
633 255313606 255178585 254885159 254635258 254589653 254782963 255098267 255323868 255267792 254868927 254241619
643 254241619 253627014 253275566 253324966 253736305 254318218 254817734 255025177 254839001 254267311 253381195
653 253381195 252258530 250956001 249520264 248020496 246568699 245302143 244327068 243650856 243144512
662 243144512 242566357 241648617 240213585 238264961 236006966 233774929 231905251 230603542 229871025
671 229871025 229521351 229274559 228877048 228189697 227205582 226000328 224651260 223172741 221500797
680 221500797 219526920 217155304 214344006 211103077 207447968 203331947 198597012 192978878 186177731
689 186177731 177978611 168376217 157652531 146368437 135263758 125096912 116479902 109763012
697 109763012 105001488 102003498 100430307 99912777 100150604 100978880 102394724 104545374 107680235
706 107680235 112076778 117955618 125406284 134341869 144489975 155415802 166567230 177336273
714 177336273 187136650 195494576 202139568 207062111 210505772 212876854 214596424 215952549 217018986
723 217018986 217678471 217734833 217051125 215640717 213668041 211367760 208937092 206463318 203921700
732 203921700 201235371 198354149 195306320 192196350 189155617 186274490 183551636 180882492 178093643
741 178093643 175008030 171515751 167622280 163450317 159194078 155043039 151110935 147404356 143847208
750 143847208 140346642 136862946 133445148 130214987 127312994 124841824 122838945 121290855 120173788
759 120173788 119492693 119297209 119669371 120695133 122434187 124898939 128042622 131759148 135894585
768 135894585 140276537 144757328 149257050 153784180 158418064 163256168 168350887 173668499 179091930
777 179091930 184462337 189633884 194510212 199046516 203223419 207017078 210386429 213283691 215678864
786 215678864 217579613 219036217 220131092 220962830 221633415 222240028 222867908 223579597 224401531 225313129
796 225313129 226247044 227102604 227770767 228161716 228228664 227978878 227470284 226792698 226040249 225285091
806 225285091 224564438 223887672 223258076 222694874 222237339 221923943 221757832 221683140 221594257 221381874
816 221381874 220991707 220460415 219899178 219429798 219105625 218866100 218556881 218009834 217142220 216020832
826 216020832 214853783 213910809 213410206 213423710 213843193 214419327 214853935 214905281 214467506 213596592
836 213596592 212478657 211356258 210443459 209862671 209627476 209675465 209932480 210374641 211054344 212075405
846 212075405 213529739 215428848 217668438 220047760 222334270 224343166 225993004 227313042 228405228
855 228405228 229385033 230332069 231271896 232188301 233050060 233832130 234519367 235096283 235536079 235801907
865 235801907 235862103 235711594 235382099 234934521 234433231 233918533 233393860 232836533 232226677 231575909
875 231575909 230937080 230386200 229985733 229750519 229636860 229562645 229448051 229253159 228992119 228715591
885 228715591 228474636 228288383 228133736 227962723 227732582 227428398 227061539 226646156 226168022 225567856
895 225567856 224749680 223611221 222077084 220116081 217735806 214961510 211819553 208341522 204590397
904 204590397 200694561 196865578 193382702 190544491 188605270 187722511 187936020 189181156 191323376
913 191323376 194194126 197612190 201389599 205330162 209234638 212917366 216232185 219095612 221497059
922 221497059 223489838 225165653 226621170 227925625 229100246 230113754 230897446 231374512 231495361
931 231495361 231263657 230740795 230024796 229213104 228367653 227500553 226589489 225611992 224577332 223534164
941 223534164 222547474 221655140 220832195 219983730 218974953 217683277 216045246 214072609 211829338
950 211829338 209382210 206751709 203887691 200683937 197022762 192830200 188118973 183002262 177678509
959 177678509 172397022 167419796 162992363 159326630 156592855 154911518 154341726 154867516 156390953
968 156390953 158739405 161691704 165015564 168504181 171998329 175387802 178596878 181564922 184235268
977 184235268 186558056 188503628 190076160 191317940 192299538 193098507 193776417 194362526 194851952
986 194851952 195218563 195438251 195513916 195490856 195453815 195503178 195717640 196117611 196648827 197196159 197625999
997 197625999 197838669 197807636 197586594 197281322 197002907 196824284 196761303 196780720 196825733 196840343 196780109
1008 196780109 196609421 196294365 195802975 195115719 194239674 193213825 192098637 190951729 189801865
1017 189801865 188634586 187396832 186017132 184431934 182608337 180560055 178357124 176132927 174084415
1026 174084415 172459221 171522179 171501808 172530003 174595280 177529736 181037827 184758205 188337650
1035 188337650 191493835 194051075 195945873 197211189 197949352 198302956 198426151 198458843 198503876 198613014
1045 198613014 198786011 198982811 199145432 199219208 199165745 198964863 198607979 198091717 197416763 196593227
1055 196593227 195647316 194622498 193570786 192535954 191536160 190555725 189552765 188482418 187328949
1064 187328949 186131172 184991302 184056091 183476391 183356209 183714352 184473743 185487041 186588364
1073 186588364 187649918 188618469 189517689 190417004 191385612 192454491 193603554 194775772 195907478
1082 195907478 196955242 197906952 198775635 199582806 200343895 201062336 201732750 202347355 202900810 203391018
1092 203391018 203819294 204191761 204522076 204832821 205151634 205502262 205894852 206321850 206762600 207193832
1102 207193832 207599850 207973804 208310852 208598194 208811722 208924961 208926449 208835793 208704300 208598518
1112 208598518 208571587 208640270 208780632 208945942 209096508 209222755 209346981 209502487 209702168 209916458
1122 209916458 210074444 210088043 209886608 209443188 208780746 207957859 207044487 206100426 205163059 204245510
1132 204245510 203337994 202410069 201413383 200289288 198983383 197462978 195730057 193822136 191799068
1141 191799068 189723949 187647915 185606060 183623219 181722431 179927311 178256054 176715088 175300388
1150 175300388 174012737 172878952 171966457 171375732 171209869 171532555 172335949 173537464 175005798
1159 175005798 176603603 178222179 179792290 181270390 182616463 183782730 184723606 185420055 185898571
1168 185898571 186227016 186484985 186723518 186937981 187070866 187042789 186792908 186306534 185616455 184785175
1178 184785175 183883572 182981834 182153835 181482830 181053047 180923004 181093159 181488361 181972065 182389088
1188 182389088 182618656 182610188 182388058 182028732 181626415 181267834 181021900 180939140 181049786 181356754
1198 181356754 181828251 182402973 183011513 183606300 184182816 184777050 185438480 186194649 187028847 187884731
1208 187884731 188692932 189403229 190001392 190503464 190936966 191321888 191666431 191972828 192245636 192489319
1218 192489319 192696533 192835922 192853489 192691555 192316780 191739922 191012897 190203018 189359074 188488846
1228 188488846 187561531 186532612 185374737 184096241 182738152 181353416 179984665 178653679 177368164
1237 177368164 176137543 174984016 173940277 173033257 172267723 171620674 171054249 170539398 170075397
1246 170075397 169691887 169429283 169309750 169315872 169392319 169469357 169496880 169466858 169412861 169387989 169434891
1257 169434891 169567070 169769726 170016460 170287399 170577145 170888596 171220512 171560516 171889286 172192841
1267 172192841 172473183 172748985 173047619 173395252 173814392 174329128 174972229 175783157 176793709 178007469
1277 178007469 179387131 180861435 182350063 183794975 185178547 186518402 187841167 189152718 190422001
1286 190422001 191589298 192591858 193392582 193994217 194433155 194759483 195014648 195218906 195372009 195461540
1296 195461540 195472431 195393105 195219707 194960823 194643936 194319267 194054356 193916397 193946743 194140377
1306 194140377 194443531 194774494 195060997 195276089 195453129 195671082 196016827 196543026 197243576 198056583
1316 198056583 198891811 199664936 200321026 200838242 201214390 201450977 201545639 201498795 201327534 201077023
1326 201077023 200818977 200637169 200603981 200757999 201090374 201543274 202021446 202413845 202620792 202579994
1336 202579994 202281723 201767883 201111526 200385437 199633198 198856068 198024158 197104683 196093655 195032902
1346 195032902 194003429 193097477 192383003 191878357 191547699 191319656 191118145 190890675 190620594 190319099
1356 190319099 190002251 189667473 189284878 188810654 188218460 187532043 186837940 186265564 185939522 185926285
1366 185926285 186203632 186672707 187208481 187723484 188210144 188739357 189417725 190328789 191491432 192855530
1376 192855530 194331112 195827694 197279758 198646259 199895840 200995789 201919994 202671566 203301201
1385 203301201 203901768 204572811 205371170 206274567 207180138 207941284 208423843 208554211 208336678 207838326
1395 207838326 207154846 206377659 205578747 204812832 204127560 203570404 203184967 203000336 203021488 203230343
1405 203230343 203597393 204099770 204733696 205512886 206449013 207522736 208660107 209730339 210573616
1414 210573616 211051846 211100121 210752506 210124092 209352360 208525467 207630558 206550655 205111942 203157692
1424 203157692 200611858 197504807 193953381 190113316 186131420 182118511 178148594 174273243 170535736
1433 170535736 166974754 163617153 160465450 157488499 154620228 151770868 148849468 145795679 142607470
1442 142607470 139350452 136135941 133071976 130211124 127532482 124983196 122572670 120474644 119071808
1451 119071808 118897848 120479527 124139128 129843922 137175055 145430889 153820972 161670723 168562489
1460 168562489 174376278 179238434 183414116 187187176 190759792 194194450 197408390 200221405 202442970
1469 202442970 203965511 204824696 205195408 205324059 205428467 205615005 205851154 205999374 205887489 205372734
1479 205372734 204370308 202837944 200734291 197974701 194409294 189838505 184074936 177047977 168927803
1488 168927803 160223198 151793747 144738073 140165958 138924866 141384954 147368050 156240358 167108707
1497 167108707 179020443 191085434 202508945 212587891 220741615 226606178 230150414 231730175
1505 231730175 232013721 231783562 231695309 232105598 233042240 234310608 235660114 236914768 238011494
1514 238011494 238954105 239738789 240310001 240575142 240461082 239974804 239231052 238433189 237814541 237561684
1524 237561684 237745495 238287563 238982048 239576893 239891529 239918003 239848328 239994316 240624104 241791153
1534 241791153 243251476 244528198 245106449 244669094 243255234 241259041 239268627 237823887 237210293
1543 237210293 237382584 238044491 238835239 239527817 240144367 240934448 242224483 244205055 246753998
1552 246753998 249388695 251390648 252074928 251098404 248666401 245523968 242705078 241132431 241241703
1561 241241703 242809505 245073376 247091370 248166790 248131523 247355900 246494331 246113968 246399727
1570 246399727 247079105 247580185 247316284 245938511 243438053 240081596 236253700 232318172 228567467
1579 228567467 225256805 222655716 221047802 220651093 221501141 223370113 225784683 228148003 229912701
1588 229912701 230722733 230461731 229194832 227047691 224093876 220313911 215649986 210131741 204011345
1597 204011345 197832355 192382584 188524857 186959152 188007393 191515121 196916752 203438034 210340996
1606 210340996 217098999 223429527 229196262 234267693 238438854 241475925 243254700 243895016 243788128
1615 243788128 243477135 243444786 243922215 244822979 245832825 246597366 246902962 246761303 246378365 246047363
1625 246047363 246035156 246505127 247479839 248823242 250234756 251277866 251479149 250502892 248345776
1634 248345776 245446587 242613220 240751171 240490208 241889744 244388885 247054081 249017258 249878025
1643 249878025 249851341 249571400 249657383 250289955 251052399 251144657 249860344 247055607 243329201 239791756
1653 239791756 237539349 237119141 238282814 240159073 241735363 242367229 242035446 241232738 240586052
1662 240586052 240465088 240807819 241237488 241355038 240995998 240288525 239502697 238824902 238231812 237554417
1672 237554417 236676254 235710030 235006008 234963932 235757294 237148514 238527546 239171257 238588314 236762676
1682 236762676 234165421 231537933 229567661 228626289 228687305 229432812 230459232 231456470 232272282
1691 232272282 232857513 233160210 233057652 232379436 231005821 228973598 226510582 223966312 221666775
1700 221666775 219773579 218224487 216790009 215213032 213351326 211244373 209067898 207005615 205113831
1709 205113831 203255978 201144753 198471851 195057182 190942364 186384449 181756268 177404861 173537407
1718 173537407 170184326 167248821 164606686 162198887 160067120 158316202 157033606 156216164 155753689
1727 155753689 155480204 155263567 155078135 155014229 155218124 155796795 156746693 157948608 159232311 160470543
1737 160470543 161647739 162864857 164279919 166022167 168125534 170515289 173048496 175583420 178042297
1746 178042297 180441513 182879601 185493088 188399525 191650677 195212288 198975506 202793198 206522007
1755 206522007 210053291 213324070 216313953 219042034 221570816 224009762 226497879 229152737 231995716
1764 231995716 234894638 237569008 239679756 240975418 241422424 241247711 240859489 240682945 240992794
1773 240992794 241826649 243013573 244287643 245416565 246281223 246885967 247321358 247717934 248212662
1782 248212662 248921375 249899616 251092701 252304668 253225269 253532543 253037930 251799698 250134201
1791 250134201 248500710 247308483 246741180 246689548 246826572 246782284 246326256 245465527 244417496 243483829
1801 243483829 242897854 242724094 242851791 243073540 243197365 243133183 242915039 242658958 242490063 242483139
1811 242483139 242645245 242939606 243326759 243791351 244339409 244974384 245675735 246399231 247097740 247745171
1821 247745171 248340225 248887405 249370270 249745064 249964867 250022793 249978962 249947376 250044346 250332813 250803165
1832 250803165 251405430 252109394 252941227 253959827 255179787 256493797 257658806 258375950 258431282
1841 258431282 257818775 256769047 255658894 254847469 254527168 254666862 255068455 255492764 255777740 255886459
1851 255886459 255873566 255808353 255711098 255544510 255256805 254841995 254370537 253966198 253737125 253700581 253745670
1862 253745670 253660316 253217030 252277775 250868053 249181499 247509747 246130047 245203209 244728622
1871 244728622 244572353 244546471 244495754 244349861 244125671 243893242 243733196 243707409 243847561 244151516
1881 244151516 244579735 245054379 245472221 245738792 245812340 245732880 245611897 245582218 245732899 246068344
1891 246068344 246516418 246980534 247400608 247783718 248188877 248680439 249285755 249984493 250730934 251486015
1901 251486015 252231274 252956791 253637314 254224396 254665928 254943352 255095863 255208511 255366611 255603924
1911 255603924 255879879 256102467 256182613 256084976 255842876 255531998 255221939 254940624 254672165 254384975
1921 254384975 254066658 253739471 253446751 253220482 253053703 252895012 252669449 252313194 251803055 251166859
1931 251166859 250471230 249793148 249186764 248659573 248166389 247625427 246952839 246101456 245087509 243990288
1941 243990288 242922306 241983738 241223488 240628529 240146141 239725780 239353962 239061928 238901615 238906269
1951 238906269 239062271 239311543 239582710 239833279 240074501 240363445 240764866 241305752 241949100 242602005
1961 242602005 243155708 243535423 243734722 243818092 243891983 244059753 244382877 244864140 245456390 246089325
1971 246089325 246699314 247249146 247732639 248165112 248567772 248954201 249324532 249669514 249979935 250257130
1981 250257130 250516224 250781078 251071377 251388969 251712112 252002487 252224598 252367420 252457275 252552071
1991 252552071 252718601 253001766 253402481 253875198 254346142 254743118 255020714 255170059 255210075 255170841
2001 255170841 255078964 254955235 254822044 254712486 254670296 254736404 254927750 255219212 255541611 255800152
2011 255800152 255907669 255819683 255554562 255190411 254837475 254598255 254529991 254626980 254827290 255042019
2021 255042019 255191593 255233822 255172310 255043316 254891853 254749851 254628296 254523220 254429855 254352570 254304085
2032 254304085 254295826 254326096 254377003 254422169 254440136 254424896 254386139 254338551 254289150 254230881 254148102 254030132
2044 254030132 253884430 253738480 253630257 253590031 253625603 253718624 253833618 253934193 253997631 254019814 254010258
2055 254010258 253981457 253939266 253879566 253792877 253672352 253521843 253357906 253206043 253091068 253026752 253008003
2066 253008003 253011398 253003178 252952957 252847652 252697868 252534618 252395515 252308006 252277184 252284241 252297153 252287254
2078 252287254 252243919 252179241 252121410 252099476 252128296 252200108 252286758 252351723 252364464 252313118 252207260 252072697
2090 252072697 251938915 251826859 251741924 251676445 251619339 251567574 251531849 251532631 251586285 251690292 251816463
2101 251816463 251918411 251951218 251893806 251761494 251600323 251464844 251390915 251378307 251392193 251383514 251316624
2112 251316624 251189003 251033001 250899048 250829983 250839767 250907021 250984631 251020737 250979252 250852871 250663719
2123 250663719 250453186 250266323 250135937 250072651 250061874 250070953 250062351 250010204 249912090 249791775 249690228
2134 249690228 249646549 249678955 249772511 249882851 249953671 249940796 249831791 249650459 249444370 249261684 249130039
2145 249130039 249047604 248992405 248941822 248891239 248858871 248873138 248949623 249072342 249192123 249245167 249183598 248999920
2157 248999920 248731728 248443108 248192596 248006706 247872753 247754211 247618790 247460117 247301636 247180939
2167 247180939 247125759 247136040 247183990 247228603 247235699 247190647 247097359 246967773 246810436 246626472 246414776
2178 246414776 246180401 245939178 245713730 245524826 245382652 245286007 245227947 245203495 245213413 245260296 245340996
2189 245340996 245440159 245532494 245592175 245604248 245570946 245508118 245434189 245357761 245271740 245156975 244993191
2200 244993191 244770317 244494915 244188766 243881283 243600578 243366508 243187008 243057060 242959843 242868881
2210 242868881 242752552 242580223 242328777 241986504 241551781 241028404 240417900 239715538 238908768 237977905
2220 237977905 236894131 235611649 234055710 232114201 229641953 226484432 222519684 217707672 212131939
2229 212131939 206018276 199721889 193686142 188379841 184228477 181552086 180522194 181144962 183272800
2238 183272800 186641350 190921249 195770874 200877438 205978851 210868359 215389462 219432316 222934456
2247 222934456 225885906 228327789 230340347 232019691 233450451 234687462 235752316 236645889 237367249
2256 237367249 237928524 238358269 238693676 238967934 239201145 239398289 239554672 239664631 239728222 239755020
2266 239755020 239763031 239774837 239811726 239886875 240000935 240141277 240287724 240421772 240535984 240637112 240741482
2277 240741482 240863209 241002464 241141682 241251278 241304302 241291504 241229286 241155472 241115170 241142788 241248379
2288 241248379 241413593 241598053 241752548 241833839 241815853 241696072 241496353 241260891 241050320 240932770
2298 240932770 240968647 241191826 241592770 242110176 242640095 243061752 243273106 243221855 242920208 242438755
2308 242438755 241884995 241377678 241023617 240898991 241031647 241384792 241851616 242275696 242502747 242449036
2318 242449036 242153797 241777020 241530132 241566601 241890297 242339687 242664623 242658501 242268467 241617413
2328 241617413 240923557 240367813 239992390 239689980 239281902 238622608 237654572 236379890 234785042 232797089
2338 232797089 230334873 227446709 224450245 221963024 220759525 221491146 224392414 229123363 234834919
2347 234834919 240436230 244944515 247766037 248802376 248365097 246968822 245108299 243110561 241098423
2356 241098423 239049416 236898956 234632225 232327042 230135345 228219166 226674576 225484314 224526577
2365 224526577 223638115 222704353 221726055 220827103 220194092 219981174 220231552 220857697 221689720 222559509
2375 222559509 223374481 224140701 224931965 225829773 226871738 228034630 229251614 230445938 231557236
2384 231557236 232548466 233398437 234090366 234608345 234942780 235100498 235111008 235026417 234912643 234835892
2394 234835892 234845753 234959869 235156155 235377846 235553761 235627804 235585804 235464458 235337391 235281487 235341530
2405 235341530 235509491 235728626 235920296 236018715 235997734 235878201 235715389 235573940 235501194 235510483 235577793
2416 235577793 235653954 235685272 235634995 235497227 235296097 235073280 234868984 234706230 234586754 234497681 234423714
2427 234423714 234356213 234294968 234242516 234197941 234154873 234105282 234044437 233973866 233899078 233825035 233753834 233686352
2439 233686352 233625298 233576202 233542595 233518887 233487892 233426151 233316841 233162174 232985592 232819710 232688408
2450 232688408 232592106 232509956 232416801 232305527 232198105 232136307 232155571 232257729 232400665 232513447 232530117
2461 232530117 232423325 232218151 231978359 231773224 231643200 231583633 231553612 231503315 231402359 231254539
2471 231254539 231092453 230957088 230876083 230851231 230860443 230870628 230853214 230794411 230698357 230581741 230464725
2482 230464725 230361481 230272751 230183868 230070019 229907818 229690628 229438267 229195499 229016113 228937359
2492 228937359 228958244 229033413 229089603 229057446 228904362 228650169 228356991 228099041 227926731 227845612 227817860
2503 227817860 227786236 227703915 227556725 227365894 227174282 227024288 226939812 226919460 226940823 226971703 226981049
2514 226981049 226947727 226864243 226738358 226591473 226454029 226357594 226324234 226357174 226437759 226531219 226600647
2525 226600647 226624031 226605721 226576080 226577854 226643810 226776772 226941013 227072506 227103653 226993389 226747875
2536 226747875 226421509 226096973 225852547 225731697 225727749 225792122 225858746 225873947 225817490 225704632 225572319
2547 225572319 225457077 225376701 225325413 225282650 225229359 225162621 225099506 225069523 225098591 225193481 225334415
2558 225334415 225479412 225578384 225590820 225499496 225315285 225071430 224811192 224574528 224387779 224260406
2568 224260406 224187450 224155350 224147892 224150791 224153271 224148598 224134083 224110622 224083157 224058743 224045029 224047012 224064026
2581 224064026 224088631 224106998 224102058 224058266 223965874 223825169 223647633 223454151 223270645 223121204 223020782
2592 223020782 222969666 222951756 222938728 222898254 222805290 222651691 222449722 222229195 222026463 221871910 221779480
2603 221779480 221743660 221744099 221757298 221767273 221772633 221785107 221821213 221890965 221989555 222095528 222177639 222205887
2615 222205887 222163315 222052631 221894646 221719685 221554852 221413441 221290531 221166477 221017666 220829258
2625 220829258 220603848 220362644 220137691 219959488 219845257 219794178 219791889 219820461 219868488 219934673 220022793
2636 220022793 220130863 220242901 220328846 220354424 220297298 220159359 219968414 219767170 219595356 219475250
2646 219475250 219406490 219373856 219360352 219357796 219368401 219397717 219444962 219498310 219538078 219545994 219513359 219443016
2658 219443016 219343987 219223652 219083328 218921165 218739529 218551769 218381939 218256893 218194866 218197594 218250847
2669 218250847 218333149 218426056 218520508 218615513 218709946 218796062 218857994 218877506 218844261 218763332 218655453 218549385
2681 218549385 218469982 218427944 218415279 218408871 218379116 218301411 218166046 217984695 217791100 217634563 217566376
2692 217566376 217621727 217804165 218078003 218376675 218623466 218758831 218761063 218650990 218477936 218294163
2702 218294163 218131542 217992516 217858791 217711315 217548847 217393360 217279186 217233486 217259331 217332172
2712 217332172 217411175 217458420 217455845 217410183 217346344 217293510 217272644 217291107 217344971 217424622 217519951 217620602
2724 217620602 217714252 217783890 217808495 217768822 217655716 217479076 217271366 217083187 216969337 216969395 217088985
2735 217088985 217291965 217508240 217657108 217677727 217552929 217315292 217032375 216777210 216599560 216510239
2745 216510239 216484566 216480904 216461277 216405087 216309528 216182251 216033001 215870457 215704384 215547924 215415497
2756 215415497 215315208 215241585 215174446 215087910 214965515 214812374 214656601 214536457 214480724 214491196 214538879
2767 214538879 214573650 214544125 214415398 214178524 213848763 213457890 213045120 212651405 212315140 212066383
2777 212066383 211918678 211860390 211852589 211837807 211759148 211582775 211312008 210986423 210664387 210397797 210210114
2788 210210114 210088825 209993000 209871788 209684715 209414349 209069443 208678856 208281364 207914200 207604046
2798 207604046 207360687 207174053 207016315 206848450 206630898 206334686 205948715 205481491 204956112 204401321
2808 204401321 203842106 203292713 202753563 202212029 201646633 201032543 200347958 199577847 198714867 197755928
2818 197755928 196696796 195527229 194230404 192787075 191181583 189406624 187463932 185360718 183105431
2827 183105431 180707054 178178864 175543594 172836285 170099850 167375183 164690132 162054081 159461412
2836 159461412 156902094 154374542 151893606 149491520 147212143 145102081 143203020 141545525 140145350
2845 140145350 139001608 138097286 137402525 136882534 136505136 136248198 136101093 136063128 136139593 136338844
2855 136338844 136671324 137146959 137770281 138531961 139401560 140327759 141249285 142113380 142893171 143593302
2865 143593302 144239082 144854364 145439978 145965881 146381063 146636257 146705179 146593189 146328859 145945158
2875 145945158 145462198 144882402 144197588 143403997 142512589 141549835 140547752 139531469 138511314
2884 138511314 137483664 136438923 135370464 134279270 133171511 132052107 130918903 129762287 128571424
2893 128571424 127343807 126093388 124850788 123654022 122532578 121491346 120503635 119518652 118482008
2902 118482008 117360716 116160402 114925003 113717937 112593794 111574984 110645523 109764729 108891897
2911 108891897 108007374 107119608 106255093 105441017 104691410 104006958 103384838 102830448 102361326 101999598
2921 101999598 101758595 101633825 101605587 101651602 101760349 101936226 102191525 102531548 102943106 103395967
2931 103395967 103856821 104306650 104751101 105215979 105730467 106310568 106951160 107633286 108339539 109068232
2941 109068232 109835596 110665379 111572266 112550488 113574009 114609146 115631742 116639633 117654238
2950 117654238 118711967 119850397 121096325 122459230 123930178 125484524 127085981 128691854 130260792
2959 130260792 131762218 133184919 134541130 135861750 137183094 138530102 139902849 141272774 142590952
2968 142590952 143805027 144877729 145799398 146589842 147290468 147949476 148607616 149287815 149992762 150708408
2978 150708408 151412125 152081175 152699108 153257589 153754406 154188795 154556160 154845076 155036678 155107126
2988 155107126 155030241 154780607 154334526 153671570 152776976 151646891 150296650 148769484 147143364
2997 147143364 145530519 144067507 142894363 142126484 141826563 141986599 142527637 143320723 144221201
3006 144221201 145104599 145887508 146525183 146988659 147235460 147193136 146766891 145870724 144465294 142583456
3016 142583456 140327740 137843790 135283403 132778606 130437250 128357382 126644678 125415792 124783268
3025 124783268 124827881 125576487 126996918 129011765 131520376 134414463 137581682 140900660 144240847
3034 144240847 147474642 150500450 153262758 155755062 157999687 160014915 161787834 163269119 164393215
3043 164393215 165109558 165407009 165315361 164886265 164166889 163184032 161948528 160474834 158803082 157007990
3053 157007990 155192337 153469172 151945572 150715294 149859324 149447756 149534369 150142679 151249695
3062 151249695 152777624 154600964 156569519 158538818 160397816 162082767 163574944 164882488 166016254
3071 166016254 166967030 167695026 168136139 168226051 167934189 167295723 166427097 165516090 164787827 164456749
3081 164456749 164681988 165539989 167020302 169040108 171467266 174143047 176899929 179577618 182039185
3090 182039185 184187984 185978699 187415733 188536987 189387932 190000648 190388336 190560684 190550365
3099 190550365 190433941 190332260 190385246 190711479 191371365 192351265 193574657 194933300 196321621 197660713
3109 197660713 198905506 200038414 201060314 201981468 202817860 203585987 204296722 204948177 205525093
3118 205525093 206006336 206379776 206655064 206865654 207055473 207257576 207476788 207687702 207850266 207933960
3128 207933960 207936268 207885475 207826195 207798386 207822666 207897968 208011360 208149109 208302269 208462925 208617611
3139 208617611 208745117 208822880 208838711 208799667 208731327 208665981 208626766 208616924 208620701 208614330 208581371 208522358
3151 208522358 208453293 208396091 208365459 208361492 208371391 208378906 208376274 208369789 208377666 208418903 208501434 208615818 208739452
3164 208739452 208848991 208934498 209005833 209086494 209198380 209345074 209505634 209642544 209720764 209725666 209669571
3175 209669571 209583187 209497032 209425735 209364147 209297695 209217949 209133224 209065571 209037094 209054489 209101906 209147091
3187 209147091 209156723 209111099 209011860 208879166 208742638 208631096 208565693 208554745 208590641 208648167 208687153
3198 208687153 208662739 208541851 208320293 208031483 207739792 207518883 207423801 207469864 207626705 207831268
3208 207831268 208012028 208113060 208109150 208007145 207836208 207633476 207432213 207256451 207121315 207036972
3218 207036972 207011585 207050953 207154102 207308311 207486057 207648716 207755718 207777443 207705650 207556610 207365417
3229 207365417 207174168 207018604 206919060 206877670 206880989 206906013 206926537 206920109 206873989 206789532 206683311 206581612
3241 206581612 206510677 206485291 206502151 206541901 206578999 206593380 206578140 206538067 206481705 206413231 206329784 206225967
3253 206225967 206101913 205967331 205839157 205733070 205656223 205605888 205574970 205560970 205568676 205605831 205672169
3264 205672169 205750999 205809822 205812149 205734825 205581417 205384102 205191917 205051842 204990540 205003872 205058117
3275 205058117 205100555 205076580 204948311 204710484 204397545 204078045 203834057 203731060 203788776 203967953
3285 203967953 204180832 204325047 204326572 204171257 203910351 203635864 203438454 203368816 203420792 203542843 203668995
3296 203668995 203751850 203780022 203774071 203765602 203774834 203798370 203813095 203791847 203719158 203598862 203449764 203294239
3308 203294239 203146839 203010712 202881374 202755299 202636147 202535229 202466564 202440395 202458267 202513084 202591190
3319 202591190 202675285 202745590 202781372 202764091 202683735 202545872 202374573 202207966 202084312 202025986 202027893
3330 202027893 202058601 202073784 202037010 201936436 201789455 201632404 201501961 201417179 201372204 201342735 201301975
3341 201301975 201236515 201154747 201082401 201048756 201070671 201143303 201241627 201331406 201384125 201386700 201342640 201264343
3353 201264343 201162815 201042480 200903339 200749931 200598488 200476341 200410938 200414639 200474072 200553055 200608063
3364 200608063 200609379 200555000 200469456 200388813 200340691 200332298 200352669 200385513 200423183 200470810 200537987 200625057
3376 200625057 200714016 200773621 200776062 200716019 200619526 200535965 200516090 200588112 200743771 200941772 201125050
3387 201125050 201243649 201271744 201213207 201096096 200960331 200844707 200776691 200767117 200809059 200881481 200957355
3398 200957355 201013699 201041012 201046715 201049843 201068459 201106300 201146755 201159515 201118393 201020336 200893860 200789280
3410 200789280 200752964 200798874 200894413 200970993 200956059 200811596 200556602 200261097 200013542 199878597 199868832
3421 199868832 199945011 200043125 200111732 200138340 200150185 200192261 200296040 200458584 200641537 200789661 200857029
3432 200857029 200826759 200716782 200570221 200437469 200357323 200343742 200382233 200435162 200455894 200406837 200274925
3443 200274925 200079365 199865932 199690914 199601803 199621964 199746552 199948368 200189095 200428047 200628490
3453 200628490 200760174 200803776 200756798 200638790 200489197 200356541 200279999 200273666 200320358 200380573 200411453
3464 200411453 200387917 200314827 200226135 200172482 200201111 200337353 200572319 200861549 201135654 201322098 201369534
3475 201369534 201267776 201051655 200786266 200538197 200346546 200207481 200081463 199917202 199680233 199370117
3485 199370117 199019394 198677979 198393497 198199501 198112259 198133297 198249855 198432255 198631458 198786106
3495 198786106 198840542 198767471 198583565 198344707 198121605 197966366 197888203 197851353 197797432 197677956 197480412
3506 197480412 197233334 196991024 196807652 196716003 196720486 196804733 196944122 197114563 197292786 197450218 197549801
3517 197549801 197549572 197415524 197135925 196731262 196252880 195770988 195357475 195067158 194924641 194916801 194995232
3528 194995232 195088654 195126762 195069904 194933147 194789829 194745293 194886684 195229492 195692024 196117401 196339397
3539 196339397 196261539 195906868 195408726 194944878 194652061 194567642 194631233 194738560 194811211 194837208 194861546
3550 194861546 194942856 195113182 195372829 195718002 196170654 196772671 197534523 198368969 199064407 199336567
3560 199336567 198950348 197852325 196237373 194502831 193102798 192373199 192410831 193059788 194000587
3569 194000587 194890804 195491791 195736847 195729580 195689373 195866127 196446495 197473049 198801289 200122128
3579 200122128 201057339 201305103 200774231 199640465 198286324 197144871 196522350 196485996 196868877 197378464
3589 197378464 197742462 197814808 197599716 197204685 196768417 196409454 196209869 196218643 196449528 196865005
3599 196865005 197361679 197780952 197956066 197778854 197253056 196504421 195740891 195179596 194968452 195127659
3609 195127659 195527000 195908661 195961990 195442047 194301453 192774715 191352386 190618114 190992546 192497921
3619 192497921 194671593 196701069 197740459 197265587 195296612 192376537 189326878 186907711 185550957
3628 185550957 185274868 185784740 186670418 187591133 188374634 189025688 189676704 190516911 191710243 193305130
3638 193305130 195152569 196878986 197960587 197905121 196477051 193853683 190613556 187539062 185317516
3647 185317516 184286232 184343777 185059242 185907402 186501331 186718063 186684608 186668301 186945114 187701511
3657 187701511 188986206 190701504 192623768 194453964 195899601 196769238 197035809 196827183 196336575
3666 196336575 195699139 194910488 193845482 192373581 190500832 188449383 186618786 185449562 185264206
3675 185264206 186166573 188035145 190583744 193434029 196163502 198334923 199544716 199514313 198202629
3684 198202629 195877705 193085346 190502529 188728333 188102551 188628368 190016365 191811371 193537426
3693 193537426 194813175 195425072 195365448 194838696 194217701 193934269 194313908 195412979 196942444 198339615
3703 198339615 198980350 198446140 196722107 194228096 191667557 189765949 189016953 189540691 191093388
3712 191093388 193197861 195321331 197026997 198056946 198344288 197980061 197165699 196173077 195312862
3721 195312862 194897385 195178757 196258621 197994900 199958591 201500950 201952152 200901890 198443851
3730 198443851 195241833 192340240 190761395 191062927 193074493 195963497 198613892 200131035 200211639
3739 200211639 199189987 197754040 196510468 195656357 194939842 193910313 192284031 190190277 188146973
3748 188146973 186789322 186523285 187313404 188721638 190157452 191181087 191685448 191872826 192068787
3757 192068787 192501431 193172302 193873119 194311352 194259872 193653984 192609177 191375809 190266495 189577866
3767 189577866 189515762 190129356 191275730 192642632 193841476 194546642 194617825 194142437 193370667 192579880
3777 192579880 191945763 191493263 191148262 190843086 190599041 190527859 190757465 191340160 192213345 193240318
3787 193240318 194296227 195331078 196357136 197371387 198274689 198860073 198894119 198245220 196974144
3796 196974144 195320721 193591671 192022076 190702610 189615746 188747787 188184586 188112640 188713131
3805 188713131 190017281 191825542 193751087 195370159 196386852 196716270 196445026 195715160 194622211
3814 194622211 193202171 191509323 189713593 188128681 187126598 186978111 187714462 189102001 190751457
3823 190751457 192300892 193563519 194556923 195404339 196180763 196806602 197059364 196695843 195607204
3832 195607204 193909245 191913471 189997940 188460045 187439785 186954517 187009392 187692432 189168339
3841 189168339 191546440 194688053 198076363 200862885 202119675 201211758 198121033 193550167 188728313
3850 188728313 184980621 183243866 183742485 185964241 188934555 191647568 193449516 194210644 194237843
3859 194237843 194009609 193888130 193953571 194021797 193806190 193116913 191988354 190677853 189551620 188927002
3869 188927002 188949795 189555283 190513153 191522064 192305660 192679577 192579041 192057152 191263695 190409260
3879 190409260 189712982 189337425 189329834 189597530 189941444 190145264 190086384 189812050 189535484 189542713 190050354
3890 190050354 191082973 192433681 193728294 194563046 194649677 193906422 192463856 190600224 188647213
3899 188647213 186908207 185611324 184893684 184803200 185302639 186274948 187535305 188856564 190008774
3908 190008774 190805340 191143131 191024055 190549965 189888687 189220104 188681183 188332100 188160133 188117790
3918 188117790 188173122 188338032 188653908 189139996 189737759 190294170 190605507 190507355 189963913 189105530
3928 189105530 188188801 187496719 187226086 187415466 187942162 188582935 189105701 189352665 189285049 188978329
3938 188978329 188575668 188219528 187990742 187880707 187809658 187683563 187457638 187170620 186927052 186836834
3948 186836834 186949463 187223721 187550964 187814693 187946243 187943001 187846184 187702522 187541504 187380314
3958 187380314 187240467 187151127 187129021 187152042 187155495 187063694 186840153 186516685 186176491 185900497 185719070
3969 185719070 185607224 185526123 185471745 185484486 185605450 185816612 186021557 186094704 185966263 185673904 185332603
3980 185332603 185042515 184813156 184575615 184277573 183973408 183806934 183868771 184036694 183962212 183281841
3990 183281841 181942539 180375977 179282684 179024830 178942909 177080593 170664177 157264853 136120005
3999 136120005 108892832
4000 108892832
##END=$$ End of the data block
