##TITLE=$$ Begin of the data block
##JCAMP-DX=5.00 $$ ACD/SpecManager v 10.08
##SPECTROMETER/DATA SYSTEM=16PC
##DATE=Mon Sep 16 14:24:06 2013
##DATA TYPE=INFRARED SPECTRUM
##DATA CLASS=XYDATA
##ORIGIN=
##OWNER=
##NPOINTS=3601
##FIRSTX=400.00000000
##LASTX=4000.00000000
##MAXX=4000.00000000
##MINX=400.00000000
##MAXY=33.46889114
##MINY=2.67467022
##XFACTOR=1.0000000000
##YFACTOR=0.000000100000000
##FIRSTY=15.40636921
##DELTAX=1.00000000
##XUNITS=1/CM
##YUNITS=TRANSMITTANCE
##XYDATA=(X++(Y..Y))
$$ plain form
400 154063692 191763172 221001530 240584736 252496567 260163021 266384392 272118301 276614552
408 276614552 278519516 277068062 272627659 266438274 259929314 254145565 249566174 246233597 243936329
417 243936329 242290459 240774879 238865910 236299438 233292007 230495014 228616104 227917061 227941475
426 227941475 227704697 226263371 223304462 219371662 215594749 213113613 212563992 213900814 216576290
435 216576290 219875240 223178482 226063805 228311214 229919987 231154480 232526855 234621258 237785587
444 237785587 241863136 246168346 249780293 252008858 252759438 252566032 252275295 252581272 253697510
453 253697510 255346031 257033100 258404865 259453297 260461082 261751347 263423862 265248699 266776638
462 266776638 267589951 267537365 266814709 265847816 265049210 264589577 264312820 263838196 262784157 260980968
$$ packed form
400A54063692L7699480K9238358J9583206J1911831P666454O221371N733909M496251
408B76614552J904964j451454m440403o189385o508960n783749m579391l332577k297268
417B43936329j645870j515580j908969k566472l007431k796993j878910o99043K4414
426B27941475k36778j441326k958909l932800l776913k481136n49621J336822K675476
435B16576290L298950L303242K885323K247409J608773J234493J372375K094403L164329
444B37785587M077549M305210L611947K228565P50580j93406k90737L05977J116238
453B53697510J648521J687069J371765J048432J007785J290265J672515J824837J527939
462B66776638Q13313n2586p22656r66893p98606m59633k76757m74624j054039j803189
$$ plain form
472 260980968 258555489 255853634 253266754 251075897 249392929 248196278 247395363 246855774 246380138
481 246380138 245702801 244556828 242809429 240577831 238217964 236149635 234603577 233450565 232241020
490 232241020 230447693 227766781 224288521 220436726 216731129 213540344 210982075 209010353 207593956
499 207593956 206838875 206965523 208170109 210482750 213723011 217572842 221698475 225831585 229772434
508 229772434 233346310 236381683 238748913 240432320 241573353 242434521 243293743 244331474 245577831
517 245577831 246947002 248327599 249667397 251006832 252453594 254128666 256119614 258458042 261115227
526 261115227 264002628 266973114 269832535 272373543 274430218 275934906 276948528 277645378 278253803
535 278253803 278976536 279925632 281101589 282425537 283809509 285227623 286746540 288493195 290569286
$$ packed form
472B60980968k425479k701855k586880k190857j682968j196651q00915n39589m75636
481B46380138o77337j145973j747399k231598k359867k068329j546058j153012j209545
490B32241020j793327k680912l478260l851795l705597l190785k558269j971722j416397
499B07593956p55081J26648J204586K312641L240261L849831M125633M133110L940849
508B29772434L573876L035373K367230J683407J141033Q61168Q59222J037731J246357
517B45577831J369171J380597J339798J339435J446762J675072J990948K338428K657185
526B61115227K887401K970486K859421K541008K056675J504688J013622O96850O08425
535B78253803P22733R49096J175957J323948J383972J418114J518917J746655K076091
$$ plain form
544 290569286 292958527 295484543 297855968 299786663 301132317 301965637 302546921 303203907 304191494
553 304191494 305608749 307412281 309498577 311784668 314228649 316780357 319315300 321618690 323453217
562 323453217 324677124 325332718 325639534 325882759 326262703 326794624 327321091 327620277 327538567 327068748
572 327068748 326336784 325527878 324812813 324319267 324143753 324365158 325023193 326067581 327322998 328519249
582 328519249 329394112 329818916 329869080 329787292 329851685 330223007 330860023 331548576 332023010 332105179 331783524
593 331783524 331197166 330548668 330002365 329625435 329393349 329241066 329122467 329040108 329033279 329136658 329342461
604 329342461 329591827 329804687 329930382 329982872 330030746 330143013 330323334 330482941 330483513 330229416 329752579
615 329752579 329222298 328862572 328823128 329087715 329484558 329790077 329847717 329611092 329078560 328176537
$$ packed form
544B90569286K389241K526016K371425J930695J345654Q33320N81284O56986R87587
553C04191494J417255J803532K086296K286091K443981K551708K534943K303390J834527
562C23453217J223907O55594L06816K43225L79944N31921N26467K99186q1710m69819
572C27068748p31964q08906p15065m93546j75514K21405O58035J044388J255417J196251
582C28519249Q74863M24804N0164q1788O4393L71322O37016O88553M74434Q2169l21655
593C31783524n86358o48498n46303l76930k32086j52283j18599q2359o829J03379K05803
604C29342461K49366K12860J25695N2490M7874J12267J80321J59607N72k54097m76837
615C29752579n30281l59726l9444K64587L96843L05519N7640k36625n32532r02023
$$ plain form
625 328176537 326702652 324406586 321187096 317283936 313322849 310148525 308511639 308772335 310775623
634 310775623 313954201 317586689 321060677 324015694 326332321 328026085 329146271 329742088 329891167
643 329891167 329736404 329474258 329286919 329255638 329318619 329310646 329073257 328571815 327944756 327439346 327254944
654 327254944 327381859 327546577 327328072 326412964 324848061 323119278 321957512 321931381 323044586 324593353
664 324593353 325423698 324497108 321468735 316942673 312226181 308690910 307082481 307155228 307830410
673 307830410 307779713 306104660 302753983 298488560 294462280 291678791 290606556 291105576 292631779
682 292631779 294553146 296399174 297944336 299139442 299978409 300395412 300243397 299348698 297594452
691 297594452 294978390 291610241 287650623 283225212 278361664 272988548 266998367 260342808 253107586
$$ packed form
625C28176537j473885k296066l219490l903160l961087l174324j636886K60696K003288
634C10775623L178578L632488L473988K955017K316627J693764J120186N95817J49079
643C29891167j54763k62146j87339l1281O2981p973k37389n01442o27059n05410j84402
654C27254944J26915J64718k18505r15108j564903j728783j161766k6131J113205J548767
664C24593353Q30345r26590l028373m526062m716492l535271j608429P2747O75182
673C07830410n0697j675053l350677m265423m026280k783489j072235M99020J526203
682B92631779J921367J846028J545162J195106Q38967M17003j52015q94699j754246
691B97594452k616062l368149l959618m425411m863548n373116n990181o655559p235222
$$ plain form
700 253107586 245522919 237903271 230549774 223666248 217330132 211521282 206179256 201245003 196655598
709 196655598 192290802 187899342 183047504 177131405 169473495 159495773 146926594 131971598
717 131971598 115373440 98311577 82151251 68115282 56993136 48994765 43795981 40742664
725 40742664 39115222 38344452 38106182 38292899 38917999 40029554 41690302 44030247 47329941
734 47329941 52070899 58896070 68465581 81243372 97292137 116161032 136925201 158370800
742 158370800 179264622 198606243 215778122 230557537 243019600 253401394 261994591 269097977
750 269097977 275012798 280041370 284457188 288451309 292086296 295296879 297949524 299936275 301255569
759 301255569 302034168 302478485 302780724 303030777 303182011 303088493 302593536 301623363 300235386 298597946
$$ packed form
700B53107586p584667p619648p353497o883526o336116n808850n342026m934253m589405
709A96655598m364796m391460m851838n916099p657910r977722j2569179j4954996
717A31971598j6598158j7061863j6160326j4035969j1122146p998371n198784l053317
725D0742664j627442p70770k38270J86717O25100J111555J660748K339945L299694
734D7329941M740958O825171R569511J2777791J6048765J8868895K0764169K1445599
742A58370800K0893822J9341621J7171879J4779415J2462063J0381794Q593197P103386
750B69097977N914821N028572M415818L994121L634987L210583K652645J986751J319294
759C01255569P78599M44317L02239K50053J51234r3518m94957r70173j387977j637440
$$ plain form
769 298597946 296912785 295323219 293856754 292431622 290918312 289219074 287315331 285255318 283088951
778 283088951 280788441 278203487 275079002 271126900 266115875 259935417 252611294 244284821 235189495
787 235189495 225657425 216158314 207336617 199991512 194959335 192906513 194097404 198236198 204471245
796 204471245 211587391 218329487 223738461 227368832 229310112 230022621 230078812 229931030 229800797
805 229800797 229706020 229576378 229369469 229121838 228920841 228836365 228870068 228961105 229041672 229101315 229211216
816 229211216 229485893 230000687 230713158 231437340 231892757 231808453 231033115 229595795 227687016 225567322
826 225567322 223446808 221393585 219311790 216998959 214253521 210978527 207237339 203235664 199246674
835 199246674 195516205 192192135 189303169 186788197 184551659 182518406 180666695 179033604 177698307
$$ packed form
769B98597946j685161j589566j466465j425132j513310j699238j903743k060013k166367
778B83088951k300510k584954l124485l952102n011025o180458p324123q326473r095326
787B35189495r532070r499111q821697p345105n032177k052822J190891M138794O235047
796B04471245P116146O742096N408974L630371J941280P12509N6191j47782j30233
805B29800797r4777j29642k06909k47631k00997q4476L3703R1037Q0567N9643J09901
816B29211216K74677N14794P12471P24182M55417q4304p75338j437320j908779k119694
826B25567322k120514k053223k081795k312831k745438l274994l741188m001675l988990
835A99246674l730469l324070k888966k514972k236538k033253j851711j633091j335297
$$ plain form
844 177698307 176753292 176270752 176271057 176701107 177433834 178294773 179112644 179773846 180254154 180606003 180902424
855 180902424 181161709 181292820 181088314 180268154 178547707 175694084 171547012 166012020 159052477
864 159052477 150712099 141168680 130792732 120163250 110010071 101085796 94014149 89174318
872 89174318 86665220 86352606 87963686 91176901 95672264 101136532 107248230 113673353 120087576
881 120087576 126219654 131890764 137027035 141635923 145756607 149409456 152566204 155155506 157099457
890 157099457 158363342 158997946 159154387 159066420 159009666 159254818 160035000 161534653 163895645 167225761
900 167225761 171596394 177026787 183464088 190774994 198758430 207177505 215797157 224412994 232863293
909 232863293 241025124 248803787 256121292 262907200 269091187 274599552 279360256 283321285 286478691
$$ packed form
844A77698307r45015m82540L05M30050P32727Q60939Q17871O61202M80308L51849K96421
855A80902424K59285J31111k04506q20160j720447k853623m147072n534992o959543
864A59052477q340378r543419j0375948j0629482j0153179q924275p071647m839831
872H9174318k509098l12614J611080L213215M495363N464268O111698O425123O414223
881A20087576O132078N671110N136271M608888M120684L652849L156748K589302J943951
890A57099457J263885O34604J56441q7967n6754K45152P80182J499653K360992L330116
900A67225761M370633N430393O437301P310906P983436Q419075Q619652Q615837Q450299
909B32863293Q161831P778663P317505O785908O183987N508365M760704L961029L157406
$$ plain form
918 286478691 288902550 290740719 292191830 293451195 294651031 295823021 296899815 297754002 298256512
927 298256512 298328037 297966595 297247658 296302757 295287762 294349060 293590813 293051052 292692204 292414818
937 292414818 292094784 291631470 290988579 290206642 289379807 288607883 287945137 287371845 286800976 286115189
947 286115189 285215740 284060135 282671967 281121750 279488297 277818069 276097908 274250889 272155018
956 272155018 269677963 266714630 263217964 259210396 254775848 250034084 245109997 240109558 235114708
965 235114708 230198231 225452576 221015854 217079411 213868713 211600742 210434914 210435181 211557274
974 211557274 213661575 216542435 219961033 223672867 227449265 231095600 234467468 237480545 240107136
983 240107136 242358112 244257221 245822334 247064247 248002949 248684444 249178696 249550533 249815216
$$ packed form
918B86478691K423859J838169J451111J259365J199836J171990J076794Q54187N02510
927B98256512P1525l61442p18937r44901j014995r38702p58247n39761l58848k77386
937B92414818l20034m63314o42891p81937q26835p71924o62746n73292n70869o85787
947B86115189q99449j155605j388168j550217j633453j670228j720161j847019k095871
956B72155018k477055k963333l496666m007568m434548m741764m924087n000439m994850
965B35114708m916477m745655m436722l936443l210698k267971j165828K67J122093
974B11557274K104301K880860L418598L711834L776398L646335L371868L013077K626591
983B40107136K250976J899109J565113J241913R38702O81495M94252L71837K64683
$$ plain form
992 249815216 249907722 249691715 249012070 247764149 245940189 243617935 240894642 237800770 234241943
1001 234241943 230001850 224798412 218355713 210447712 200898457 189563351 176338291 161230793
1009 161230793 144480610 126668425 108734293 91857376 77215195 65708270 57759910 53271980
1017 53271980 51744246 52491212 54855223 58331251 62576594 67341886 72387013 77438388 82202721
1026 82202721 86414509 89880457 92495317 94229898 95109921 95203409 94620533 93514872 92071934
1035 92071934 90483513 88918839 87506990 86339998 85489168 85020666 85001278 85493507 86551867
1044 86551867 88227348 90577250 93668804 97563705 102285776 107787209 113932171 120509329 127265453
1053 127265453 133939199 140282307 146064291 151077032 155150747 158182116 160155373 161136475 161231041
$$ packed form
992B49815216R2506k16007o79645j247921j823960k322254k723293l093872l558827
1001B34241943m240093n203438o442699p908001r549255j1335106j3225060j5107498
1009A61230793j6750183j7812185j7934132j6876917j4642181j1506925p948360m487930
1017E3271980j527734P46966K364011L476028M245343M765292N045127N051375M764333
1026H2202721M211788L465948K614860J734581Q80023R3488n82876j105661j442938
1035I2071934j588421j564674j411849j166992q50830m68502j9388M92229J058360
1044H6551867J675481K349902L091554L894901M722071N501433O144962O577158O756124
1053A27265453O673746O343108N781984N012741M073715L031369J973257R81102R4566
$$ plain form
1062 161231041 160526199 159047976 156762152 153617268 149600534 144767723 139226580 133085489 126406012
1071 126406012 119195652 111450930 103226843 94689159 86115398 77840910 70176911 63340545 57425113
1080 57425113 52415009 48227167 44753590 41889729 39543350 37632420 36080446 34814179 33765304
1089 33765304 32874389 32097163 31411271 30819731 30347421 30028496 29886506 29917488 30083394 30320537
1099 30320537 30559313 30745809 30854275 30887618 30867839 30824058 30784585 30773754 30810878 30906920 31057696
1110 31057696 31237688 31400404 31490734 31467009 31324036 31105220 30893884 30783591 30840323 31072576 31426878
1121 31426878 31810701 32132740 32339406 32430615 32449412 32456470 32506793 32640884 32891178 33290377 33869560
1132 33869560 34642668 35588701 36648242 37744308 38819761 39872904 40969515 42224989 43768311
$$ packed form
1062A61231041p04842j478223k285824l144884m016734m832811n541143o141091o679477
1071A26406012p210360p744722q224087q537684q573761q274488p663999o836366n915432
1080E7425113n010104m187842l473577k863861k346379j910930j551974j266267j048875
1089C3765304q90915p77226o85892n91540m72310l18925j41990L0982J65906K37143
1099C0320537K38776J86496J08466L3343j9779m3781l9473j0831L7124R6042J50776
1110C1057696J79992J62716R0330k3725j42973k18816k11336j10293N6732K32253L54302
1121C1426878L83823L22039K06666R1209J8797P058N0323J34091K50294L99199N79183
1132C3869560P73108R46033J059541J096066J075453J053143J096611J255474J543322
$$ plain form
1141 43768311 45708971 48124785 51069765 54588790 58721004 63484797 68854036 74742470 81011009
1150 81011009 87496204 94044247 100534010 106878157 113009367 118863897 124374208 129471207 134087029
1159 134087029 138149691 141568623 144221172 145955324 146616516 146094790 144375668 141575079 137944946
1168 137944946 133847513 129708729 125962763 123002186 121140451 120589590 121453543 123732433 127334623
1177 127334623 132091494 137771635 144095488 150753059 157426672 163820572 169689789 174860229 179233627
1186 179233627 182775459 185493031 187414989 188580437 189040184 188864117 188145828 186997738 185535965
1195 185535965 183860664 182040634 180107536 178062248 175889015 173571320 171105480 168507004 165810986
1204 165810986 163065166 160318298 157604904 154929314 152254705 149501190 146557598 143306236 139654522
$$ packed form
1141D3768311J940660K415814K944980L519025M132214M763793N369239N888434O268539
1150H1011009O485195O548043O489763O344147O131210N854530N510311N096999M615822
1159A34087029M062662L418932K652549J734152O61192n21726j719122k800589l630133
1168A37944946m097433m138784l745966k960577j861735n50861Q63953K278890L602190
1177A27334623M756871N680141O323853O657571O673613O393900N869217N170440M373398
1186A79233627L541832K717572J921958J165448M59747j76067p18289j148090j461773
1195A85535965j675301j820030j933098k045288k173233k317695k465840k598476k696018
1204A65810986k745820k746868k713394k675590k674609k753515k943592l251362l651714
$$ plain form
1213 139654522 135562439 131056366 126220770 121171274 116018114 110834370 105640087 100407209 95080948
1222 95080948 89607916 83960867 78155155 72254419 66367974 60640721 55236249 50313087 45998001
1231 45998001 42362175 39408855 37077041 35259976 33832798 32678006 31703093 30847161 30079153
1240 30079153 29392107 28795991 28308830 27946191 27709639 27578089 27508283 27446032 27346008 27191658
1250 27191658 27004349 26835904 26746702 26777656 26930637 27165470 27414877 27611439 27712705 27716601 27659659
1261 27659659 27602031 27604153 27703815 27900739 28154595 28398194 28563087 28609045 28544054 28424296 28331063
1272 28331063 28333786 28457448 28671460 28906960 29092960 29191065 29211311 29201350 29219639 29308460 29480498
1283 29480498 29720984 29998000 30271637 30500481 30648909 30700071 30671821 30623674 30645144 30825024 31215253
$$ packed form
1213A39654522m092083m506073m835596n049496n153160n183744n194283n232878n326261
1222I5080948n473032n647049n805712n900736n886445n727253n404472m923162m315086
1231D5998001l635826k953320k331814j817065j427178j154792r74913q55932p68008
1240C0079153o87046n96116m87161l62639k36552j31550o9806o2251j00024j54350
1250B7191658j87309j68445q9202L0954J52981K34833K49407J96562J01266L896n6942
1261B7659659n7628K122R9662J96924K53856K43599J64893M5958o4991j19758r3233
1272B8331063K723J23662K14012K35500J86000R8105K0246r961J8289Q8821J72038
1283B9480498K40486K77016K73637K28844J48428N1162k8250m8147K1470J79880L90229
$$ plain form
1294 31215253 31811311 32560792 33396466 34272578 35181823 36144636 37182279 38295820 39467268 40680890
1304 40680890 41946959 43308358 44822335 46530986 48441343 50528598 52761574 55130448 57657995
1313 57657995 60387025 63353686 66566153 70004206 73638229 77454915 81469660 85714436 90204735
1322 90204735 94898186 99663382 104271011 108412075 111738195 113914747 114675970 113871508 111494761
1331 111494761 107688026 102724590 96971998 90848017 84780378 79179025 74423342 70858665 68793502
1340 68793502 68485608 70114594 73744926 79291186 86502075 94972210 104185848 113584137 122640991
1349 122640991 130931501 138176746 144253206 149163065 152970133 155718966 157365084 157747097 156620436
1358 156620436 153748703 149022789 142559128 134733572 126130610 117425137 109243126 102053347 96125174
$$ packed form
1294C1215253N96058P49481Q35674Q76112R09245R62813J037643J113541J171448J213622
1304D0680890J266069J361399J513977J708651J910357K087255K232976K368874K527547
1313E7657995K729030K966661L212467L438053L634023L816686M014745M244776M490299
1322I0204735M693451M765196M607629M141064L326120K176552P61223q04462k376747
1331A11494761l806735m963436n752592o123981o067639n601353m755683l564677k065163
1340F8793502l07894J628986L630332N546260P210889Q470135R213638R398289R056854
1349A22640991Q290510P245245O076460M909859L807068K748833J646118L82013j126661
1358A56620436k871733m725914o463661p825556q602962q705473q182011p189779n928173
$$ plain form
1367 96125174 91554518 88329344 86394815 85687513 86133356 87626324 90012703 93098288 96674938
1376 96674938 100549965 104557810 108549452 112368975 115841274 118785448 121054497 122578716 123385954
1385 123385954 123581343 123292732 122607040 121531839 120000429 117917118 115217228 111910105 108085499
1394 108085499 103881855 99435406 94836330 90112429 85247507 80224047 75069385 69885478 64848032
1403 64848032 60181208 56122141 52897334 50721874 49816108 50421429 52792869 57160978 63672009
1412 63672009 72330580 82966328 95233822 108640966 122594414 136454449 149594927 161465511
1420 161465511 171643314 179857693 185979156 189980793 191899471 191821575 189898129 186365166 181536312
1429 181536312 175751877 169307785 162410545 155196562 147809334 140480537 133551064 127401390 122323246
$$ packed form
1367I6125174m570656l225174j934529p07302M45843J492968K386379L085585L576650
1376I6674938L875027M007845L991642L819523L472299K944174K269049J524219Q07238
1385A23385954J95389k88611o85692j075201j531410k083311k699890l307123l824606
1394A08085499m203644m446449m599076m723901m864922n023460n154662n183907n037446
1403F4848032m666824m059067l224807k175460r05766O05321K371440M368109O511031
1412F3672009Q658571J0635748J2267494J3407144J3953448J3860035J3140478J1870584
1420A61465511J0177803Q214379O121463M001637J918678p7896j923446l532963m828854
1429A81536312n784435o444092o897240p213983p387228p328797o929473o149674n078144
$$ plain form
1438 122323246 118408899 115523901 113377609 111646395 110078583 108535376 106974325 105412035 103902903
1447 103902903 102534580 101418076 100655355 100297136 100330191 100718613 101483936 102767229 104815397
1456 104815397 107881746 112094049 117371025 123444548 129972153 136669083 143376894 150036411 156596851
1465 156596851 162935600 168849220 174128094 178670788 182575073 186153164 189855690 194129639 199260921
1474 199260921 205266762 211890850 218720989 225386639 231742516 237925682 244229851 250844994 257609119
1483 257609119 263944359 269056301 272318516 273628101 273508205 272859974 272474060 272561226 272565575 271367607
1493 271367607 267769108 260999088 250989056 238316345 223911705 208746376 193690777 179589081
1501 179589081 167431297 158425274 153830681 154576969 160846252 171857395 186000557 201290894
$$ packed form
1438A22323246l914347k884998k146292j731214j567812j543207j561051j562290j509132
1447A03902903j368323j116504p62721l58219L3055L88422P65323J283293K048168
1456A04815397L066349M212303N276976O073523O527605O696930O707811O659517O560440
1465A56596851O338749N913620N278874M542694L904285L578091L702526M273949N131282
1474A99260921O005841O624088O830139O665650O355877O183166O304169O615143O764125
1483B57609119O335240N111942L262215J309585j19896o48231l85914Q7166M349j197968
1493B71367607l598499o770020j0010032j2672711j4404640j5165329j5055599j4101696
1501A79589081j2157784r006023m594593P46288O269283J1011143J4143162J5290337
$$ plain form
1509 201290894 215937462 228769474 239349403 247780266 254372444 259375076 262894669 264978695
1517 264978695 265744438 265437698 264394722 262966785 261486244 260286846 259717846 260077744 261469326
1526 261469326 263677025 266200142 268488712 270273132 271769009 273580227 276303616 280052395 284203377
1535 284203377 287562065 288894920 287547970 283812656 278840237 274158249 271044846 270064545 270953770
1544 270953770 272860184 274787407 276037025 276474094 276519470 276876373 278095760 280168476 282352753
1553 282352753 283372688 281956196 277485924 270433254 262311916 255118160 250499916 249055748 250109215
1562 250109215 252056656 253095894 251962910 248332806 242743988 236151428 229378986 222748585 216041336
1571 216041336 208767719 200587921 191668873 182812996 175299320 170504551 169461040 172529449 179308224
$$ packed form
1509B01290894J4646568J2832012J0579929Q430863O592178N002632L519593K084026
1517B64978695P65743l06740j042976j427937j480541j199398n69000L59898J391582
1526B61469326K207699K523117K288570J784420J495877J811218K723389L748779M150982
1535B84203377L358688J332855j346950l735314m972419m681988l113403r80301Q89225
1544B70953770J906414J927223J249618M37069M5376L56903J219387K072716K184277
1553B82352753J019935j416492m470272p052670q121338p193756m618244j444168J053467
1562B50109215J947441J039238j132984l630104n588818o592560o772442o630401o707249
1571B16041336p273617q179798q919048q855877p513676m794769j043511L068409O778775
$$ plain form
1580 179308224 188794746 199708462 210832787 221251564 230427589 238150234 244422989 249358463
1588 249358463 253114719 255869770 257815247 259148788 260055447 260677071 261078548 261230755 261027279
1597 261027279 260342236 259105549 257351837 255203934 252793217 250169277 247271824 244001541 240351105
1606 240351105 236501217 232795296 229589882 227075596 225199986 223761559 222620773 221876812 221870213
1615 221870213 222986279 225375576 228774281 232547131 235932541 238345585 239572372 239775162 239352169
1624 239352169 238763885 238416538 238609600 239498177 241026630 242860527 244399967 244944420 243989697
1633 243989697 241529999 238188648 235060177 233288918 233559189 235745544 238917694 241732197 243049965
1642 243049965 242481174 240571747 238503342 237432690 237806950 239040852 239770660 238587418 234858685
$$ packed form
1580A79308224R486522J0913716J1124325J0418777R176025P722645O272755M935474
1588B49358463L756256K755051J945477J333541R06659O21624M01477J52207k03476
1597B61027279o85043j236687j753712k147903k410717k623940k897453l270283l650436
1606B40351105l849888l705921l205414k514286j875610j438427j140786p43961o599
1615B21870213J116066K389297L398705L772850L385410K413044J226787K02790m22993
1624B39352169n88284l47347J93062Q88577J528453J833897J539440N44453r54723
1633B43989697k459698l341351l128471j771259K70271K186355L172150K814503J317768
1642B43049965n68791j909427k068405j070652L74260J233902P29808j183242l728733
$$ plain form
1651 234858685 229165478 223075848 218352928 216035843 215916367 216707458 216786633 215063992 211471996
1660 211471996 206830463 202233105 198374882 195228062 192211781 188672829 184326477 179382801 174331684
1669 174331684 169586868 165253086 161153126 157048807 152865009 148746262 144922934 141503124 138354368
1678 138354368 135161209 131617317 127619209 123339729 119141874 115395813 112309036 109853773 107809353
1687 107809353 105871515 103761444 101287327 98350744 94922991 91019554 86689730 82019539 77134395
1696 77134395 72189093 67342992 62727656 58421335 54443488 50773392 47384238 44274688 41479273
1705 41479273 39051232 37026718 35394812 34094813 33045719 32192335 31535909 31125870 31013305
1714 31013305 31192639 31569936 31982670 32263851 32315407 32147648 31863153 31594481 31434250 31397910
$$ packed form
1651B34858685n693207o089630m722920k317085j19476P91091P9175j722641l591996
1660B11471996m641533m597358l858223l146820l016281l538952m346352m943676n051117
1669A74331684m744816m333782m099960m104319m183798m118747l823328l419810l148756
1678A38354368l193159l543892l998108m279480m197855l746061l086777k455263k044420
1687A07809353j937838k110071k474117k936583l427753l903437m329824m670191m885144
1696G7134395m945302m846101m615336m306321l977847l670096l389154l109550k795415
1705D1479273k428041k024514j631906j299999j049094q53384o56426m10039j12565
1714C1013305J79334L77297M12734K81181N1556j67759k84495k68672j60231l6340
$$ plain form
1724 31397910 31435645 31481478 31505470 31537485 31652341 31928394 32405441 33064361 33836303 34634950 35396159
1735 35396159 36109173 36828434 37662802 38746746 40206985 42139702 44609370 47666879 51373086
1744 51373086 55807877 61053700 67159925 74107871 81797838 90065317 98716574 107561970 116434174
1753 116434174 125188818 133699236 141858206 149589901 156866159 163719139 170241337 176569500 182848873
1762 182848873 189177246 195538902 201758442 207509880 212408314 216165943 218748417 220446682 221806831
1771 221806831 223435173 225766201 228908386 232639008 236536808 240170097 243246117 245670166 247528496
1780 247528496 249039040 250500202 252229023 254467049 257261086 260377560 263329639 265552616 266668701
1789 266668701 266704388 266124821 265639057 265866356 267039814 268908978 270890903 272380428 273049221
$$ packed form
1724C1397910L7735M5833K3992L2015J14856K76053M77047O58920P71942P98647P61209
1735C5396159P13014P19261Q34368J083944J460239J932717K469668L057509L706207
1744E1373086M434791N245823O106225O947946P689967Q267479Q651257Q845396Q872204
1753A16434174Q754644Q510418Q158970P731695P276258O852980O522198O328163O279373
1762A82848873O328373O361656O219540N751438M898434L757629K582474J698265J360149
1771B21806831J628342K331028L142185L730622L897800L633289L076020K424049J858330
1780B47528496J510544J461162J728821K238026K794037L116474K952079K222977J116085
1789B66668701L5687n79567m85764K27299J173458J869164J981925J489525O68793
$$ plain form
1798 273049221 272982445 272600803 272429543 272844887 273917904 275414829 276932030 278087769 278679714
1807 278679714 278742905 278494396 278206463 278079624 278180771 278470058 278881855 279395847 280046844 280872898
1817 280872898 281852970 282890415 283863602 284701748 285420284 286081161 286708622 287237453 287553577 287609158
1827 287609158 287524567 287583141 288097000 289228745 290899296 292859306 294880791 296924133 299143620
1836 299143620 301709461 304570637 307344589 309446888 310406284 310173454 309215927 308323193 308228035
1845 308228035 309265118 311259079 313685551 315986233 317841797 319257679 320450287 321638222 322883110
1854 322883110 324073372 325038795 325711288 326220551 326860466 327935562 329567146 331565247 333450241
1863 333450241 334634056 334688911 333571777 331682358 329711494 328347664 327990799 328617477 329857750
$$ packed form
1798B73049221o6776l81642j71260M15344J073017J496925J517201J155739N91945
1807B78679714O3191k48509k87933j26839J01147K89287M11797N13992O50997Q26054
1817B80872898R80072J037445R73187Q38146P18536O60877O27461N28831L16124N5581
1827B87609158q4591N8574N13859J131745J670551J960010K021485K043342K219487
1836B99143620K565841K861176K773952K102299R59396k32830r57527q92734r5158
1845C08228035J037083J993961K426472K300682J855564J415882J192608J187935J244888
1854C22883110J190262R65423O72493N09263O39915J075096J631584J998101J884994
1863C33450241J183815N4855j117134j889419j970864j363830l56865O26678J240273
$$ plain form
1872 329857750 331217995 332313042 332983856 333267555 333285522 333149223 332941628 332751999 332694130 332861977
1882 332861977 333244858 333680305 333906670 333703957 333033867 332075691 331124077 330410995 329975510 329666862
1892 329666862 329275665 328690796 327971725 327292137 326807938 326555557 326450844 326373520 326257896 326110077
1902 326110077 325945320 325711174 325278091 324525337 323463249 322290573 321322517 320817375 320810509 321068001
1912 321068001 321199226 320863266 319942513 318583870 317092571 315756569 314710312 313909168 313207684
1921 313207684 312474537 311668453 310837803 310062599 309385700 308778114 308153305 307413445 306502571 305437260
1931 305437260 304304752 303226910 302302017 301546535 300865669 300073051 298963795 297411022 295440788
1940 295440788 293241405 291095810 289268150 287901592 286979599 286367054 285900364 285474453 285078678
$$ packed form
1872C29857750J360245J095047O70814K83699J7967j36299k07595j89629n7869J67847
1882C32861977L82881M35447K26365k02713o70090r58176r51614p13082m35485l08648
1892C29666862l91197n84869p19071o79588m84199k52381j04713p7324j15624j47819
1902C26110077j64757k34146m33083p52754j062088j172676r68056n05142o866K57492
1912C21068001J31225l35960r20753j358643j491299j336002j046257q01144p01484
1921C13207684p33147q06084q30650p75204o76899o07586o24809p39860r10874j065311
1931C05437260j132508j077842r24893p55482o80866p92618j109256j552773j970234
1940B95440788k199383k145595j827660j366558r21993o12545m66690m25911l95775
$$ plain form
1949 285078678 284770012 284611454 284617844 284743824 284917755 285095291 285298042 285612640 286149654 286985378
1959 286985378 288116913 289453964 290851078 292164478 293308067 294282742 295166988 296074638 297099228
1968 297099228 298269787 299537182 300795898 301929550 302859592 303575020 304131432 304621048 305129185
1977 305129185 305698166 306315212 306930904 307494621 307988186 308437271 308892231 309390736 309925346 310438843
1987 310438843 310854473 311125011 311272011 311388721 311602211 312013645 312651405 313460617 314335880 315174427
1997 315174427 315919914 316573105 317169991 317744293 318299484 318806934 319228516 319548283 319793930 320034790
2007 320034790 320354881 320813828 321413116 322084236 322709694 323170586 323401756 323428955 323365784 323367958 323563576
2018 323563576 323994217 324595909 325232964 325763397 326102409 326250839 326276779 326267586 326281242 326326637 326376228
$$ packed form
1949B85078678l08666j58558O390J25980J73931J77536K02751L14598N37014Q35724
1959B86985378J131535J337051J397114J313400J143589R74675Q84246R07650J024590
1968B97099228J170559J267395J258716J133652R30042P15428N56412M89616N08137
1977C05129185N68981O17046O15692N63717M93565M49085M54960M98505N34610N13497
1987C10438843M15630K70538J47000J16710K13490M11434O37760Q09212Q75263Q38547
1997C15174427P45487O53191N96886N74302N55191N07450M21582L19767K45647K40860
2007C20034790L20091M58947N99288O71120O25458M60892K31170K7199o3171K174J95618
2018C23563576M30641O01692O37055N30433L39012J48430K5940r193J3656M5395M9591
$$ plain form
2029 326376228 326398582 326386108 326360397 326354065 326385536 326442947 326489677 326484947 326408463 326272774 326116066 325980492
2041 325980492 325888367 325828667 325763321 325648842 325462074 325214500 324947205 324707222 324519043 324368515
2051 324368515 324209442 323990097 323684006 323306808 322907791 322541847 322239952 321994095 321766853 321515160
2061 321515160 321213074 320858002 320460663 320027199 319550934 319018459 318426666 317796249 317169418 316592560
2071 316592560 316092815 315664501 315274334 314882050 314464092 314027195 313603497 313232517 312939262 312719822
2081 312719822 312541122 312353153 312107887 311778507 311369419 310915394 310468006 310073948 309755268 309499741
2091 309499741 309268150 309016151 308718739 308385391 308055820 307777882 307581806 307463589 307388687 307311878
2101 307311878 307201481 307054443 306893940 306754360 306663456 306631317 306651897 306710968 306794415 306891899 306994953
$$ packed form
2029C26376228K2354j2474k5711o332L1471N7411M6730m730p6484j35689j56708j35574
2041C25980492r2125n9700o5346j14479j86768k47574k67295k39983j88179j50528
2051C24368515j59073k19345l06091l77198l99017l65944l01895k45857k27242k51693
2061C21515160l02086l55072l97339m33464m76265n32475n91793o30417o26831n76858
2071C16592560m99745m28314l90167l92284m17958m36897m23698l70980k93255k19440
2081C12719822j78700j87969k45266l29380m09088m54025m47388l94058l18680k55527
2091C09499741k31591k51999k97412l33348l29571k77938j96076j18217p4902p6809
2101C07311878j10397j47038j60503j39580r0904l2139K0580N9071Q3447R7484J03054
$$ plain form
2112 306994953 307093506 307175121 307227917 307246170 307234325 307207794 307188892 307199707 307253075 307346420 307459469 307559338
2124 307559338 307613125 307601929 307531090 307430630 307342358 307301731 307321587 307387180 307466450 307528534 307561817 307580681
2136 307580681 307618732 307711906 307881031 308122864 308412743 308715839 309001637 309253139 309468727 309658108
2146 309658108 309835873 310016403 310212593 310434856 310689545 310975170 311278553 311577110 311846905 312076492
2156 312076492 312277756 312485371 312743015 313080845 313495731 313948402 314378052 314729118 314974556 315123959
2166 315123959 315213852 315287991 315380592 315509968 315681953 315895653 316144733 316412945 316672134 316886749
2176 316886749 317028580 317091656 317098846 317092896 317115746 317187958 317300262 317422485 317522755 317587337 317627544
2187 317627544 317671700 317746811 317860622 317993221 318103504 318144569 318083344 317913074 317654629 317346058 317025585
$$ packed form
2112C06994953R8553Q1615N2796J8253j1845k6531j8902J0815N3368R3345J13049R9869
2124C07559338N3787j1196p0839j00460q8272m0627J9856O5593P9270O2084L3283J8864
2136C07580681L8051R3174J69125K41833K89879L03096K85798K51502K15588J89381
2146C09658108J77765J80530J96190K22263K54689K85625L03383K98557K69795K29587
2156C12076492K01264K07615K57644L37830M14886M52671M29650L51066K45438J49403
2166C15123959Q9893P4139R2601J29376J71985K13700K49080K68212K59189K14615
2176C16886749J41831O3076P190n950K2850P2212J12304J22223J00270O4582M0207
2187C17627544M4156P5111J13811J32599J10283M1065o1225j70270k58445l08571l20473
$$ plain form
2198 317025585 316717987 316430035 316156769 315894299 315648746 315436478 315274944 315169659 315108528 315066605
2208 315066605 315018539 314951897 314871025 314790077 314721184 314663887 314604416 314523678 314407120 314251995 314066505
2219 314066505 313864384 313659096 313460503 313275223 313107662 312959671 312829208 312710228 312595367 312480659
2229 312480659 312369156 312270660 312196407 312151184 312128258 312108860 312069416 311990433 311863785 311695328 311501160
2240 311501160 311300449 311108627 310932751 310769768 310608368 310432434 310227318 309986877 309720345 309454575
2250 309454575 309228325 309078674 309024811 309057026 309138088 309218826 309259281 309245090 309188728 309115906 309045181
2261 309045181 308974781 308883419 308745403 308548546 308304520 308044415 307803478 307603416 307440186 307283497
2271 307283497 307085838 306798363 306389675 305863323 305266666 304686680 304228058 303979778 303982677 304213085
$$ packed form
2198C17025585l07598k87952k73266k62470k45553k12268j61534j05285o1131m1923
2208C15066605m8066o6642q0872q0948o8893n7297n9471q0738j16558j55125j85490
2219C14066505k02121k05288j98593j85280j67561j47991j30463j18980j14861j14708
2229C12480659j11503r8496p4253m5223k2926j9398l9444p8983j26648j68457j94168
2240C11501160k00711j91822j75876j62983j61400j75934k05116k40441k66532k65770
2250C09454575k26250j49651n3863L2215Q1062Q0738M0455j4191n6362p2822p0725
2261C09045181p0400r1362j38016j96857k44026k60105k40937k00062j63230j56689
2271C07283497j97659k87475m08688n26352n96657n79986m58622k48280K899K30408
$$ plain form
2281 304213085 304593239 305022449 305416031 305732555 305979729 306200924 306453114 306786442 307232819 307799625
2291 307799625 308468781 309198608 309933147 310619488 311228714 311771183 312296085 312873421 313565102 314396553
2301 314396553 315340042 316316471 317213345 317915745 318342934 318482094 318407288 318274193 318283978 318623524
2311 318623524 319398003 320577660 321981926 323307838 324205818 324384727 323717957 322311096 320492973
2320 320492973 318714294 317378769 316674213 316489410 316470184 316198711 315405693 314098454 312532921
2329 312532921 311053791 309906464 309141273 308653755 308300819 307976303 307566624 306824398 305301056
2338 305301056 302476158 298097553 292568035 287112980 283532696 283561306 288099461 296707115 307638187
2347 307638187 318433266 326800423 331376419 332042618 329712563 325765610 321437225 317431793 313866863
$$ packed form
2281C04213085L80154M29210L93582L16524K47174K21195K52190L33328M46377N66806
2291C07799625O69156P29827P34539O86341O09226N42469N24902N77336O91681Q31451
2301C14396553R43489R76429Q96874P02400M27189J39160p4806j33095R785L39546
2311C18623524P74479J179657J404266J325912Q97980J78909o66770j406861j818123
2320C20492973j778679j335525p04556j84803j9226k71473p93018j307239j565533
2329C12532921j479130j147327p65191m87518l52936l24516m09679p42226j523342
2338C05301056k824898m378605n529518n455055l580284K8610M538155Q607654J0931072
2347C07638187J0795079Q367157M575996O66199k330055l946953m328385m005432l564930
$$ plain form
2356 313866863 310475960 306903896 302937679 298594875 294079800 289670830 285604630 282006760 278882389
2365 278882389 276159744 273759594 271654644 269890652 268559170 267741146 267456226 267649384 268221607
2374 268221607 269082279 270186310 271533699 273135090 274969406 276963921 279007549 280985184 282808628
2383 282808628 284428902 285828094 287005787 287972260 288750534 289380112 289911442 290390415 290841141
2392 290841141 291259232 291621723 291907768 292118320 292283897 292454548 292679691 292986145 293365707 293777618
2402 293777618 294165249 294479523 294700298 294844627 294958706 295095806 295291328 295547447 295835037 296111279
2412 296111279 296343479 296524868 296676655 296835136 297032375 297281246 297570076 297869034 298143349 298368015
2422 298368015 298538303 298671284 298798485 298952732 299153481 299400368 299675751 299955425 300220852 300465546
$$ packed form
2356C13866863l390903l572064l966217m342804m515075m408970m066200l597870l124371
2365B78882389k722645k400150k104950j763992j331482q18024k84920J93158N72223
2374B68221607Q60672J104031J347389J601391J834316J994515K043628J977635J823444
2383B82808628J620274J399192J177693R66473P78274O29578N31330M78973M50726
2392B90841141M18091L62491K86045K10552J65577J70651K25143L06454L79562M11911
2402B93777618L87631L14274K20775J44329J14079J37100J95522K56119K87590K76242
2412B96111279K32200J81389J51787J58481J97239K48871K88830K98958K74315K24666
2422B98368015J70288J32981J27201J54247K00749K46887K75383K79674K65427K44694
$$ plain form
2432 300465546 300692997 300909882 301120358 301325264 301525402 301722851 301918011 302104473 302266254 302384434
2442 302384434 302448158 302463131 302449989 302430439 302412052 302383671 302325974 302232609 302124577 302046204 302041759 302126579
2454 302126579 302272377 302416744 302491646 302454529 302302437 302065582 301786842 301502895 301237907 301007824
2464 301007824 300825577 300698891 300620155 300558014 300462227 300283432 300000057 299634705 299248409 298914127
2474 298914127 298682098 298556843 298498497 298444767 298341503 298162823 297911644 297605934 297261410 296885185
2484 296885185 296483288 296073856 295693150 295385971 295182228 295074978 295014782 294928284 294751930 294463291
2494 294463291 294090996 293696651 293338814 293040047 292775974 292492142 292138882 291703243 291220474 290759106
2504 290759106 290388737 290148907 290033455 289998283 289984913 289946995 289865341 289747009 289611111 289471989 289331455
$$ packed form
2432C00465546K27451K16885K10476K04906K00138J97449J95160J86462J61781J18180
2442C02384434O3724J4973j3142j9550j8387k8381n7697r3365j08032p8373m445Q4820
2454C02126579J45798J44367P4902l7117j52092k36855k78740k83947k64988k30083
2464C01007824j82247j26686p8736o2141r5787j78795k83375l65352l86296l34282
2474B98914127k32029j25255n8346n3730j03264j78680k51179l05710l44524l76225
2484B96885185m01897m09432l80706l07179k03743j07250o0196q6498j76354k88639
2494B94463291l72295l94345l57837k98767k64073k83832l53260m35639m82769m61368
2504B90759106l70369k39830j15452l5172j3370l7918q1654j18332j35898j39122j40534
$$ plain form
2515 289331455 289182949 289024029 288868160 288744106 288681984 288692379 288752365 288807411 288793087 288663902 288415356
2526 288415356 288086147 287740173 287438374 287217007 287081871 287018394 287008114 287039204 287104683 287193851 287283039
2537 287283039 287337284 287320938 287212486 287013702 286748848 286454277 286166592 285913105 285710773 285568581
2547 285568581 285490189 285472889 285504475 285561504 285612984 285630436 285600109 285530300 285449524 285393066 285385284 285427132
2559 285427132 285495625 285557175 285586662 285581493 285560951 285551701 285568981 285605755 285638008 285642357 285614853 285575504
2571 285575504 285556011 285577717 285635185 285696945 285724945 285698376 285627556 285548248 285501556 285513496 285588036 285715866
2583 285715866 285890083 286113892 286394806 286727772 287083664 287412701 287664433 287812042 287865982 287866631 287862606
2594 287862606 287887554 287949409 288037453 288137360 288243217 288357277 288479939 288600788 288698997 288755417 288767529
$$ packed form
2515B89331455j48506j58920j55869j24054o2122J0395N9986N5046j4324j29185k48546
2526B88415356l29209l45974l01799k21367j35136o3477j0280L1090O5479Q9168Q9188
2537B87283039N4245j6346j08452j98784k64854k94571k87685k53487k02332j42192
2547B85568581p8392j7300L1586N7029N1480J7452l0327o9809q0776n6458p782M1848
2559B85427132O8493O1550K9487n169k0542r250J7280L6774L2253M349k7504l9349
2571B85575504j9493K1706N7468O1760K8000k6569p0820p9308m6692J1940P4540J27830
2583B85715866J74217K23809K80914L32966L55892L29037K51732J47609N3940O49m025
2594B87862606K4948O1855Q8044R9907J05857J14060J22662J20849R8209N6420J2112
$$ plain form
2605 288767529 288755875 288755493 288796329 288883553 288991299 289074116 289089622 289021187 288886166 288727150 288588257
2616 288588257 288492069 288426971 288352661 288222694 288011036 287730217 287430420 287178841 287028904 286996536 287055054
2627 287055054 287154655 287253628 287345619 287465286 287668667 287998695 288455486 288987789 289511642 289945240
2637 289945240 290241909 290404358 290476036 290516014 290572872 290669365 290802059 290952396 291100006 291230888 291339893
2648 291339893 291427574 291497269 291553116 291600571 291646404 291696892 291754303 291813393 291859894 291874561 291841736 291759415
2660 291759415 291646137 291539078 291481743 291505375 291610584 291761208 291892796 291936817 291848965 291630249 291330204
2671 291330204 291029663 290809650 290720062 290761604 290887337 291024704 291105804 291093693 290992222 290837917 290678310
2682 290678310 290549297 290462418 290406494 290359497 290302715 290227509 290134354 290027599 289912491 289797668 289699726
$$ packed form
2605B88767529j1654l82M0836Q7224J07746Q2817J5506o8435j35021j59016j38893
2616B88588257r6188o5098p4310j29967k11658k80819k99797k51579j49937l2368N8518
2627B87055054R9601R8973R1991J19667K03381L30028M56791N32303N23853M33598
2637B89945240K96669J62449P1678L9978N6858R6493J32694J50337J47610J30882J09005
2648B91339893Q7681O9695N5847M7455M5833N0488N7411N9090M6501J4667l2825q2321
2660B91759415j13278j07059n7335K3632J05209J50624J31588M4021q7852k18716l00045
2671B91330204l00541k20013q9588M1542J25733J37367Q1100j2111j01471j54305j59607
2682B90678310j29013q6879n5924m6997n6782p5206r3155j06755j15108j14823r7942
$$ plain form
2693 289699726 289643803 289654942 289743652 289893150 290059471 290185204 290222626 290152836 289991550 289779415 289563980
2704 289563980 289383068 289257793 289194317 289189663 289235821 289319305 289420166 289512501 289568424 289563961 289482250 289315281
2716 289315281 289062653 288731136 288335152 287896385 287439766 286987934 286555538 286148415 285768661 285422173
2726 285422173 285122471 284886799 284726410 284637585 284599113 284578762 284544353 284471664 284346619 284162579 283917961
2737 283917961 283619366 283287468 282958946 282679043 282484550 282385712 282358704 282354374 282320099 282222099 282056999
2748 282056999 281846027 281618404 281395054 281181736 280973778 280766869 280564098 280376263 280216732 280096302
2758 280096302 280022926 280004807 280051632 280170593 280356178 280582447 280803795 280969334 281043930 281026630 280953465
2769 280953465 280881691 280860844 280905685 280984840 281032181 280975895 280770817 280418549 279966202 279485073 279042034
$$ packed form
2693B89699726n5923J1139Q8710J49498J66321J25733L7422o9790j61286k12135k15435
2704B89563980j80912j25275o3476m654M6158Q3484J00861R2335N5923m463q1711j66969
2716B89315281k52628l31517l95984m38767m56619m51832m32396m07123l79754l46488
2726B85422173k99702k35672j60389q8825l8472k0351l4409p2689j25045j84040k44618
2737B83917961k98595l31898l28522k79903j94493r8838k7008m330l4275r8000j65100
2748B82056999k10972k27623k23350k13318k07958k06909k02771j87835j59531j20430
2758B80096302p3376j8119M6825J18961J85585K26269K21348J65539P4596j7300p3165
2769B80953465p1774k0847M4841P9155M7341n6286k05078l52268m52347m81129m43039
$$ plain form
2780 279042034 278677368 278398514 278190880 278035870 277924175 277857075 277836208 277848206 277857037 277808552 277648487
2791 277648487 277345314 276907425 276386509 275863419 275422726 275123024 274976673 274945335 274953632 274916458 274768696
2802 274768696 274486771 274093609 273647270 273218994 272870579 272640076 272537994 272552299 272656193 272814674
2812 272814674 272988987 273139591 273231640 273241119 273161049 273002663 272790871 272554321 272314968 272079792 271839962
2823 271839962 271576653 271270428 270911903 270506363 270071507 269627666 269185696 268738155 268259697 267716541
2833 267716541 267081261 266344337 265515823 264617844 263671360 262686939 261663227 260593395 259473705
2842 259473705 258307400 257102585 255866699 254602127 253306942 251979485 250622444 249244061 247856331
2851 247856331 246471672 245101681 243756332 242442169 241159019 239896603 238637085 237363243 236070290
$$ packed form
2780B79042034l64666k78854k07634j55010j11695o7100k0867J1998Q831m8485j60065
2791B77648487l03173m37889n20916n23090m40693k99702j46351l1338Q297l7174j47762
2802B74768696k81925l93162m46339m28276l48415k30503j02082J4305J03894J58481
2812B72814674J74313J50604R2049R479q0070j58386k11792k36550k39353k35176k39830
2823B71839962k63309l06225l58525m05540m34856m43841m41970m47541m78458n43156
2833B67716541o35280p36924q28514q97979r46484r84421j023712j069832j119690
2842B59473705j166305j204815j235886j264572j295185j327457j357041j378383j387730
2851B47856331j384659j369991j345349j314163j283150j262416j259518j273842j292953
$$ plain form
2860 236070290 234771557 233492985 232256279 231061420 229881115 228674011 227410507 226095676 224774323
2869 224774323 223513088 222371101 221375866 220517998 219766159 219088154 218465576 217891521 217358074 216844349
2879 216844349 216316471 215740719 215100555 214408226 213701687 213031101 212440872 211957302 211586342 211319847
2889 211319847 211147575 211067142 211087360 211223125 211482029 211848316 212274590 212686100 213002148 213165245
2899 213165245 213164616 213042221 212876568 212753277 212736816 212857800 213119183 213512878 214034271 214685707 215467529
2910 215467529 216365528 217343445 218345261 219305496 220162430 220868149 221395168 221738091 221911221 221941204
2920 221941204 221853390 221657200 221336308 220850925 220154629 219217663 218044834 216677036 215171642 213572865
2930 213572865 211885796 210069466 208051910 205759335 203143864 200195312 196933327 193388824 189586334
$$ packed form
2860B36070290j298733j278572j236706j194859j180305j207104j263504j314831j321353
2869B24774323j261235j141987r95235q57868p51839o78005o22578n74055n33447n13725
2879B16844349n27878n75752o40164o92329p06539o70586n90229m83570l70960k66495
2889B11319847j72272q0433K0218J35765K58904L66287M26274M11510L16048J63097
2899B13165245o29j22395j65653j23291j6461J20984K61383L93695N21393O51436P81822
2910B15467529Q97999R77917J001816R60235Q56934P05719N27019L42923J73130K9983
2920B21941204q7814j96190l20892m85383o96296r36966j172829j367798j505394j598777
2930B13572865j687069j816330k017556k292575k615471k948552l261985l544503l802490
$$ plain form
2939 189586334 185540886 181268749 176804676 172211323 167574348 162984142 158516130 154221144 150129890
2948 150129890 146266813 142660856 139344778 136345377 133672590 131320639 129279976 127554379 126167240
2957 126167240 125150728 124522381 124266834 124335651 124669313 125228100 126010704 127049046 128381004 130020542
2967 130020542 131943169 134095602 136419649 138872566 141430655 144076014 146780081 149499426 152187777
2976 152187777 154815712 157382908 159912615 162430420 164942760 167428265 169848881 172172279 174390984
2985 174390984 176526604 178615665 180687542 182747498 184774284 186733513 188598156 190363445 192048702
2994 192048702 193683968 195290394 196866913 198392544 199844913 201225204 202572250 203954372 205438938
3003 205438938 207055435 208774624 210518436 212198887 213764763 215228786 216658592 218136082 219709129
$$ packed form
2939A89586334m045448m272137m464073m593353m636975m590206m468012m294986m091254
2948A50129890l863077l605957l316078k999401k672787k351951k040663j725597j387139
2957A26167240j016512o28347k55547O8817L33662N58787P82604J038342J331958J639538
2967A30020542J922627K152433K324047K452917K558089K645359K704067K719345K688351
2976A52187777K627935K567196K529707K517805K512340K485505K420616K323398K218705
2985A74390984K135620K089061K071877K059956K026786J959229J864643J765289J685257
2994A92048702J635266J606426J576519J525631J452369J380291J347046J382122J484566
3003B05438938J616497J719189J743812J680451J565876J464023J429806J477490J573047
$$ plain form
3012 219709129 221365089 223040447 224660358 226182823 227621498 229036293 230497875 232049446 233685017
3021 233685017 235353012 236978798 238491955 239845505 241021290 242025013 242875824 243596401 244206505
3030 244206505 244720192 245146751 245494118 245772514 245993843 246165581 246279850 246302414 246169491 245796108
3040 245796108 245096169 244006386 242506714 240627804 238447609 236078568 233652630 231308575 229180164
3049 229180164 227384853 226008739 225092182 224619083 224518604 224681187 224985733 225327911 225638485 225884457
3059 225884457 226056309 226150951 226162720 226089573 225948410 225787334 225680981 225704861 225900230 226247425 226665211
3070 226665211 227040958 227276630 227328854 227222233 227031555 226845150 226731243 226724453 226836586 227079391
3080 227079391 227480659 228082428 228919430 229992085 231249752 232595329 233908730 235079746 236033459
$$ packed form
3012B19709129J655960J675358J619911J522465J438675J414795J461582J551571J635571
3021B33685017J667995J625786J513157J353550J175785J003723Q50811P20577O10104
3030B44206505N13687M26559L47367K78396K21329J71738J14269K2564j32923l73383
3040B45796108o99939j089783j499672j878910k180195k369041k425938k344055k128411
3049B29180164j795311j376114r16557m73099j00479J62583L04546L42178L10574K45972
3059B25884457J71852R4642J1769p3147j41163j61076j06353K3880J95369L47195M17786
3070B26665211L75747K35672N2224j06621j90678j86405j13907o790J12133K42805
3080B27079391M01268O01769Q37002J072655J257667J345577J313401J171016R53713
$$ plain form
3089 236033459 236739616 237204227 237451210 237504673 237380219 237088165 236644535 236083584 235464535 234868507
3099 234868507 234386673 234104118 234083061 234353008 234907513 235709705 236702957 237824001 239014053 240227318
3109 240227318 241432323 242608280 243736782 244792614 245738602 246527271 247110920 247457638 247566166
3118 247566166 247473450 247250061 246983566 246757793 246634254 246643505 246787357 247047653 247397022 247805634
3128 247805634 248245640 248695526 249145050 249601002 250085945 250627766 251240978 251909523 252582378 253188877
3138 253188877 253669014 254003983 254228535 254417152 254649410 254972687 255381908 255826740 256239548 256568069
3148 256568069 256795597 256940136 257038116 257125797 257227478 257355785 257517567 257718391 257961941 258244705
3158 258244705 258551292 258854046 259118671 259313889 259421349 259444485 259411774 259371853 259379749 259475307 259662685
$$ packed form
3089B36033459P06157M64611K46983N3463j24454k92054m43630n60951o19049n96028
3099B34868507m81834k82555k1057K69947N54505Q02192R93252J121044J190052J213265
3109B40227318J205005J175957J128502J055832R45988P88669N83649L46718J08528
3118B47566166r2716k23389k66495k25773j23539R251J43852K60296L49369M08612
3128B47805634M40006M49886M49524M55952M84943N41821O13212O68545O72855O06499
3138B53188877M80137L34969K24552J88617K32258L23277M09221M44832M12808L28521
3148B56568069K27528J44539R7980Q7681J01681J28307J61782K00824K43550K82764
3158B58244705L06587L02754K64625J95218J07460K3136l2711l9921P896R5558J87378
$$ plain form
3169 259662685 259902287 260123310 260253639 260255775 260146866 259991570 259867935 259824810 259856110 259905872 259903660
3180 259903660 259807510 259630432 259434109 259294720 259260311 259326572 259440765 259531193 259542789 259459553 259305172
3191 259305172 259124813 258962784 258848610 258794823 258804302 258877277 259012108 259201488 259426727 259658298 259863014
3202 259863014 260015774 260109367 260156803 260184231 260217552 260268745 260327263 260362339 260333862 260208874 259975929
3213 259975929 259652119 259278431 258906994 258583145 258332634 258155994 258034019 257939396 257849178 257753410
3223 257753410 257656002 257568893 257503395 257462120 257436543 257411022 257371025 257313881 257253609 257217369 257232914 257311554
3235 257311554 257435379 257558117 257620888 257578583 257424545 257198372 256974144 256829948 256815014 256930294
3245 256930294 257130508 257347736 257522812 257628517 257676144 257702694 257748661 257836685 257960548 258087425 258170357
$$ packed form
3169B59662685K39602K21023J30329K136j08909j55296j23635m3125L1300M9762k212
3180B59903660r6150j77078j96323j39389l4409O6261J14193R0428J1596q3236j54381
3191B59305172j80359j62029j14174n3787R479P2975J34831J89380K25239K31571K04716
3202B59863014J52760R3593M7436K7428L3321N1193N8518L5076k8477j24988k32945
3213B59975929l23810l73688l71437l23849k50511j76640j21975r4623r0218r5768
3223B57753410r7408q7109o5498m1275k5577k5521l9997n7144o0272l6240J5545P8640
3235B57311554J23825J22738O2771m2305j54038k26173k24228j44196j4934J15280
3245B56930294K00214K17228J75076J05705M7627K6550M5967Q8024J23863J26877Q2932
$$ plain form
3256 258170357 258165150 258047161 257821770 257527370 257227554 256993656 256882572 256916370 257072735 257291279
3266 257291279 257494049 257612610 257610798 257494011 257301960 257089748 256905365 256773109 256687527 256618690 256525860
3277 256525860 256372929 256141262 255835953 255483570 255122738 254790535 254510765 254288483 254113388 253969326
3287 253969326 253844910 253738327 253654652 253596516 253556328 253515759 253454971 253367577 253271523 253207645 253223972
3298 253223972 253351650 253584175 253872833 254140759 254311123 254336281 254214058 253985634 253716221 253470612
3308 253470612 253293552 253202572 253192558 253245659 253339481 253450584 253553486 253620548 253624783 253546524 253380394
3319 253380394 253138733 252849579 252549305 252272873 252045460 251876316 251756516 251661434 251557598 251413651
3329 251413651 251213150 250963631 250697803 250464840 250313797 250276775 250359230 250540333 250782642 251042938
$$ packed form
3256B58170357n207j17989k25391k94400k99816k33898j11084L3798J56365K18544
3266B57291279K02770J18561j812j16787j92051k12212j84383j32256q5582o8837r2830
3277B56525860j52931k31667l05309l52383l60832l32203k79770k22282j75095j44062
3287B53969326j24416j06583q3675n8136m0188m0569o0788q7394r6054o3878J6327
3298B53223972J27678K32525K88658K67926J70364K5158j22223k28424k69413k45609
3308B53470612j77060r0980j0014N3101R3822J11103J02902O7062M235p8259j66130
3319B53380394k41661k89154l00274k76432k27413j69144j19800r5082j03836j43947
3329B51413651k00501k49519k65828k32963j51043l7022Q2455J81103K42309K60296
$$ plain form
3339 251042938 251280823 251462650 251564350 251576843 251513233 251412373 251332397 251331043 251441784 251657524 251934242
3350 251934242 252214031 252455158 252650280 252822266 252999096 253186588 253358097 253468037 253482151 253402328
3360 253402328 253267899 253133583 253037834 252983932 252946949 252899017 252833900 252771606 252738819 252741337 252750072 252714558
3372 252714558 252597389 252406235 252199593 252058430 252039299 252137775 252285538 252384758 252358379 252187786 251915417
3383 251915417 251613712 251340675 251110020 250890541 250634422 250311718 249930115 249529209 249153385 248823338
3393 248823338 248522205 248204765 247821941 247344837 246774960 246137333 245461540 244766026 244052467 243312397
3403 243312397 242538834 241734219 240910587 240082245 239258423 238438797 237613888 236765766 235868282 234887657
3413 234887657 233787785 232542686 231152725 229656162 228125610 226645870 225281944 224053345 222928448
$$ packed form
3339B51042938K37885J81827J01700J2493o3610j00860p9976j354J10741K15740K76718
3350B51934242K79789K41127J95122J71986J76830J87492J71509J09940J4114p9823
3360B53402328j34429j34316r5749n3902l6983m7932o5117o2294l2787K518Q735l5514
3372B52714558j17169j91154k06642j41163j9131R8476J47763R9220k6379j70593k72369
3383B51915417l01705k73037k30655k19479k56119l22704l81603m00906l75824l30047
3393B48823338l01133l17440l82824m77104n69877o37627o75793o95514p13559p40070
3403B43312397p73563q04615q23632q28342q23822q19626q24909q48122q97484r80625
3413B34887657j099872j245099j389961j496563j530552j479740j363926j228599j124897
$$ plain form
3422 222928448 221845913 220751610 219633579 218536510 217549076 216771145 216276665 216089592 216181355
3431 216181355 216488991 216943817 217498074 218138905 218883247 219757347 220768528 221884651 223032551
3440 223032551 224119034 225067616 225851860 226508160 227118282 227770557 228519516 229364910 230259628 231139011
3450 231139011 231951981 232677670 233321037 233897057 234418201 234893360 235336533 235773602 236238651 236758556
3460 236758556 237337894 237953873 238566494 239137611 239645844 240089970 240481281 240833931 241161404 241478176
3470 241478176 241801109 242141762 242492352 242816658 243057098 243160896 243111591 242944336 242732220 242547379
3480 242547379 242422485 242338295 242245750 242108879 241935787 241773453 241670742 241634293 241613636 241530342 241332378
3491 241332378 241035748 240721130 240482349 240362053 240316792 240239391 240024090 239632320 239114876 238577003
$$ packed form
3422B22928448j082535j094303j118031j097069r87434p77931m94480j87073R1763
3431B16181355L07636M54826N54257O40831P44342Q74100J011181J116123J147900
3440B23032551J086483R48582P84244O56300O10122O52275P48959Q45394Q94718Q79383
3450B31139011Q12970P25689O43367N76020N21144M75159M43173M37069M65049N19905
3460B36758556N79338O15979O12621N71117N08233M44126L91311L52650L27473L16772
3470B41478176L22933L40653L50590L24306K40440J03798m9305j67255k12116j84841
3480B42547379j24894q4190r2545j36871j73092j62334j02711l6449k0657q3294j97964
3491B41332378k96630l14618k38781j20296m5261p7401k15301l91770n17444n37873
$$ plain form
3501 238577003 238110123 237736511 237401810 237016144 236515961 235904942 235253944 234663925 234220982 233966637
3511 233966637 233895302 233968487 234131393 234322090 234475498 234526596 234416313 234098511 233542328 232733898
3521 232733898 231681767 230430698 229076424 227766895 226673183 225933342 225590401 225561066 225661659
3530 225661659 225688152 225516453 225169029 224806671 224640503 224804249 225253754 225752563 225962944 225604115
3540 225604115 224598866 223128853 221562576 220288105 219539490 219310570 219400120 219557076 219631557 219641781
3550 219641781 219724884 220020771 220579205 221355667 222285480 223356934 224604321 226003571 227349548
3559 227349548 228230648 228167992 226872253 224471169 221552696 218968849 217488728 217483540 218807659
3568 218807659 220919228 223153343 224990368 226202946 226856956 227221317 227655907 228502693 229973164
$$ packed form
3501B38577003m66880l73612l34701l85666n00183o11019o50998n90019m42943k54345
3511B33966637p1335P3185J62906J90697J53408N1098j10283l17802n56183q08430
3521B32733898j052131j251069j354274j309529j093712p39841l42941k9335J00593
3530B25661659K6493j71699l47424l62358j66168J63746M49505M98809K10381l58829
3540B25604115j005249j470013j566277j274471p48615k28920Q9550J56956P4481J0224
3550B19641781Q3103K95887N58434P76462R29813J071454J247387J399250J345977
3559B27349548Q81100o2656j295739k401084k918473k583847j480121n188J324119
3568B18807659K111569K234115J837025J212578O54010L64361M34590Q46786J470471
$$ plain form
3577 229973164 232030354 234314880 236194496 236977196 236228504 234034958 231045399 228228779 226453037
3586 226453037 226106014 226964397 228371372 229601059 230193024 230082417 229499531 228756962 228082924 227589436
3596 227589436 227341309 227418976 227893810 228728027 229691849 230393486 230437279 229627285 228092270 226250935
3606 226250935 224634533 223662548 223479958 223915901 224553490 224870014 224406986 222944584 220647411
3615 220647411 218114033 216253796 215964470 217699490 221124916 225086632 227981644 228415699 225839443
3624 225839443 220832253 214869537 209687004 206569405 205917892 207270260 209689407 212256947 214411259
3633 214411259 216026745 217302380 218601494 220328274 222819977 226195984 230172005 233960743 236413651
3642 236413651 236446819 233591766 228363171 222181587 216826763 213683167 213183422 214744205 217196198
$$ packed form
3577B29973164K057190K284526J879616P82700p48692k193546k989559k816620j775742
3586B26453037l47023Q58383J406975J229687N91965j10607n82886p42569o74038m93488
3596B27589436k48127P7667M74834Q34217R63822P01637M3793q09994j535015j841335
3606B26250935j616402r71985j82590M35943O37589L16524m63028j462402k297173
3615B20647411k533378j860237k89326J735020L425426L961716K895012M34055k576256
3624B25839443n007190n962716n182533l117599o51513J352368K419147K567540K154312
3633B14411259J615486J275635J299114J726780K491703L376007L976021L788738K452908
3642B36413651L3168k855053n228595o181584n354824l143596m99745J560783K451993
$$ plain form
3651 217196198 219428806 220877171 221630440 222197514 223154182 224896107 227571888 231117840 235280132
3660 235280132 239600239 243444424 246167011 247382412 247183437 246120872 244895229 243926563 243088074
3669 243088074 241809101 239510078 236096191 232181950 228892632 227362919 228242893 231484623 236473312
3678 236473312 242340660 248222866 253338699 256954384 258405647 257284641 253720570 248545189 243158474
3687 243158474 239085102 237421017 238452873 241633282 245888805 250063248 253272190 255057220 255376720
3696 255376720 254539909 253148022 252007504 251937580 253456745 256462269 260103416 262999802 263781261
3705 263781261 261721268 257142677 251367588 246211967 243263798 243290977 246036472 250449524 255182571
3714 255182571 259090099 261519966 262340698 261791534 260298595 258359852 256508217 255295086 255221119
$$ packed form
3651B17196198K232608J448365P53269N67074R56668J741925K675781L545952M162292
3660B35280132M320107L844185K722587J215401j98975j062565j225643r68666q38489
3669B43088074j278973k299023l413887l914241l289318j529713Q79974L241730M988689
3678B36473312N867348N882206N115833L615685J451263j121006l564071n175381n386715
3687B43158474m073372j664085J031856L180409M255523M174443L208942J785030L19500
3696B55376720q36811j391887j140518o9924J519165L005524L641147K896386P81459
3705B63781261k059993m578591n775089n155621k948169K7179K745495M413052M733047
3714B55182571L907528K429867Q20732n49164j492939j938743j851635j213131p3967
$$ plain form
3723 255221119 256591454 259335880 262885036 266200676 268015747 267259140 263539581 257482910 250714931
3732 250714931 245393257 243398418 245510025 250977287 257760887 263399811 266101093 265491734 262621098
3741 262621098 259219437 256651878 255190525 254029236 252000999 248513222 244087696 240155277 238239803
3750 238239803 239057178 242091999 245899849 248921299 250295944 250207539 249612617 249582710 250683575
3759 250683575 252724991 254949741 256475277 256711178 255564079 253406105 250900955 248795185 247728310
3768 247728310 248067932 249782715 252401638 255122643 257076435 257660751 256789455 254919224 252826176
3777 252826176 251242714 250545254 250654869 251184998 251730385 252115955 252464485 253065376 254151363 255737476
3787 255737476 257621212 259519653 261227036 262669163 263821583 264574375 264675789 263832912 261918888
$$ packed form
3723B55221119J370335K744426L549156L315640J815071p56607l719559o056671o767979
3732B50714931n321674j994839K111607N467262O783600N638924K701282o09359k870636
3741B62621098l401661k567559j461353j161289k028237l487777m425526l932419j915474
3750B38239803Q17375L034821L807850L021450J374645q8405n94922k9907J100865
3759B50683575K041416K224750J525536K35901j147099k157974k505150k105770j066875
3768B47728310L39622J714783K618923K721005J953792N84316q71296j870231k093048
3777B52826176j583462o97460J09615N30129N45387L85570L48530O00891J085987J586113
3787B55737476J883736J898441J707383J442127J152420P52792J01414q42877j914024
$$ plain form
3796 261918888 259134827 255986080 253058624 250735226 249052372 247810764 246864452 246370087 246785622
3805 246785622 248580513 251840057 256042328 260189610 263238068 264562588 264166851 262527695 260210457
3814 260210457 257542992 254568443 251279011 247918510 245090313 243556423 243842125 245912991 249148216
3823 249148216 252639751 255632782 257838631 259440765 260816650 262169743 263307934 263701420 262777672
3832 262777672 260273514 256439819 251986656 247808189 244647388 242889900 242589970 243681507 246198235
3841 246198235 250306034 256064854 263034821 269998779 275075569 276310921 272542095 264112282 253015766
3850 253015766 242305050 234973927 232817936 235804138 242229328 249552441 255471039 258737106
3858 258737106 259388142 258388748 256951160 255905170 255398102 255001297 254097958 252318153 249798450
$$ packed form
3796B61918888k784061l148747k927456k323398j682854j241608r46312m94365M15535
3805B46785622J794891L259544M202271M147282L048458J324520l95737j639156k317238
3814B60210457k667465k974549l289432l360501k828197j533890K85702K070866L235225
3823B49148216L491535K993031K205849J602134J375885J353093J138191L93486r23748
3832B62777672k504158l833695m453163m178467l160801j757488k99930J091537K516728
3841B46198235M107799N758820O969967O963958N076790J235352l768826q429813j1096516
3850B53015766j0710716p331123k155991K986202O425190P323113N918598L266067
3858B58737106O51036r99394j437588j045990n07068l96805r03339j779805k519703
$$ plain form
3867 249798450 247156258 245212326 244613304 245543308 247658501 250258789 252592869 254134293 254704933
3876 254704933 254424324 253561554 252401791 251189995 250135078 249408665 249096355 249131374 249287891 249292336
3886 249292336 249018192 248644180 248644199 249568977 251716728 254879360 258324394 261040764 262127781 261131878
3896 261131878 258179913 253881454 249088821 244647675 241226768 239244099 238854885 239964218 242260647
3905 242260647 245279655 248499908 251446438 253762779 255235062 255783691 255453396 254416351 252968273
3914 252968273 251478863 250286484 249577122 249321861 249325829 249371338 249363823 249379158 249571915 250006428 250537262
3925 250537262 250839958 250592632 249698792 248402462 247208824 246644402 246993198 248156300 249706726
3934 249706726 251096344 251894493 251940231 251352730 250425243 249473228 248710270 248191128 247830868 247479191
$$ packed form
3867B49798450k642192j943932n99022R30004K115193K600288K334080J541424N70640
3876B54704933k80609q62770j159763j211796j054917p26413l12310L5019J56517M445
3886B49292336k74144l74012J9R24778K147751L162632L445034K716370J087017r95903
3896B61131878k951965m298459m792633m441146l420907j982669l89214J109333K296429
3905B42260647L019008L220253K946530K316341J472283N48629l30295j037045j448078
3914B52968273j489410j192379p09362k55261L968M5509p515J5335J92757M34513N30834
3925B50537262L02696k47326q93840j296330j193638n64422L48796J163102J550426
3934B49706726J389618P98149M5738n87501r27487r52015p62958n19142l60260l51677
$$ plain form
3944 247479191 247017193 246434841 245851822 245464993 245444851 245836163 246522141 247276917 247875843 248196220
3954 248196220 248250427 248141022 247980328 247833157 247713451 247616520 247545662 247507133 247484035 247426624 247276230
3965 247276230 247008457 246653214 246270847 245902328 245542469 245165176 244779205 244457474 244297638 244337234
3975 244337234 244498005 244621868 244586010 244401360 244201069 244110355 244104824 243995018 243579655 242852879 242071056
3986 242071056 241573219 241464252 241433411 240927944 239624577 237833347 236397266 235946484 235871353 233742905
3996 233742905 225799103 208523026 180599308 144145517
4000 144145517
$$ packed form
3944B47479191m61998n82352n83019l86829k0142L91312O85978P54776N98926L20377
3954B48196220N4207j09405j60694j47171j19706r6931p0858l8529k3098n7411j50394
3965B47276230k67773l55243l82367l68519l59859l77293l85971l21731j59836L9596
3975B44337234J60771J23863l5858j84650k00291r0714n531j09806m15363p26776p81823
3986B42071056m97837j08967l0841n05467j303367j791230j436081m50782p5131k128448
3996B33742905p943802j7276077k7923718l6453791
4000A44145517
##END=$$ End of the data block
