##TITLE=CAU $$ Begin of the data block
##JCAMP-DX=5.00 $$ ACD/SpecManager v 10.08
##SPECTROMETER/DATA SYSTEM=Alpha
##DATE=12 Mar 2014 10:59:36
##DATA TYPE=INFRARED SPECTRUM
##DATA CLASS=XYDATA
##ORIGIN=
##OWNER=
##NPOINTS=1765
##FIRSTX=399.75695801
##LASTX=3997.56933594
##MAXX=3997.56933594
##MINX=399.75695801
##MAXY=0.85098416
##MINY=0.45172244
##XFACTOR=1.0000000000
##YFACTOR=1.000000000000000e-9
##FIRSTY=0.67386734
##DELTAX=2.03957629
##XUNITS=1/CM
##YUNITS=ARBITRARY UNITS
##XYDATA=(X++(Y..Y))
399.8F73867345j10030m24683p6116N81623L65376k23756m40180n41151o93500l53157
420.2F71951771J10388j26601k79009j18077k84850m31478j04666L36051N90145M09782
440.5F72053456J35303L97503N72562K32459j54496l69310k81513j23501l20077o44743
460.9F71497643o57916m68552n29409o19590m43637m20034m52757l12269l10957l86656
481.3F66895866k14040N2869P4208q1479j44720p7248k9624r3162k13623l53634o36220
503.8F65179193q67307r18985j061678j297116j500547j581371j438260j175701q68321
522.1F54469907m20510J05381M82380P81774J043737J040459Q97288P45893M98056
540.5F59644365K94686J71899L5227j06573k51830l33428l39806k80440k63036m13119
$$ y = [673867345, 673757315, 673332632, 673256516, 673838139, 674203515, 673979759, 673539579, 672998428, 672304928, 671951771, 672062159, 671935558, 671656549, 671538472, 671253622, 670822144, 670717478, 671053529, 671643674, 672053456, 672188759, 672586262, 673158824, 673391283, 673236787, 672867477, 672585964, 672462463, 672142386, 671497643, 670839727, 670371175, 669841766, 669222176, 668778539, 668358505, 667905748, 667593479, 667282522, 666895866, 666681826, 666734695, 666808903, 666727424, 666582704, 666505456, 666475832, 666382670, 666169047, 665815413, 665179193, 664311886, 663392901, 662331223, 661034107, 659533560, 657952189, 656513929, 655338228, 654469907, 654049397, 654154778, 654637158, 655418932, 656462669, 657503128, 658400416, 659146309, 659644365, 659939051, 660110950, 660146177, 660039604, 659787774, 659454346, 659114540, 658834100, 658571064, 658157945]
560.9F58157945n31197o05404p33435p31171p65144q19326n81562l04401j32859J36197
581.3F53089643L92794M50313M02689J58012k20597l55243l41297l66330j45018M18127
601.7F53483093R35495J282811J497388J507282J382112J266003J229525J345098J567304
620F65496111J792252K001166K061725J861632J551628J427889J414418J280248J169384
638.4F80056453J230240J233935J081765R89675R78410R75907R92000R43303Q15094
656.7F89296782O72579M60207K51711K03311M21822J059532J473964J589775J588225
675.1F97017908J481414J439750J254559R35852O61314M38809K96533J77920j18792
693.5G03585267m73678o09219l55542J93477O88076Q89361P46906M28676M33743J035154
$$ y = [658157945, 657626748, 657021344, 656287909, 655556738, 654791594, 653972268, 653390706, 653086305, 652953446, 653089643, 653482437, 653932750, 654335439, 654493451, 654272854, 653917611, 653576314, 653209984, 653064966, 653483093, 654418588, 655701399, 657198787, 658706069, 660088181, 661354184, 662583709, 663928807, 665496111, 667288363, 669289529, 671351254, 673212886, 674764514, 676192403, 677606821, 678887069, 680056453, 681286693, 682520628, 683602393, 684592068, 685570478, 686546385, 687538385, 688481688, 689296782, 689969361, 690429568, 690681279, 690884590, 691306412, 692365944, 693839908, 695429683, 697017908, 698499322, 699939072, 701193631, 702129483, 702790797, 703229606, 703526139, 703704059, 703585267, 703111589, 702502370, 702146828, 702340305, 703028381, 703917742, 704664648, 705093324, 705527067, 706562221]
713.8G06562221J645327J718521J683175J974523K345741K504468K367854K038002
730.2G22839832J617015J201212R13203P32243P27534R48668J216590J393557J504183
748.5G33094037J443505J225054J072168R96948Q91685P96557Q04722Q44419R05931
766.9G42075026J032293J145840J212179J233399J173318J166880J262426J276076
783.2G51577437J179576J018703Q58009P84576P93695Q82149J093387J273036J235486
801.6G60696054J043021Q19445O36935M90427L91007L65257M50671N41865M56334L19600
821.9G66210616L08334K89679J79946R8765L9637n7160j18792p2778q166J0133k3961
844.4G66856253j53303k42889m59909j098335j323521m93050L77238M63843k0265r95756
$$ y = [706562221, 708207548, 709926069, 711609244, 713583767, 715929508, 718433976, 720801830, 722839832, 724456847, 725658059, 726571262, 727303505, 728031039, 728979707, 730196297, 731589854, 733094037, 734537542, 735762596, 736834764, 737831712, 738723397, 739519954, 740324676, 741169095, 742075026, 743107319, 744253159, 745465338, 746698737, 747872055, 749038935, 750301361, 751577437, 752757013, 753775716, 754633725, 755418301, 756211996, 757094145, 758187532, 759460568, 760696054, 761739075, 762558520, 763195455, 763685882, 764076889, 764442146, 764892817, 765434682, 765891016, 766210616, 766518950, 766808629, 766988575, 767087340, 767126977, 767069817, 766951025, 766878247, 766870081, 766880214, 766856253, 766702950, 766460061, 766000152, 764901817, 763578296, 763085246, 763462484, 763926327, 763906062, 762910306]
864.8G62910306k827823n542338p579922o783843l344477J006306N211413P854461
881.1G50904083P843554O216288M379034K722680J332164K97845m24683j004219j445175
899.4G70821571j613140j461744j076520n41687Q0765N21958O02424M55677J67966
917.8G67957270k05099n03421o89686p92026p84993p40409p53641p64549p22230p05063
938.2G61296153p70211r72033j333832j792551k317249k887905l409028l826141m185856
956.6G39801347m477799m631698m675448m673838m629851m586756m572690m505991
972.9G03047276m420698m416943m399895m278720m078984l793895l465772l166854
989.2F71025515k865613k601147k525925k672792k977967l390431l872574m352808
$$ y = [762910306, 760082483, 754540145, 746960223, 740176380, 736831903, 737838209, 743049622, 750904083, 758747637, 764963925, 769342959, 772065639, 773397803, 773695648, 773270965, 772266746, 770821571, 769208431, 767746687, 766670167, 766128480, 766209245, 766731203, 767333627, 767789304, 767957270, 767752171, 767248750, 766559064, 765767038, 764982045, 764241636, 763487995, 762723446, 762001216, 761296153, 760525942, 759553909, 758220077, 756427526, 754110277, 751222372, 747813344, 743987203, 739801347, 735323548, 730691850, 726016402, 721342564, 716712713, 712125957, 707553267, 703047276, 698626578, 694209635, 689809740, 685531020, 681452036, 677658141, 674192369, 671025515, 668159902, 665558755, 663032830, 660360038, 657382071, 653991640, 650119066, 645766258]
1005.5F45766258m785657n110919n177379m982769m655242m256070l800332l274858
1021.8F09723032k665163j958131j136959k62499N37753J126707J315534R59933J93298
1040.2F07833505o41287j275897j584768j541436j261651q71718m00663J41442P40290
1058.5F01137817J309335J730144J917422J728892J070023J45078o27816q93653m90367
1076.9F07026875M27306J540243K714873L744423M286289M390538M274726M000068
1093.2F32405341L678381L398776L110826K800763K495468K181947J937091J796544
1109.5F53805137J680791J604915J630783J721680J839459J980662K023995J796723
1125.8F68084145J274049N72085l32892j428902k398014k993584l172397k988041k581477
$$ y = [645766258, 640980601, 635869682, 630692303, 625709534, 621054292, 616798222, 612997890, 609723032, 607057869, 605099738, 603962779, 603700280, 604238033, 605364740, 606680274, 607640207, 607833505, 607192218, 605916321, 604331553, 602790117, 601528466, 600656748, 600256085, 600397527, 601137817, 602447152, 604177296, 606094718, 607823610, 608893633, 609038711, 608410895, 607517242, 607026875, 607454181, 608994424, 611709297, 615453720, 619740009, 624130547, 628405273, 632405341, 636083722, 639482498, 642593324, 645394087, 647889555, 650071502, 652008593, 653805137, 655485928, 657090843, 658721626, 660443306, 662282765, 664263427, 666287422, 668084145, 669358194, 669930279, 669597387, 668168485, 665770471, 662776887, 659604490, 656616449, 654034972]
1144.2F54034972k091586j622022j262486j068115r45985p19667l03268L47018J185775
1162.6F47554636K055407K875685L607214M227578M788161N236447N387246N187452
1178.9F80919826M724681M056991L252148K416492J562237O57797k30789j063943j835942
1197.2F94459498k380848k495706k246559j782596j192868p13169n05150m91678o31511
1215.6F82019413q66175j036406j120269j185060j225829j235544j234413j190185
1231.9F72925532j102865j024961q72612n49913j15514L73662Q85963J275063J431167
1250.3F73225522J387119J204968J003980R38118J022696J165510J323878J424075
1266.6F82695866J412987J387298J378477J308620J216233J149714J104295J126111
$$ y = [654034972, 651943386, 650321364, 649058878, 647990763, 647044778, 646325111, 646021843, 646368861, 647554636, 649610043, 652485728, 656092942, 660320520, 665108681, 670345128, 675732374, 680919826, 685644507, 689701498, 692953646, 695370138, 696932375, 697590172, 697359383, 696295440, 694459498, 692078650, 689582944, 687336385, 685553789, 684360921, 683647752, 683142602, 682650924, 682019413, 681153238, 680116832, 678996563, 677811503, 676585674, 675350130, 674115717, 672925532, 671822667, 670797706, 669925094, 669375181, 669259667, 669633329, 670519292, 671794355, 673225522, 674612641, 675817609, 676821589, 677759707, 678782403, 679947913, 681271791, 682695866, 684108853, 685496151, 686874628, 688183248, 689399481, 690549195, 691653490, 692779601]
1282.9F92779601J234352J439631J701892J896560J900017J713932J403153J027941
1299.2G05097079O69837L55244N8591k29954m89235p67351j019895j150548j153410
1317.6G01370358j014292p46131m42624j70708J0133o497k44736o56426j087487j414239
1338F95597351j530707j435519j358270j338661j316547j364112j568616j917779k278984
1356.3F81488156k452850k409637k136230j658559j411438j512051j656771j822829
1372.6F66427791j807868j277864p68364p27057q02040m53174Q2254J9669o87539j579464
1393F58426344k302408k599835k862215l057480l185690l413379l286361l084898l046573
1411.4F31587505k856075k518118k258420j802742r43899m04239k11775k40028m63426
$$ y = [692779601, 694013953, 695453584, 697155476, 699052036, 700952053, 702665985, 704069138, 705097079, 705766916, 706122160, 706180751, 705950797, 705461562, 704694211, 703674316, 702523768, 701370358, 700356066, 699609935, 699167311, 698996603, 699006736, 699000239, 698755503, 698099077, 697011590, 695597351, 694066644, 692631125, 691272855, 689934194, 688617647, 687253535, 685684919, 683767140, 681488156, 679035306, 676625669, 674489439, 672830880, 671419442, 669907391, 668250620, 666427791, 664619923, 663342059, 662573695, 661846638, 661044598, 660591424, 660673678, 660693347, 660005808, 658426344, 656123936, 653524101, 650661886, 647604406, 644418716, 641005337, 637718976, 634634078, 631587505, 628731430, 626213312, 623954892, 622152150, 621208251, 620804012, 620592237, 620352209, 619888783]
1429.7F19888783o62745q14855j003682q17180l89695k28047j75834j04189L9220J48952
1450.1F15880728L8504k6583N34117J722991J983881J695574J908123K558947L118753
1468.5F29415035L937900N307496N441725M128754K839566J655042O17921l55363j321018
1486.8F51667058k135574k415479k213716k410591k763033k282679j611590j507282
1503.2F34327114k068401k677917j923263j541972j745642j491069o00219L80695R45866
1521.5F23605192R52601O70076N92112N47707M84944P10129Q51989P33376J183927
1539.9F30332053K000212K224982K308428K350986K588571K871632K940416K728582
1556.2F50345862L488839M815995L553093K683043K535165K399683K423107J946807
$$ y = [619888783, 619226038, 618411183, 617407501, 616590321, 616200626, 615972579, 615796745, 615692556, 615731776, 615880728, 615919232, 615892649, 616426766, 618149757, 620133638, 621829212, 623737335, 626296282, 629415035, 633352935, 638660431, 644102156, 648230910, 651070476, 652725518, 653343439, 652988076, 651667058, 649531484, 647116005, 644902289, 642491698, 639728665, 637445986, 635834396, 634327114, 632258713, 629580796, 627657533, 626115561, 624369919, 622878850, 622278631, 622659326, 623605192, 624557793, 625227869, 625819981, 626367688, 626852632, 627562761, 628414750, 629148126, 630332053, 632332265, 634557247, 636865675, 639216661, 641805232, 644676864, 647617280, 650345862, 653834701, 658650696, 662203789, 664886832, 667421997, 669821680, 672244787, 674191594]
1572.5F74191594J415193J368761J179099P37131L09467o9439n04732j004577j592159
1590.9F76030338k142370k639770l068746l486037m026055m567683m991472n406856
1607.2F45701349n903900o132603o117463o744265p539988o258964n658090o600321
1623.5E94745755o541252n968392n515694m586578m054010m018783k759338j428723
1639.8E59872985r12249o08623j11342O74129Q72910J206696K521753K588332K171337
1658.2E68275928K393365K960682L332496L017247L194451L880203L735065L888130
1674.5E94677567M398346M086316L668845M122138N809963N864620N131840N457998
1690.8F33217633N369782O066740P124066P698178R358585Q344293P318616P618964
$$ y = [674191594, 675606787, 676975548, 678154647, 678891778, 679201245, 679131806, 678627074, 677622497, 676030338, 673887968, 671248198, 668179452, 664693415, 660667360, 656099677, 651108205, 645701349, 639797449, 633664846, 627547383, 620803118, 613263130, 607004166, 601346076, 594745755, 588204503, 582236111, 576720417, 572133839, 568079829, 564061046, 561301708, 559872985, 558960736, 558352113, 558240771, 558914900, 559787810, 560994506, 563516259, 566104591, 568275928, 570669293, 573629975, 576962471, 579979718, 583174169, 587054372, 590789437, 594677567, 599075913, 603162229, 606831074, 610953212, 616763175, 622627795, 627759635, 633217633, 638587415, 644654155, 651778221, 659476399, 668834984, 677179277, 684497893, 692116857]
1707.1F92116857O726443N612076M711926M031419L932834L599882K714873K164483
1723.4G25610793J941979J686036J475275J324236J501978J858949J819015K002120
1739.7G39220381K511501K998054L464699L980160M798948N375743M883409M399121
1756.1G71632016M133522L631711L406942L079355K568960K263188K127052K294361
1772.4G95137107K376199K014935J695335J570702J476764J366437J250148J026392
1788.7H07914019Q29041R98079J174391J046002R29594J035094J188278J152039J032829
1807H17299366R65893J014531J087308J068950R81986R29773Q51750P40528P30098
1825.4H25670183P21812P20262Q56042Q63135O90401O07610N45978L96013L78669O05643
$$ y = [692116857, 698843300, 704455376, 709167302, 713198721, 717131555, 720731437, 723446310, 725610793, 727552772, 729238808, 730714083, 732038319, 733540297, 735399246, 737218261, 739220381, 741731882, 744729936, 748194635, 752174795, 756973743, 762349486, 767232895, 771632016, 775765538, 779397249, 782804191, 785883546, 788452506, 790715694, 792842746, 795137107, 797513306, 799528241, 801223576, 802794278, 804271042, 805637479, 806887627, 807914019, 808743060, 809741139, 810915530, 811961532, 812891126, 813926220, 815114498, 816266537, 817299366, 818265259, 819279790, 820367098, 821436048, 822418034, 823347807, 824199557, 824940085, 825670183, 826391995, 827112257, 827968299, 828831434, 829521835, 830129445, 830675423, 831071436, 831450105, 832055748]
1845.8H32055748P02917O27339N50091M61400M13358L98278L86298L65913K95579J58727
1866.2H36415648J65463M23014N30899M18424L13521K62201K33352K40624K53617K20478
1886.6H39477241J85907K46406K99513K66671K57313K62440K50279K22266J91510J52767
1907H41812313J24633J54018J65403R8705O0380J31905J56880J45912J87218J76251
1927.4H43213618J21534R0778Q7022Q4222O4075K2828l934L7313J01507R2864N5432
1949.8H43967259N6148N0127K4319K2292L2246K4378P928j0789J4305O1810O8784M6313
1974.3H44365120J5795J3948J3113M232m113j8239l1829l5286q643K2769K3306O973
1998.8H44367146j5974n1438o5148n4658m9710o3062p5102r2744q9705l9041l8684
$$ y = [832055748, 832758665, 833386004, 833936095, 834397495, 834810853, 835209131, 835595429, 835961342, 836256921, 836415648, 836581111, 837004125, 837535024, 837953448, 838266969, 838529170, 838762522, 839003146, 839256763, 839477241, 839663148, 839909554, 840209067, 840475738, 840733051, 840995491, 841245770, 841468036, 841659546, 841812313, 841936946, 842090964, 842256367, 842355072, 842415452, 842547357, 842704237, 842850149, 843037367, 843213618, 843335152, 843425930, 843512952, 843597174, 843661249, 843684077, 843680143, 843717456, 843818963, 843911827, 843967259, 844023407, 844073534, 844097853, 844120145, 844152391, 844176769, 844184697, 844173908, 844188213, 844250023, 844318807, 844365120, 844380915, 844394863, 844407976, 844412208, 844408095, 844389856, 844358027, 844322741, 844314098, 844336867, 844360173, 844367146, 844351172, 844299734, 844234586, 844179928, 844130218, 844067156, 843992054, 843899310, 843809605, 843770564, 843731880]
2021.2H43731880q6665j07229r7394p8976n5849m7148o6757q3268q0347n1736n126
2043.6H42971385Q761l1530m1247k324K4020L3140K4319r54p450N245K3484M2200L4869
2070.2H43083918M4584P5579P3195O3061Q3864R9301Q6367P8559O9142O4671Q0824
2092.6H43903065Q5890O5088O3300P0572K9087P16M4286P4983L5762o55J3888N2452
2117.1H44438434P5161P3731N6803M0531L7909M0650O0439P1884N4061M3511P0572
2139.5H45063686J01209R5010P4446P9989R9957R4474P9989R6441J27136J36853J44064
2161.9H46193254J38521J09971R9957J06036J07468J08420J25349J42992J43408J53601
2182.3H47428977J71006J65701J60158J59144J38760J39355J66655J59979J23978J11699
$$ y = [843731880, 843645215, 843537986, 843440592, 843361616, 843305767, 843258619, 843191862, 843108594, 843028247, 842976511, 842971385, 842980146, 842948616, 842907369, 842905045, 842929065, 842962205, 842986524, 842985570, 842978120, 842983365, 843006849, 843049049, 843083918, 843128502, 843204081, 843277276, 843340337, 843424201, 843523502, 843609869, 843688428, 843757570, 843822241, 843903065, 843988955, 844054043, 844117343, 844187915, 844217002, 844217718, 844262004, 844336987, 844372749, 844372094, 844385982, 844438434, 844513595, 844587326, 844644129, 844684660, 844722569, 844763219, 844823658, 844895542, 844949603, 844993114, 845063686, 845164895, 845259905, 845334351, 845414340, 845514297, 845608771, 845688760, 845785201, 845912337, 846049190, 846193254, 846331775, 846441746, 846541703, 846647739, 846755207, 846863627, 846988976, 847131968, 847275376, 847428977, 847599983, 847765684, 847925842, 848084986, 848223746, 848363101, 848529756, 848689735, 848813713, 848925412]
2202.7H48925412J03831P7128O9082Q8096J08063J06871P6115L5704K9504O1631R9421
2225.2H49780858J02043P3969N1618L3676L5405N1678N0842L6300K3782K7478L2365
2247.6H50300014L3140M2856N1498N4121M7624K7776J8299J9669K4915L8862N0605
2270H50709379N5611M8518L5524K4140J0550J2636L0578L4690K2530j4663l5107q046
2294.5H50926340j2517l1889k7180l0279m7981q1242j16527j05917o3956n7816r7514
2316.9H50253522j44898j34290o8724j8775j4544k5570k5690o0022j48713j96219j27733
2339.4H49288344l3915K6286Q8632J32144P9214n0247j57058j76668j54018j22607
2359.8H48920107q1718p391J19865J52171Q7738Q1598J12117J32084J65820K03848
$$ y = [848925412, 849029243, 849106371, 849175453, 849263549, 849371612, 849478483, 849554598, 849590302, 849619806, 849681437, 849780858, 849882901, 849956870, 850008488, 850042164, 850077569, 850129247, 850180089, 850216389, 850240171, 850267649, 850300014, 850333154, 850376010, 850427508, 850481629, 850529253, 850557029, 850575328, 850594997, 850619912, 850658774, 850709379, 850764990, 850813508, 850849032, 850873172, 850883722, 850896358, 850926936, 850961626, 850984156, 850969493, 850934386, 850926340, 850913823, 850881934, 850854754, 850824475, 850776494, 850695252, 850578725, 850472808, 850408852, 850351036, 850253522, 850108624, 849974334, 849905610, 849886835, 849872291, 849846721, 849821031, 849761009, 849612296, 849416077, 849288344, 849254429, 849280715, 849369347, 849501491, 849580705, 849530458, 849373400, 849196732, 849042714, 848920107, 848838389, 848830998, 848950863, 849103034, 849190772, 849272370, 849384487, 849516571, 849682391, 849886239]
2380.2H49886239J80840J05918L5285k4199o6757p3970o6638o1452o1035q2016r3103
2402.6H49679112q4638q9586r0301q1539q6784r1017r0897r0361r8347j33991j63317
2425H48578334j55091j38641j44839j56999j59740j68205j77741j70350j48117j35243
2445.4H47023368j63019k04682k14517k09689k08736k05874j96338k05576k32816k37167
2465.8H44944954k33293k47776k66135k70128k78533l02672l24130l22402l06427l21150
2486.2H42072308l48508l43561l01779k64108k56896k48134k53976k70009k55286k29836
2506.6H39300215k18749k30789k65956k87414k70307k37643k15352j84238j32203j09255
2527H37148309r1911n2034n2751o5803m3690k6346l8385n2214l9398j9789k7239n9069
$$ y = [849886239, 850067079, 850172997, 850208282, 850184083, 850117326, 850043356, 849976718, 849915266, 849854231, 849772215, 849679112, 849594474, 849504888, 849414587, 849333048, 849246264, 849155247, 849064350, 848973989, 848875642, 848741651, 848578334, 848423243, 848284602, 848139763, 847982764, 847823024, 847654819, 847477078, 847306728, 847158611, 847023368, 846860349, 846655667, 846441150, 846231461, 846022725, 845816851, 845620513, 845414937, 845182121, 844944954, 844711661, 844463885, 844197750, 843927622, 843649089, 843346417, 843022287, 842699885, 842393458, 842072308, 841723800, 841380239, 841078460, 840814352, 840557456, 840309322, 840055346, 839785337, 839530051, 839300215, 839081466, 838850677, 838584721, 838297307, 838027000, 837789357, 837574005, 837389767, 837257564, 837148309, 837056398, 837004364, 836951613, 836885810, 836842120, 836815774, 836777389, 836725175, 836685777, 836665988, 836638749, 836579680]
2551.5H36579680q2373p9811q2493j17659j52827j53660j46628j40905j30951j40608
2571.9H35351765j66893k03729k27689k07961k03013k29776k33948k37048k49505k31028
2592.3H33161175k17318k41220k64168k65837k65538k53916k14994k01166k25901k39611
2612.7H30771506k39372k52188k49266k17021k16126k58684k74659k53737k47418k53618
2633.1H28309417k69056k97010k95221k71082k66075k76983k98083l38852l54946l24965
2653.5H25317144l20792l53932l64065l57688l73125l81470l66389l82185l94643l69847
2673.9H21653008l74197l91543l80159l63052l50475l53277l72290l77834l88086m19319
2694.3H17882776m36067m41611m64022m93527n16593n44787n58376n52893n48243n32091
$$ y = [836579680, 836497307, 836417496, 836335003, 836217344, 836064517, 835910857, 835764229, 835623324, 835492373, 835351765, 835184872, 834981143, 834753454, 834545493, 834342480, 834112704, 833878756, 833641708, 833392203, 833161175, 832943857, 832702637, 832438469, 832172632, 831907094, 831653178, 831438184, 831237018, 831011117, 830771506, 830532134, 830279946, 830030680, 829813659, 829597533, 829338849, 829064190, 828810453, 828563035, 828309417, 828040361, 827743351, 827448130, 827177048, 826910973, 826633990, 826335907, 825997055, 825642109, 825317144, 824996352, 824642420, 824278355, 823920667, 823547542, 823166072, 822799683, 822417498, 822022855, 821653008, 821278811, 820887268, 820507109, 820144057, 819793582, 819440305, 819068015, 818690181, 818302095, 817882776, 817446709, 817005098, 816541076, 816047549, 815530956, 814986169, 814427793, 813874900, 813326657, 812794566]
2714.6H12794566n17785n28753n41985n28217m98831m31061l49819l21925l11911k80082
2735H08484197k46644k50996k71797k66015k78473l07143k90632k90334l33548l58522
2755.4H05590093l84033m04358l97861m33087n13017n41449n36799n78642o19531n96046
2775.8H00585270n77867o35505o98864p21574p59602q08119q12710q12471q57711r14871
2796.2G92985976r35555r21964r27687r71496j041830j125335j154960j144528j178384
2814.6G83584237j232028j271486j323879j416326j545906j674294j808703k011299
2830.9G71300316k316177k710998l184497l694177m237890m868210n435645n651057
2847.2G39201665n282998m293084k891362j462579m34756L5524N4300k81393p65562
$$ y = [812794566, 812276781, 811748028, 811206043, 810677826, 810178995, 809747934, 809398115, 809076190, 808764279, 808484197, 808237553, 807986557, 807714760, 807448745, 807170272, 806863129, 806572497, 806282163, 805948615, 805590093, 805206060, 804801702, 804403841, 803970754, 803457737, 802916288, 802379489, 801800847, 801181316, 800585270, 800007403, 799371898, 798673034, 797951460, 797191858, 796383739, 795571029, 794758558, 793900847, 792985976, 792050421, 791128457, 790200770, 789229274, 788187444, 787062109, 785907149, 784762621, 783584237, 782352209, 781080723, 779756844, 778340518, 776794612, 775120318, 773311615, 771300316, 768984139, 766273141, 763088644, 759394467, 755156577, 750288367, 744852722, 739201665, 733918667, 729625583, 726734221, 725271642, 724836886, 724872410, 724926710, 724645317, 723879755]
2865.6G23879755j079739j103818q89361m80652m3869J07587p3553l71217o93262j028180
2886G18223691j341760j597464j804292k002240k150595k276897k444148k556384k599597
2904.3F99450314k680004k855599l165900l518045l722072l703058l423571k861619
2920.6F73520446k076447j142919j79351P59244J707256K548099L156602L576458L807366
2939F85676754L711342L284097K708376K064108J330316O34969J95324M4644J23918
2957.4F99773848L87251P57814J195729J607418J908958K125561K297401K488256K711117
2975.7G15253353K904296L081381L226221L249764L162563L003598K751767K465964
2992G39098907K209544J872420J459718J100540P61986M60386K62797J23978N5432
$$ y = [723879755, 722800016, 721696198, 720806837, 720326185, 720282316, 720389903, 720316350, 719945133, 719251871, 718223691, 716881931, 715284467, 713480175, 711477935, 709327340, 707050443, 704606295, 702049911, 699450314, 696770310, 693914711, 690748811, 687230766, 683508694, 679805636, 676382065, 673520446, 671443999, 670301080, 670121729, 670880973, 672588229, 675136328, 678292930, 681869388, 685676754, 689388096, 692672193, 695380569, 697444677, 698774993, 699409962, 699605286, 699649930, 699773848, 700161099, 700918913, 702114642, 703722060, 705631018, 707756579, 710053980, 712542236, 715253353, 718157649, 721239030, 724465251, 727715015, 730877578, 733881176, 736632943, 739098907, 741308451, 743180871, 744640589, 745741129, 746503115, 746963501, 747226298, 747350276, 747405708]
3010.4G47405708J00910J93716K34484J72258r716k65002m53889n25654n76734o37412
3030.8G45638669o56546o22272o29127p49290q37803p91252p37607p79271q96693r54330
3051.2G37984478r21368r08554q90135q58486q62777q81672q81434p88152o39200n89311
3071.6G29763389o82533q32677q81910p78377o68884o42717o47783o66439o53565n89490
3092G22719014o07670p08401p66873p78854p76827q10206q92163r19819q78989r39310
3112.4G14639902j123369j212537j160026j093685j060665j100719j213968j314878
3128.7G05360055j341939j349151j433432j533211j524925j473725j478135j518965
3145F93706572j606464j718045j757800j720011j696170j720905j752913j793563j853228
$$ y = [747405708, 747506618, 747700334, 747934818, 748107076, 748097360, 747832358, 747378469, 746852815, 746276081, 745638669, 744982123, 744359851, 743730724, 742981434, 742143631, 741352379, 740614772, 739835501, 738938808, 737984478, 737063110, 736154556, 735264421, 734405935, 733543158, 732661486, 731780052, 730991900, 730352700, 729763389, 729080856, 728248179, 727366269, 726587892, 725919008, 725276291, 724628508, 723962069, 723308504, 722719014, 722111344, 721402943, 720636070, 719857216, 719080389, 718270183, 717378020, 716458201, 715579212, 714639902, 713516533, 712303996, 711143970, 710050285, 708989620, 707888901, 706674933, 705360055, 704018116, 702668965, 701235533, 699702322, 698177397, 696703672, 695225537, 693706572, 692100108, 690382063, 688624263, 686904252, 685208082, 683487177, 681734264, 679940701, 678087473]
3163.4F78087473j897514j911759j928449j951814j951575j943052j964330j977146
3179.7F62561834j970470k005875k046645k007544j941919j958668k010584k013445
3196F46606684j990676j960933j935304j924514j904607j877487j850367j829683j850128
3214.3F29482985j892329j887977j820922j782000j838505j884639j849473j850486
3230.7F14676654j908779j884103j816034j816928j844943j870215j922726j913012
3247E99699914j808345j769721j827240j856089j797676j722634j706839j703977j703203
3265.3E83804190j727462j720547j648426j563967j505255j448572j417279j432717
3281.6E71339965j444340j427174j438975j486063j470446j403392j372039j347542
$$ y = [678087473, 676189959, 674278200, 672349751, 670397937, 668446362, 666503310, 664538980, 662561834, 660591364, 658585489, 656538844, 654531300, 652589381, 650630713, 648620129, 646606684, 644616008, 642655075, 640719771, 638795257, 636890650, 635013163, 633162796, 631333113, 629482985, 627590656, 625702679, 623881757, 622099757, 620261252, 618376613, 616527140, 614676654, 612767875, 610883772, 609067738, 607250810, 605405867, 603535652, 601612926, 599699914, 597891569, 596121848, 594294608, 592438519, 590640843, 588918209, 587211370, 585507393, 583804190, 582076728, 580356181, 578707755, 577143788, 575638533, 574189961, 572772682, 571339965, 569895625, 568468451, 567029476, 565543413, 564072967, 562669575, 561297536, 559949994]
3298E59949994j330793j413166j526058j536369j491607j473903j499713j534819j567126
3316.3E46576440j645267j754880j835167j869381j863837j852035j886726j973390
3332.6E31895757k077163k156615k167463k135694k159417k236068k293587k361953
3348.9E14307797k385259k334475k377808k494276k523482k481073k467424k497911
3365.3D94746089k521515k486437k374679k262891k203107k143144k054274j961887
3381.6D76738155j855165j744777j655757j591265j529843j457304j420408j396895
3397.9D64086741j314163j194745j137883j152456j126825j025468r41843q88020q03828
3416.3D54501510o76364n62519n12570m41641l23504j90943p1526K8342J29312K53141
$$ y = [559949994, 558619201, 557206035, 555679977, 554143608, 552652001, 551178098, 549678385, 548143566, 546576440, 544931173, 543176293, 541341126, 539471745, 537607908, 535755873, 533869147, 531895757, 529818594, 527661979, 525494516, 523358822, 521199405, 518963337, 516669750, 514307797, 511922538, 509588063, 507210255, 504715979, 502192497, 499711424, 497244000, 494746089, 492224574, 489738137, 487363458, 485100567, 482897460, 480754316, 478700042, 476738155, 474882990, 473138213, 471482456, 469891191, 468361348, 466904044, 465483636, 464086741, 462772578, 461577833, 460439950, 459287494, 458160669, 457135201, 456193358, 455305338, 454501510, 453825146, 453262627, 452750057, 452308416, 451984912, 451793969, 451722443, 451750785, 451880097, 452133238]
3436.6D52133238L69102M45902N47082O79344P77632Q32468R14782J011074J061588
3455D58772212J077652J145453J239925J305848J376838J416415J424015J433581J472652
3473.4D70664591J518577J551419J570702J608491J644462J665086J721263J775175
3489.7D83719766J792759J803964J865745J913190J932591J984775K060890K091617
3506D99165297K127528K224326K267897K254844K284229K382099K455831K508938K542257
3524.4E20213246K576173K649784K716899K752483K780258K843678K869606K826274
3540.7E42228401K852857L034174L162623L149152L158330L270805L339947L309130
3557E67505419L316999L314912L265381L394663L835678M050494L906548L872573L980041
$$ y = [452133238, 452502340, 452948242, 453495324, 454174668, 454952300, 455784768, 456699550, 457710624, 458772212, 459849864, 460995317, 462235242, 463541090, 464917928, 466334343, 467758358, 469191939, 470664591, 472183168, 473734587, 475305289, 476913780, 478558242, 480223328, 481944591, 483719766, 485512525, 487316489, 489182234, 491095424, 493028015, 495012790, 497073680, 499165297, 501292825, 503517151, 505785048, 508039892, 510324121, 512706220, 515162051, 517670989, 520213246, 522789419, 525439203, 528156102, 530908585, 533688843, 536532521, 539402127, 542228401, 545081258, 548115432, 551278055, 554427207, 557585537, 560856342, 564196289, 567505419, 570822418, 574137330, 577402711, 580797374, 584633052, 588683546, 592590094, 596462667, 600442708]
3575.3F00442708M046976M088104M103780M022360M102230M499614M688978M475594
3591.7F34470344M445612M555106M568994M605770M606784M469037M382908M527092
3608F70631647M589796M491389M423201M333139M399359M592061M371464L952205L779412
3626.3G09563673M054248M344821M047394L815353L725647L588200L446937L253579
3642.6G39839852K999067K863288L026843L286481L259003L023744K875924K764165
3659G63938367K603710K447724K240181J994849J853168J873552J824022J732707J910984
3677.3G82419264K074719J969516J749337J516759J365900J424134J656890J663148
3693.6G95839667J394749J157284J001835Q71658Q45611Q13067O42180M76361N46336
$$ y = [600442708, 604489684, 608577788, 612681568, 616703928, 620806158, 625305772, 629994750, 634470344, 638915956, 643471062, 648040056, 652645826, 657252610, 661721647, 666104555, 670631647, 675221443, 679712832, 684136033, 688469172, 692868531, 697460592, 701832056, 705784261, 709563673, 713617921, 717962742, 722010136, 725825489, 729551136, 733139336, 736586273, 739839852, 742838919, 745702207, 748729050, 752015531, 755274534, 758298278, 761174202, 763938367, 766542077, 768989801, 771229982, 773224831, 775077999, 776951551, 778775573, 780508280, 782419264, 784493983, 786463499, 788212836, 789729595, 791095495, 792519629, 794176519, 795839667, 797234416, 798391700, 799393535, 800265193, 801110804, 801923871, 802566051, 803042412, 803588748]
3712H03588748Q04782P98941N67376M07934L51251K99453L12746M93407M42267O2644
3732.4H08129549q3744K15470N24938O16074L86477N1796K99752M57108J68085K57969
3752.8H11023474N32746M66883K76447K93314L69191K07961R6619J35660J63615K45809
3773.2H13811719K71798J84774P2360J23680K12013J49131J28210J55031J33932P7844
3793.6H15320492l9458l8803k4617j34945J41680L01362R3996J44124K60711O9678
3814H16094220k65062j85609m0829P15K56598K40922R3222K6881n9545n8949j21593
3836.4H15980971j79947O2645K00212J26183J00195P8977l4512l32295k88845K45095
3856.8H15958679L24845R8884p4744p5996J1742j03831j59085L5107J31071J23143
$$ y = [803588748, 804393530, 805192471, 805759847, 806167781, 806519032, 806818485, 807131231, 807624638, 808066905, 808129549, 808045805, 808261275, 808786213, 809402287, 809788764, 809840560, 810140312, 810597420, 810765505, 811023474, 811556220, 812023103, 812299550, 812592864, 812962055, 813170016, 813266635, 813402295, 813565910, 813811719, 814083517, 814268291, 814340651, 814464331, 814676344, 814825475, 814953685, 815108716, 815242648, 815320492, 815281034, 815242231, 815217614, 815082669, 815224349, 815525711, 815619707, 815763831, 816024542, 816094220, 815829158, 815643549, 815602720, 815603435, 815860033, 816100955, 816194177, 816221058, 816161513, 816102564, 815980971, 815801024, 815863669, 816063881, 816190064, 816290259, 816369236, 816334724, 816002429, 815713584, 815958679, 816283524, 816382408, 816307664, 816231668, 816243410, 816139579, 815980494, 816015601, 816146672, 816269815]
3877.2H16269815o4433j63257j7881n9843K98J03295r2447q7857R5427k9683k54095
3899.6H15699339k35617q8811R9957K49684K14815Q4579o0559j93417j80244k6703
3920H15563023L2961j9371q285K1517j6808j9610L1173M5300J7583n2512j01745k2888
3944.5H15470338N6922L6419K1815M7147O3002N7698M4226M77m6909m3988k0504J0073
3969H15696716M7267M5538J5199q285k6226k9266J9729P2181M6075j0312j7702K5272
3993.4H15876186N0127P7725
3997.5H16004038
$$ y = [816269815, 816205382, 816042125, 816024244, 815964401, 815964699, 816067994, 815975547, 815887690, 815983117, 815953434, 815699339, 815463722, 815374911, 815474868, 815724552, 815939367, 816023946, 815963387, 815769970, 815589726, 815563023, 815595984, 815576613, 815568328, 815589845, 815573037, 815553427, 815584600, 815629900, 815647483, 815594971, 815493226, 815470338, 815527260, 815563679, 815585494, 815632641, 815695643, 815753341, 815797567, 815798044, 815751135, 815707147, 815686643, 815696716, 815743983, 815789521, 815804720, 815796435, 815770209, 815740943, 815760672, 815832853, 815878928, 815868616, 815850914, 815876186, 815926313, 816004038]
##END=$$ End of the data block
