##TITLE=CA12 $$ Begin of the data block
##JCAMP-DX=5.00 $$ ACD/SpecManager v 10.08
##DATE=14 Dec 2016 11:32:36
##DATA TYPE=INFRARED SPECTRUM
##DATA CLASS=XYDATA
##ORIGIN=Marcelo Quint
##OWNER=
##NPOINTS=1765
##FIRSTX=399.77209473
##LASTX=3997.72216797
##MAXX=3997.72216797
##MINX=399.77209473
##MAXY=0.86185837
##MINY=0.31742945
##XFACTOR=1.0000000000
##YFACTOR=1.000000000000000e-9
##FIRSTY=0.70362532
##DELTAX=2.03965425
##XUNITS=1/CM
##YUNITS=ARBITRARY UNITS
##XYDATA=(X++(Y..Y))
$$ plain form
399.8 703625321 706891716 710757554 716617405 725399792 736329556 747933030 758985460 768139541
416.1 768139541 776051402 783216417 787915230 790511549 792269409 793748796 794338644 793444276 791923106
434.4 791923106 791547835 792803049 794466317 795927525 796791792 796977937 796899259 796433270 795696676
452.8 795696676 794964850 794363081 794144213 794192851 794085324 793688238 793210328 792729735 792325556 792080760
473.2 792080760 792007208 791973948 791800559 791769266 791930556 792163968 792342007 792314529 792262316 792241037 792394996
495.6 792394996 792481005 792609692 793552041 795008421 796223819 796866775 797117293 797154725 796947181 796437562
516 796437562 794966459 791437507 785352230 779852748 779222786 780782521 777373314 766969025 757553220
534.4 757553220 759956658 772094190 782538831 788022459 792141497 795459509 797247767 798036337
$$ packed form
399.8G03625321L266395L865838N859851Q782387J0929764J1603474J1052430R154081
416.1G68139541P911861P165015M698813K596319J757860J479387N89848q94368j521170
434.4G91923106l75271J255214J663268J461208Q64267J86145p8678m65989p36594
452.8G95696676p31826o01769k18868M8638j07527l97086m77910m80593m04179k44796
473.2G92080760p3552l3260j73389l1293J61290K33412J78039k7478n2213k1279J53959
495.6G92394996Q6009J28687R42349J456380J215398O42956K50518L7432k07544n09619
516G96437562j471103l528952o085277n499482o29962J559735l409207j0404289r415805
534.4G57553220K403438J2137532J0444641N483628M119038L318012J788258P88570
$$ plain form
550.7 798036337 798383057 798657417 798922360 799232423 799474120 799783051 800188661 800426245 800641060 800828815
571.1 800828815 801087499 801354229 801583111 801971138 802411020 802878320 803264976 803675354 804150581 804642081
591.5 804642081 805295765 805870235 806410134 807038486 807803452 808652163 809325755 809953928 810591519 811288357
611.9 811288357 811886489 812363386 813083231 814074397 815264881 816414297 817560017 818695962 819218397
630.3 819218397 819198251 820027292 822306454 824441969 825625241 826410651 826827347 826831698 826120734 824028611
650.7 824028611 818905354 807155430 789001703 776484370 780705512 793564856 802612066 807106972
667 807106972 809465051 810458601 810434103 809160411 805763006 800731122 797816038 798876822 801218927
685.3 801218927 802752495 803847075 804638684 804706693 804046929 802880526 801525354 800368428 799808204
$$ packed form
550.7G98036337L46720K74360K64943L10063K41697L08931M05610K37584K14815J87755
571.1H00828815K58684K66730K28882L88027M39882M67300L86656M10378M75227M91500
591.5H04642081O53684N74470N39899O28352P64966Q48711O73592O28173O37591O96838
611.9H11288357N98132M76897P19845R91166J190484J149416J145720J135945N22435
630.3H19218397k0146Q29041K279162K135515J183272P85410M16696M351p10964k092123
650.7H24028611n123257j1749924j8153727j2517333M221142J2859344R047210M494906
667H07106972K358079R93550k4498j273692l397405n031884k915084J060784K342105
685.3H01218927J533568J094580P91609O8009o59764j166403j355172j156926n60224
$$ plain form
703.7 799808204 800575733 802978277 806410372 808631659 805682540 792703390 773465574 766640365
720 766640365 778498411 788696885 782921076 772220254 774830341 789511204 801992893 809941947
736.3 809941947 817903638 823992491 825674355 823961973 820716143 817468703 812538743 800884783
752.6 800884783 777199149 738804340 705235541 705952466 733536243 762910008 785556912 798826098
769 798826098 801982105 797494590 787213564 771582484 750414610 723298728 689733386 649685383
785.3 649685383 604530513 557264626 511460543 470402479 435998678 409223258 390732974
799.5 390732974 380919665 379658818 386171520 399034888 415988445 434117198 450523734 463812888
815.9 463812888 475652456 491021901 515263677 548300982 582862377 614095211 646019220
$$ packed form
703.7G99808204P67529K402544L432095K221287k949119j2979150j9237816o825209
720G66640365J1858046J0198474n775809j0700822K610087J4680863J2481689P949054
736.3H09941947P961691O088853J681864j712382l245830l247440m929960j1653960
752.6H00884783k3685634l8394809l3568799P16925K7583777K9373765K2646904J3269186
769G98826098L156007m487515j0281026j5631080k1167874k7115882l3565342m0048003
785.3F49685383m5154870m7265887m5804083m1058064l4403801k6775420j8490284
799.5C90732974r813309j260847O512702J2863368J6953557J8128753J6406536J3289154
815.9D63812888J1839568J5369445K4241776L3037305L4561395L1232834L1924009
$$ plain form
830.1 646019220 678842366 703395069 714340866 712835491 699024975 675990224 659107029 667631328
846.5 667631328 701087475 738041878 761605263 771094620 772263706 769658208 766219556 763754725
862.8 763754725 763060749 764178336 766520500 769511998 773053169 777453899 783150017 790136099 797906816
881.1 797906816 805437863 811601639 816200972 820656657 826103508 831620574 836541414 841065049
897.5 841065049 845017552 848249435 850840330 852983296 854777932 856306970 857644737 858759165
913.8 858759165 859664381 860315323 860802352 861244082 861595333 861826539 861858368 861723363 861459434 861076176
934.2 861076176 860564351 859828949 858898699 857716978 856308341 854900062 853659511 852463901 850907266
952.5 850907266 848897636 846605420 844114840 841345668 837967873 834173262 830697894 827494204
$$ packed form
830.1F46019220L2823146K4552703J0945797j505375j3810516k3034751j6883195Q524299
846.5F67631328L3456147L6954403K3563385R489357J169086k605498l438652k464831
862.8G63754725o93976J117587K342164K991498L541171M400730N696118O986082P770717
881.1G97906816P531047O163776M599333M455685N446851N517066M920840M523635
897.5H41065049L952503L231883K590895K142966J794636J529038J337767J114428
913.8H58759165R05216O50942M87029M41730L51251K31206L1829j35005k63929l83258
934.2H61076176n11825p35402r30250j181721j408637j408279j240551j195610j556635
952.5H50907266k009630k292216k490580k769172l377795l794611l475368l203690
$$ plain form
968.8 827494204 823503911 818103850 812419355 807866335 803781629 798253775 790562749 781239688
985.2 781239688 770846665 759412169 746286213 730691314 711799979 688053906 659346879
999.4 659346879 629811227 601858139 573586524 545124829 516372502 485875845 455596656
1013.7 455596656 428996533 407689601 391170979 379725695 377030790 385186970 398798287 409936219
1030 409936219 415904164 419402957 424865961 433499366 442178667 448685259 454285920 460562468 467448801
1048.4 467448801 474055827 479332894 482694089 484554946 485598385 485912561 485560477 484791189 483454764
1066.7 483454764 481130272 477589875 472856045 467094958 460452735 453022242 444908738 436250150
1083.1 436250150 427430212 419060260 411605150 405139565 399859935 396324962 395073444 396447659
$$ packed form
968.8H27494204l990293n400061n684495m553020m084706n527854p691026r323061
985.2G81239688j0393023j1434496j3125956j5594899j8891335k3746073k8707027
999.4F59346879k9535652k7953088k8271615k8461695k8752327l0496657l0279189
1013.7D55596656k6600123k1306932j6518622j1445284k694905Q156180J3611317J1137932
1030D09936219N967945L498793N463004Q633405Q679301O506592N600661O276548O886333
1048.4D67448801O607026N277067L361195J860857J043439L14176l52084p69288j336425
1066.7D83454764k324492l540397m733830n761087o642223p430493q113504q658588
1083.1D36250150q819938q369952p455110o465585n279630l534973j251518J374215
$$ plain form
1099.4 396447659 400475919 406776071 414178908 421552360 430456042 445992231 471303672 501891553
1115.7 501891553 530792654 555885375 578041792 597675979 614468336 628031909 638728559
1130 638728559 649092615 663195968 680483520 695820093 707048297 715551376 722576916 728554189
1146.3 728554189 733690560 737977803 741352379 743845105 745399535 746421158 748268783 751718938
1162.6 751718938 755350769 757131338 755146563 746267676 730995536 720310688 725444794 741236806
1178.9 741236806 754317164 762310386 771345735 782022595 789294302 790568054 787406564 784531534
1195.2 784531534 787338555 795004845 801410496 804405570 806540608 809337378 811789453 812930465
1211.6 812930465 813169479 813089371 812781990 811965346 810544908 808451533 805071771 799647570 792190075
$$ packed form
1099.4C96447659M028260O300152P402837P373452Q903682J5536189K5311441L0587881
1115.7E01891553K8901101K5092721K2156417J9634187J6792357J3563573J0696650
1130F38728559J0364056J4103353J7287552J5336573J1228204Q503079P025540N977273
1146.3G28554189N136371M287243L374576K492726J554430J021623J847625L450155
1162.6G51718938L631831J780569j984775q878887j5272140j0684848N134106J5792012
1178.9G41236806J3080358P993222R035349J0676860P271707J273752l161490k875030
1195.2G84531534K807021P666290O405651K995074K135038K796770K452075J141012
1211.6H12930465K39014q0108l07381q16644j420438k093375l379762n424201p457495
$$ plain form
1229.9 792190075 784634709 779050648 774094939 766327858 753964365 736940682 714930236 686800838
1246.2 686800838 651283145 607690334 555947781 496707231 433494329 376147330 343134671
1260.5 343134671 353655607 411071271 498413861 589016795 662447631 712816477 744589031
1274.8 744589031 764316261 775698662 779242873 775839627 771974027 774894297 781310022 783021748
1291.1 783021748 779612303 777157605 780807793 788813889 793613911 790393114 785161555 789128661
1307.4 789128661 801695585 812994003 819005787 821810961 824185431 827567160 831358612 834369600
1323.7 834369600 836377800 837642908 838324606 838636398 838575363 837929904 836637318 835231304 834339559
1342.1 834339559 833489656 831808090 828847468 824652016 819703639 814631343 810191751 807344794
$$ packed form
1229.9G92190075p555366n584061m955709p767081j2363493j7023683k2010446k8129398
1246.2F86800838l5517693m3592811n1742553n9240550o3212902n7346999l3012659
1260.5C43134671J0520936N7415664Q7342590R0602934P3430836N0368846L1772554
1274.8G44589031J9727230J1382401L544211l403246l865600K920270O415725J711726
1291.1G83021748l409445k454698L650188Q006096M800022l220797n231559L967106
1307.4G89128661J2566924J1298418O011784K805174K374470L381729L791452L010988
1323.7H34369600K008200J265108O81698L11792o1035o45459j292586j406014q91745
1342.1H34339559q49903j681566k960622m195452m948377n072296m439592k846957
$$ plain form
1358.4 807344794 807326496 810511768 814785182 817582369 818293333 817642868 816208839 813655436 809659362
1376.8 809659362 804223418 798420906 795524299 797940731 802858591 803216815 795870364 784747481
1393.1 784747481 777916133 779670835 786576152 795289278 803500712 809159338 811370373 811206162
1409.4 811206162 810378730 810279429 811354339 813485086 816437900 818662226 818590999 815697432 809337616
1427.8 809337616 798790693 787864268 782992065 785924613 790870905 789820850 782406032 773204148
1444.1 773204148 767933547 766930580 764000595 754357874 736926734 704664052 654761612 605500162
1460.4 605500162 567592561 559787095 590310633 621801198 634602427 651739240 688741982
1474.7 688741982 720790088 734968841 742331266 756138682 776335776 795888066 811111510
$$ packed form
1358.4H07344794j8298L185272M273414K797187P10964o50465j434029k553403l996074
1376.8H09659362n435944n802512k896607K416432M917860L58224p346451j1122883
1393.1G84747481o831348J754702O905317Q713126Q211434N658626K211035j64211
1409.4H11206162q27432r9301J074910K130747K952814K224326p1227k893567o359816
1427.8H09337616j0546923j0926425m872203K932548M946292j050055p414818r201884
1444.1G73204148n270601j002967k929985r642721j7431140l2262682m9902440m9261450
1460.4F05500162l7907601p805466L0523538L1490565J2801229J7136813L7002742
1474.7F88741982L2048106J4178753P362425J3807416K0197094J9552290J5223444
$$ plain form
1489 811111510 821604311 828084648 832134783 835214436 837772846 839744151 840848625 840868771 840789914
1507.3 840789914 841853023 843015671 843773305 844330311 844940662 845322013 845291018 845337212 845301449 845032334
1527.7 845032334 844603539 843420863 841147184 838185847 832695127 822115779 814611256 818534374
1544 818534374 828852952 837875187 842992306 845299006 845981419 845522702 844028354 843469203 844118178
1562.4 844118178 844166994 843421340 842038155 840532839 839265406 836961269 832329214 825371683 814674437
1580.7 814674437 802494109 798599124 805787325 814641535 818339944 817866266 815270126 811186612
1597.1 811186612 805387199 797461033 787561536 776435614 764036953 749279380 730886281 707796216
1613.4 707796216 679043412 659300506 669630289 698938072 728232801 745492697 753104329
$$ packed form
1489H11111510J0492801O480337M050135L079653K558410J971305J104474K0146p8857
1507.3H40789914J063109J162648P57634N57006O10351L81351l0995M6194l5763k69115
1527.7H45032334m28795j182676k273679k961337n490720j0579348p504523L923118
1544H18534374J0318578R022235N117119K306700O82413m58717j494348n59151O48975
1562.4H44118178M8816p45654j383185j505316j267433k304137m632055o957531j0697246
1580.7H14674437j2180328l894985P188201Q854210L698409m73678k596140m083514
1597.1H11186612n799413p926166r899497j1125922j2398661j4757573j8393099k3090065
1613.4G07796216k8752804j9742906J0329783K9307783K9294729J7259896P611632
$$ plain form
1627.7 753104329 756818175 758910835 760380626 762486160 765671372 769119501 772543907 775873005
1644 775873005 779680490 784383178 788493156 792576075 798477530 803623915 807467818 810963690 814477980
1662.3 814477980 817880690 820618331 823002219 825770676 828430355 830722988 833072901 835094452
1678.6 835094452 836380839 836953044 837707937 839011192 840016246 840757251 841271162 841453910 841744721
1697 841744721 842315793 843326211 844549417 845490158 846492350 847501814 848164916 848428607 848398864
1715.4 848398864 848603904 849580824 850685298 851424456 851950407 852267146 852392614 852315366 852212906 852775276
1735.8 852775276 853463054 853774309 854071558 854469597 854791164 854935348 855066717 855569541 856107175 856255889
1756.2 856255889 856239021 856188893 856196225 856424510 856498599 856285393 855977118 855801165 856073141 856406391
$$ packed form
1627.7G53104329L713846K092660J469791K105534L185212L448129L424406L329098
1644G75873005L807485M702688M109978M082919N901455N146385L843903L495872L514290
1662.3H14477980L402710K737641K383888K768457K659679K292633K349913K021551
1678.6H35094452J286387N72205P54893J303255J005054P41005N13911J82748K90811
1697H41744721N71072J010418J223206R40741J002192J009464O63102K63691k9743
1715.4H48398864K05040R76920J104474P39158N25951L16739J25468p7248j02460N62370
1735.8H52775276O87778L11255K97249L98039L21567J44184J31369N02824N37634J48714
1756.2H56255889j6868n0128P332K28285P4089k13206l08275j75953K71976L33250
$$ plain form
1776.5 856406391 856393456 856199026 856117427 856249332 856600523 856849968 856767595 856836915 857313275 857694447
1796.9 857694447 857767284 857797086 858012855 858257890 858297288 858180940 858191192 858434975 858688891 858822227
1817.3 858822227 858918369 858949065 858837903 858746409 858695388 858609796 858751237 858989120 859007835 858952522 858943582
1839.8 858943582 858721375 858334661 858332813 858608305 858775616 858797431 858730078 858613551 858475864 858350396
1860.2 858350396 858211160 857982099 857533693 857031941 856915891 857024074 856945574 856656015 856283784 855832636
1880.6 855832636 855202973 854341209 853358567 852626801 852509320 852741122 852877975 852899313 852889955 852804422
1901 852804422 852581739 852095366 851106703 849713624 848687410 848737240 849533439 850346744 850936472 851193488
1921.4 851193488 851128221 850863218 850313306 849526227 848821402 848487556 848487914 848563850 848503053 848287106 848153234
$$ packed form
1776.5H56406391j2935j94430q1599J31905L51191K49445q2373O9320M76360L81172
1796.9H57694447P2837K9802K15769K45035L9398j16348J0252K43783K53916J33336
1817.3H58822227R6142L0696j11162r1494n1021q5592J41441K37883J8715n5313q940
1839.8H58943582k22207l86714j848K75492J67311K1815o7353j16527j37687j25468
1860.2H58350396j39236k29061m48406n01752j16050J08183p8500k89559l72231m51148
1880.6H55832636o29663q61764r82642p31766j17481K31802J36853K1338r358q5533
1901H52804422k22683m86373r88663j393079j026214M9830P96199Q13305N89728K57016
1921.4H51193488o5267k65003n49912p87079p04825l33846L58P5936o0797k15947j33872
$$ plain form
1943.8 848153234 848156989 848175883 848194242 848196685 848169804 848111629 848038614 847952247 847843587 847733438 847687185
1966.2 847687185 847805500 848017156 848167896 848217010 848205626 848194420 848161101 848075330 847934186 847724438
1986.6 847724438 847433031 847050607 846711338 846536577 846461356 846445203 846464992 846467197 846401155 846253633 846041441
2009.1 846041441 845760226 845389485 844876885 844265401 843639553 842981756 842135727 841456473 841849566 842957020
2029.5 842957020 843652427 843827248 843782961 843602121 843298316 842932880 842583597 842276812 842017889 841811121
2049.9 841811121 841671944 841541708 841395497 841300189 841289878 841353714 841463983 841648817 841923892 842206359
2070.3 842206359 842451036 842677355 842913210 843152285 843356788 843525052 843665361 843789279 843892813 843985081
2090.7 843985081 844072342 844126284 844155729 844157279 844140112 844137490 844135880 844130754 844136417 844169796 844213724 844244123
$$ packed form
1943.8H48153234L755J8894J8359K443k6881n8175p3015q6367j08660j10149m6253
1966.2H47687185J18315K11656J50740M9114j1384j1206l3319q5771j41144k09748
1986.6H47724438k91407l82424l39269j74761p5221j6153J9789K205o6042j47522k12192
2009.1H46041441k81215l70741n12600o11484o25848o57797q46029o79254L93093J107454
2029.5H42957020O95407J74821m4287j80840l03805l65436l49283l06785k58923k06768
2049.9H41811121j39177j30236j46211r5308j0311O3836J10269J84834K75075K82467
2070.3H42206359K44677K26319K35855K39075K04503J68264J40309J23918J03534R2268
2090.7H43985081Q7261N3942K9445J550j7167k622j610n126N663L3379M3928L0399
$$ plain form
2115.1 844244123 844257295 844242811 844211161 844166160 844151974 844220042 844334781 844430685 844484925 844526529 844547749
2137.6 844547749 844539225 844548523 844588220 844638407 844674230 844685614 844699681 844735503 844779074 844805062 844820082 844820619
2162 844820619 844773710 844654500 844470799 844353676 844359159 844386816 844401717 844420612 844461143 844525337 844623029
2184.5 844623029 844732165 844767153 844720840 844641566 844567895 844512284 844480753 844477475 844488382 844528735 844562054
2206.9 844562054 844520628 844404340 844226658 844003320 843775332 843599737 843480468 843370736 843248367 843119979
2227.3 843119979 843031049 842989385 842969954 842952013 842890859 842795074 842719376 842702568 842754424 842854679 842928231
2249.7 842928231 842888951 842750967 842571616 842392504 842250645 842172444 842150569 842131913 842091680 842009246 841858804
2272.2 841858804 841674089 841487169 841282845 841018319 840692401 840351164 840061903 839905381 839850664 839814305
$$ packed form
2115.1H44244123J3172j4484l1650m5001j4186O8068J14739R5904N4240M1604K1220
2137.6H44547749q524R298L9697N0187L5823J1384J4067L5822M3571K5988J5020N37
2162H44820619m6909j19210j83701j17123N483K7657J4901J8895M0531O4194R7692
2184.5H44623029J09136L4988m6313p9274p3671n5611l1531l278J0907M0353L3319
2206.9H44562054m1426j16288j77682k23338k27988j75595j19269j09732j22369j28388
2227.3H43119979q8930m1664j9431j7941o1154r5785p5698j6808N1856J00255P3552
2249.7H42928231l9280j37984j79351j79112j41859p8201k1875j8656m0233q2434j50442
2272.2H41858804j84715j86920k04324k64526l25918l41237k89261j56522n4717l6359
$$ plain form
2292.6 839814305 839812517 839902401 840054870 840161562 840191364 840200126 840213239 840187073 840069950 839888096 839685678
2315 839685678 839460552 839196503 838939726 838819265 838856220 838936925 839001060 839002073 838882923 838643610 838328600
2337.4 838328600 838050544 837890983 837768078 837667882 837716937 837887466 838072240 838194668 838213742 838130713
2357.8 838130713 837943137 837746382 837673187 837655425 837568998 837400079 837168336 836942852 836826682 836817324
2378.2 836817324 836855292 836890101 836887360 836874306 836866617 836850107 836805522 836711049 836568117 836363196 836112618
2400.7 836112618 835891902 835774541 835771620 835779905 835682929 835487783 835288584 835136771 835020423 834924877 834834576
2423.1 834834576 834750473 834674656 834576607 834445298 834309340 834210157 834167719 834171772 834203839 834238291 834261358
2445.5 834261358 834274054 834254444 834178448 834087670 834002972 833871424 833685100 833469748 833237588 832991183
$$ packed form
2292.6H39814305j788Q9884J52469J06692K9802Q762J3113k6166j17123j81854k02418
2315H39685678k25126k64049k56777j20461L6955Q0705O4135J013j19150k39313l15010
2337.4H38328600k78056j59561j22905j00196M9055J70529J84774J22428J9074q3029
2357.8H38130713j87576j96755p3195j7762q6427j68919k31743k25484j16170r358
2378.2H36817324L7968L4809k741j3054p689j6510m4585r4473j42932k04921k50578
2400.7H36112618k20716j17361k921Q285r6976j95146j99199j51813j16348r5546r0301
2423.1H34834576q4103p5817r8049j31309j35958r9183m2438M053L2067L4452K3067
2445.5H34261358J2696j9610p5996r0778q4698j31548j86324k15352k32160k46405
$$ plain form
2465.9 832991183 832740784 832496166 832244039 832004786 831824481 831734240 831725180 831716418 831638753 831471503 831236124
2488.4 831236124 831001103 830800056 830627143 830487549 830415845 830465078 830636024 830850124 831017733 831108332
2508.8 831108332 831130445 831080317 830949485 830735445 830436707 830057144 829607010 829132259 828713298 828370035
2529.2 828370035 828058898 827755690 827468872 827232301 827035248 826833308 826659977 826549232 826468587 826379538
2549.6 826379538 826278627 826195657 826123118 826032341 825908065 825712979 825455964 825289607 825354159 825552881
2570 825552881 825687408 825706661 825663507 825591087 825488627 825330257 825083315 824722409 824240267 823698699
2590.3 823698699 823155582 822588921 822038054 821627498 821384788 821239948 821159184 821140647 821163237 821155906
2610.7 821155906 821018517 820696652 820182621 819505990 818759620 818087935 817649841 817493796 817523956 817617953
$$ packed form
2465.9H32991183k50399k44618k52127k39253j80305r0241r060q762p7665j67250k35379
2488.4H31236124k35021k01047j72913j39594p1704M9233J70946K14100J67609R0599
2508.8H31108332K2113n0128j30832k14040k98738l79563m50134m74751m18961l43263
2529.2H28370035l11137l03208k86818k36571j97053k01940j73331j10745q0645q9049
2549.6H26379538j00911q2970p2539r0777j24276j95086k57015j66357O4552J98722
2570H25552881J34527J9253m3154p2420j02460j58370k46942l60906m82142n41568
2590.3H23698699n43117n66661n50867m10556k42710j44840q0764j8537K2590p331
2610.7H21155906j37389l21865n14031o76631p46370o71685m38094j56045L0160R3997
$$ plain form
2631.1 817617953 817661881 817584455 817382157 817071617 816707969 816412091 816266596 816201746 816078007 815872014
2651.5 815872014 815671444 815533519 815461338 815450847 815479159 815499425 815449893 815301180 815143287 815091431 815145075
2674 815145075 815241754 815314531 815292239 815178633 815060735 814944267 814744174 814444005 814105511 813803315
2694.4 813803315 813581884 813417971 813260257 813090146 812869728 812552989 812164247 811707854 811144710 810525239
2714.8 810525239 809937418 809404612 808909059 808391273 807756841 806939065 806077957 805550396 805537403 805807233
2735.2 805807233 806051970 806154549 806140780 806068838 805956185 805756092 805425584 804995954 804552078 804154038
2755.6 804154038 803753018 803268373 802687168 802026868 801285207 800463617 799625158 798863590 798123896 797178328
2775.9 797178328 795952618 794565141 793097198 791626573 790286124 789137363 788046718 786853552
$$ packed form
2631.1H17617953M3928p7426k02298l10540l63648k95878j45495o4850j23739k05993
2651.5H15872014k00570j37925p2181j0491K8312K0266m9532j48713j57893n1856N3644
2674H15145075R6679P2777k2292j13606j17898j16468k00093l00169l38494l02196
2694.4H13803315k21431j63913j57714j70111k20418l16739l88742m56393n63144o19471
2714.8H10525239n87821n32806m95553n17786o34432q17776q61108n27561j2993K69830
2735.2H05807233K44737J02579j3769p1942j12653k00093l30508m29630m43876l98040
2755.6H04154038m01020m84645n81205o60300p41661q21590q38459p61568p39694r45568
2775.9G97178328j225710j387477j467943j470625j340449j148761j090645j193166
$$ plain form
2792.3 786853552 785528481 784078479 782466888 780678153 778805971 776903450 774925590 772853434
2808.6 772853434 770590663 768033445 765217841 762101948 758518815 754344940 749484360 743777990
2824.9 743777990 737050772 729064941 719379544 707320571 691966534 672008932 645219207 608611107
2841.2 608611107 560405493 504553556 455890000 433648705 442216963 466819078 493098795
2855.5 493098795 519308746 547755182 576666534 601779997 618519843 623524547 618466437 611558318
2871.8 611558318 611491323 619362175 629713774 637398481 640139043 637652576 631106377 622295499
2888.1 622295499 612422168 601829052 590555727 578751147 566734850 554619431 541695476
2902.4 541695476 526426911 506823421 480511457 445526987 402996123 360210478 329010546
$$ packed form
2792.3G86853552j325071j450002j611591j788735j872182j902521j977860k072156
2808.6G72853434k262771k557218k815604l115893l583133m173875m860580n706370
2824.9G43777990o727218p985831r685397j2058973j5354037j9957602k6789725l6608100
2841.2F08611107m8205614n5851937m8663556k2241295Q568258K4602115K6279717
2855.5D93098795K6209951K8446436K8911352K5113463J6739846N004704n058110o908119
2871.8F11558318o6995P870852J0351599P684707K740562k486467o546199q810878
2888.1F22295499r873331j0593116j1273325j1804580j2016297j2115419j2923955
2902.4E41695476j5268565j9603490k6311964l4984470m2530864m2785645l1199932
$$ plain form
2916.7 329010546 317429453 323909283 341790617 365718186 392245680 418350190 441581637
2931 441581637 460835308 476655841 491479516 508457363 528437138 548398077 563169956 567637503
2947.3 567637503 557966232 534797072 506751955 485416621 475282252 474242449 481049061 496126980
2963.6 496126980 518832982 547044754 577791929 607983172 635015428 657331944 674949586
2977.9 674949586 689002752 700698614 710769653 719451666 726792574 732967079 738083363 742140949
2994.2 742140949 745438039 748234332 750566363 752587974 754368901 755940557 757551014 759320140
3010.5 759320140 760967374 762199104 763054788 763720572 764322460 764925838 765465975 765839219 766164303
3028.9 766164303 766578972 767024040 767327189 767442226 767598987 767765820 767656803 767456174 767621994 768256664
$$ packed form
2916.7C29010546j1581093O479830J7881334K3927569K6527494K6104510K3231447
2931D41581637J9253671J5820533J4823675J6977847J9979775J9960939J4771879M467547
2947.3E67637503r671271k3169160k8045117k1335334j0134369j039803O806612J5077919
2963.6D96126980K2706002K8211772L0747175L0191243K7032256K2316516J7617642
2977.9F74949586J4053166J1695862J0071039Q682013P340908O174505N116284M057586
2994.2G42140949L297090K796293K332031K021611J780927J571656J610457J769126
3010.5G59320140J647234J231730Q55684O65784O01888O03378N40137L73244L25084
3028.9G66164303M14669M45068L03149J15037J56761J66833j09017k00629J65820O34670
$$ plain form
3049.2 768256664 768944561 769250154 769171536 768794239 768252254 767880678 767882586 768258572 768815041 769264996
3069.6 769264996 769530714 769659400 769645631 769392967 768889129 768473148 768479168 768833637 769409418 770103037
3090 770103037 770611882 770856082 771074235 771342516 771499634 771433711 771301985 771349013 771484077 771412909
3110.4 771412909 771274269 771371305 771498859 771357536 770873547 770136178 769494891 769177079 769033909 768803954
3130.8 768803954 768449128 768160164 768010855 767800450 767296672 766612411 765990973 765472174 765089273 764794350
3151.2 764794350 764289200 763480842 762654901 761933506 761212170 760530829 759939015 759334385 758649766 757891893
3171.6 757891893 757048428 756126523 755195081 754287064 753339410 752339184 751332283 750332296 749313653
3190 749313653 748245478 747121334 745960891 744841039 743800938 742793918 741778910 740723491 739608645
$$ packed form
3049.2G68256664O87897L05593p8618l77297n41985l71576J908L75986N56469M49955
3069.6G69264996K65718J28686j3769k52664n03838m15981O020L54469N75781O93619
3090G70103037N08845K44200K18153K68281J57118o5923j31726M7028J35064p1168
3110.4G71412909j38640R7036J27554j41323m83989p37369o41287l17812j43170k29955
3130.8G68803954l54826k88964j49309k10405n03778o84261o21438n18799l82901k94923
3151.2G64794350n05150q08358q25941p21395p21336o81341n91814o04630o84619p57873
3171.6G57891893q43465r21905r31442r08017r47654j000226j006901r99987j018643
3190G49313653j068175j124144j160443j119852j040101j007020j015008j055419j114846
$$ plain form
3208.3 739608645 738463759 737339616 736221492 735067725 733861625 732575715 731241465 729928732
3224.6 729928732 728670239 727512836 726454735 725365818 724100292 722700834 721314847 719938934
3241 719938934 718561709 717284322 716073275 714779556 713465214 712311804 711281300 710208654 709110498
3259.3 709110498 708072126 707071662 706122696 705339253 704714179 703938246 702850103 701659799 700511813
3277.7 700511813 699422359 698377252 697319329 696237266 695169568 694156408 693110585 691840053
3294 691840053 690311551 688613296 686905682 685431600 684156537 682673454 680687904 678314984 675869584
3312.3 675869584 673509955 671161771 668784976 666405916 664026082 661601126 658953369 656044424
3328.7 656044424 653103471 650235295 647426486 644672811 641748369 638515711 635117412 631627202
$$ packed form
3208.3G39608645j144886j124143j118124j153767j206100j285910j334250j312733
3224.6G29928732j258493j157403j058101j088917j265526j399458j385987j375913
3241G19938934j377225j277387j211047j293719j314342j153410j030504j072646j098156
3259.3G09110498j038372j000464r48966p83443o25074p75933j088143j190304j147986
3277.7G00511813j089454j045107j057923j082063j067698j013160j045823j270532
3294F91840053j528502j698255j707614j474082j275063j483083j985550k372920k445400
3312.3F75869584k359629k348184k376795k379060k379834k424956k647757k908945
3328.7F56044424k940953k868176k808809k753675k924442l232658l398299l490210
$$ plain form
3345 631627202 628220379 625045776 621707439 617880404 613919914 610167563 606524646 602770865 598956406
3363.3 598956406 595380366 591959834 588219106 584034562 579881787 576145411 572680950 569305480
3379.7 569305480 566004634 562840283 559942007 557427883 555259407 553033650 550452232 547903836
3396 547903836 545880973 544134021 541976213 539445937 537242770 535527766 533948541 532313764 530618608
3414.3 530618608 528991342 527612805 526439130 525373936 524528027 523968041 523584664 523229301 522986710
3432.7 522986710 522991061 522949338 522638261 522422075 522616684 523109734 523767292 524549007 525397658 526298404
3453.1 526298404 527309239 528510809 529892504 531250775 532635033 534348488 536211729 537690043
3469.4 537690043 538724720 539823472 541267931 542981386 544711947 546201229 547684193 549393058
$$ packed form
3345F31627202l406823l174603l338337l827035l960490l752351l642917l753781l814459
3363.3E98956406l576040l420532l740728m184544m152775l736376l464461l375470
3379.7E69305480l300846l164351k898276k514124k168476k225757k581418k548396
3396E47903836k022863j746952k157808k530276k203167j715004j579225j634777j695156
3414.3E30618608j627266j378537j173675j065194q45909n59986l83377l55363k42591
3432.7E22986710M351m1723l11077k16186J94609M93050O57558P81715Q48651R00746
3453.1E26298404J010835J201570J381695J358271J384258J713455J863241J478314
3469.4E37690043J034677J098752J444459J713455J730561J489282J482964J708865
$$ plain form
3485.7 549393058 551080644 552714229 554480791 556339800 558230817 560089409 561910450 563800752
3502 563800752 565629303 567272305 568997204 571039915 573328674 575546384 577534854 579500079 581610680
3520.4 581610680 583897948 586126506 588144422 590246022 592572749 595010579 597524285 599993825
3536.7 599993825 602333546 604740798 607292593 609805822 612129390 614348948 616668761 619163692
3553 619163692 621713042 624236465 626799107 629348516 631621659 633778334 636637270 640086472 643220305
3571.4 643220305 646074474 649039626 652158618 655422628 658787251 661999643 664976597 668201506
3587.7 668201506 671785772 675126970 678292632 681636751 685057580 688365757 691555023 694547594
3604 694547594 697362840 700442195 703836143 707214952 710508347 713475287 716440201 719907701 723113596
$$ packed form
3485.7E49393058J687586J633585J766562J859009J891017J858592J821041J890302
3502E63800752J828551J643002J724899K042711K288759K217710J988470J965225K110601
3520.4E81610680K287268K228558K017916K101600K326727K437830K513706K469540
3536.7E99993825K339721K407252K551795K513229K323568K219558K319813K494931
3553F19163692K549350K523423K562642K549409K273143K156675K858936L449202L133833
3571.4F43220305K854169K965152L118992L264010L364623L212392K976954L224909
3587.7F68201506L584266L341198L165662L344119L420829L308177L189266K992571
3604F94547594K815246L079355L393948L378809L293395K966940K964914L467500L205895
$$ plain form
3622.4 723113596 725375056 726887703 728843153 731745899 734240234 736229420 738056600 739667296
3638.7 739667296 741166592 742511451 743372500 743867159 745043576 747167528 748760462 749710560 751000106
3657 751000106 752420008 753319800 753828824 754075944 753920555 753862083 754321218 754377246 754349589 755143702
3677.4 755143702 756076276 756824374 757359445 757544994 757692695 758288682 759219050 760115802 760806561 761171699
3697.8 761171699 761319637 761692464 762280405 762499392 762200713 761826098 762085140 762775898 763165236 763180435
3718.2 763180435 763047636 762958586 763033688 763373435 763659477 763457894 762904167 762614727 763129890 763834894
3738.6 763834894 763581991 762474775 761991978 762204051 761903167 761816978 762558699 763108909 763087690 763054430
3759 763054430 763279915 763305128 763076365 762834191 762781441 763066411 763326526 763288021 763127267 763113022 763172388
$$ packed form
3622.4G23113596K261460J512647J955450K902746K494335J989186J827180J610696
3638.7G39667296J499296J344859Q61049M94659J176417K123952J592934R50098J289546
3657G51000106J419902Q99792N09024K47120j55389n8472M59135N6028k7657P94113
3677.4G55143702R32574P48098N35071J85549J47701N95987R30368Q96752O90759L65138
3697.8G61171699J47938L72827N87941K18987k98679l74615K59042O90758L89338J5199
3718.2G63180435j32799q9050P5102L39747K86042k01583n53727k89440N15163P05004
3738.6G63834894k52903j107216m82797K12073l00884q6189P41721N50210k1219l3260
3759G63054430K25485K5213k28763k42174n2750K84970K60115l8505j60754j4245N9366
$$ plain form
3781.4 763172388 763141811 763206542 763423383 763646841 763702154 763455391 763157904 762873709 762420774 762368023
3801.8 762368023 762601078 762617052 762945771 763363123 763148367 762393892 761870384 761578143 761194289 761369586
3822.2 761369586 761677861 761592209 761403918 761217654 761139154 761034250 760701597 760532677 760689318 760961473
3842.6 760961473 761332929 761501908 761016607 759722352 758660793 759376943 760386527 760538936 760168135
3861 760168135 759791017 759681463 759393632 758954108 758939862 759167194 759368241 759202242 758729458 758579433
3881.4 758579433 758597016 758698642 758819282 758552611 758377731 758569777 758465648 757892072 757242978 756833613
3901.8 756833613 756897986 757377148 757736564 757753074 757598281 757357538 757152736 757184207 757350743 757408679
3922.2 757408679 757442296 757541060 757454336 757233560 757246733 757437766 757499695 757362366 757104039 756902933
$$ packed form
3781.4G63172388l0577O4731K16841K23458N5313k46763k97487k84195m52935n2751
3801.8G62368023K33055J5974L28719M17352k14756p54475n23508k92241l83854J75297
3822.2G61369586L08275q5652j88291j86264p8500j04904l32653j68920J56641K72155
3842.6G60961473L71456J68979m85301j294255j061559P16150J009584J52409l70801
3861G60168135l77118j09554k87831m39524j4246K27332K01047j65999m72784j50025
3881.4G58579433J7583J01626J20640k66671j74880J92046j04129n73576o49094m09365
3901.8G56833613O4373M79162L59416J6510j54793k40743k04802L1471J66536N7936
3922.2G57408679L3617R8764q6724k20776J3173J91033O1929j37329k58327k01106
$$ plain form
3942.6 756902933 756840110 756777346 756703377 756704092 756719768 756656766 756545186 756472051 756447375 756396353 756281734
3965 756281734 756141543 755990148 755808353 755634069 755532920 755460083 755388558 755392551 755454957 755440831 755305350
3987.4 755305350 755156994 755070448 755012631 754931331 754830182
3997.6 754830182
$$ packed form
3942.6G56902933o2823o2764p3969P15J5676o3002j11580p3135k4676n1022j14619
3965G56281734j40191j51395j81795j74284j01149p2837p1525L993O2406j4126j35481
3987.4G55305350j48356q6546n7817q1300j01149
3997.6G54830182
##END=$$ End of the data block
