##TITLE=C8 $$ Begin of the data block
##JCAMP-DX=5.00 $$ ACD/SpecManager v 10.08
##SPECTROMETER/DATA SYSTEM=Alpha
##DATE=07 Mar 2014 10:37:22
##DATA TYPE=INFRARED SPECTRUM
##DATA CLASS=XYDATA
##ORIGIN=
##OWNER=
##NPOINTS=1667
##FIRSTX=599.63549805
##LASTX=3997.56909180
##MAXX=3997.56909180
##MINX=599.63549805
##MAXY=1.13501537
##MINY=0.61776209
##XFACTOR=1.0000000000
##YFACTOR=0.000000010000000
##FIRSTY=0.99349916
##DELTAX=2.03957605
##XUNITS=1/CM
##YUNITS=ARBITRARY UNITS
##XYDATA=(X++(Y..Y))
599.6I9349916k0957j7011j1343l666P815J406m405J5551L4207K3479j300k1118l3915
626.1I9318659k8914j4990j3781k2531m8124j33396j64687M4250K56527K10386R6524
648.6I9499923O6560O0875M3064L7026M4883M2456K9165N0109J61702J68669l076J741
673.1A00203097O0165P4100P3660N3930M4024O1464M9293J4699R465R322k336j6821
697.5A00634062n9211j10042p8356L2878Q7273j9932k66218n65869q59368j071566
717.9I7723651j107919r42636o97028n02217k51234L08907J134426J723867J698679
736.3I9088496J263791Q28553N55503M03058L18051K71427K18702J56760J17314R9850
756.7A03321505J16646J58346J72257J65927J65320J48558J22071J08599Q1766J9693
$$ y = [99349916, 99328959, 99311948, 99300605, 99296939, 99304754, 99306160, 99301755, 99317306, 99351513, 99374992, 99373692, 99352574, 99318659, 99289745, 99274755, 99260974, 99238443, 99190319, 99056923, 98892236, 98936486, 99193013, 99403399, 99499923, 99566483, 99627358, 99670422, 99707448, 99752331, 99794787, 99823952, 99874061, 100035763, 100204432, 100201356, 100203097, 100263262, 100337362, 100411022, 100464952, 100508976, 100570440, 100619733, 100634432, 100643897, 100653219, 100650883, 100634062, 100574851, 100464809, 100386453, 100419331, 100506604, 100486672, 100220454, 99654585, 98795217, 97723651, 96615732, 95673096, 94976068, 94473851, 94222617, 94531524, 95665950, 97389817, 99088496, 100352287, 101180840, 101736343, 102139401, 102457452, 102728879, 102947581, 103104341, 103221655, 103321505, 103438151, 103596497, 103768754, 103934681, 104100001, 104248559, 104370630, 104479229, 104560995, 104580688]
777.1A04580688n4323j17016j43850j22654p0870k7788m3964j46139l48473o65009
797.5A02840602j066100j397860j611650k079231l358239n642169q194250r133774
813.8G0357329o794781j786339L400147O774217P962435P518149O084489M231960K494127
832.1A00241733J232969N52392L60179M51982O03378O92666O99663O19650M88007L66700
852.5A06309319K68101J96791J65832J53851J23239O8569J6880l0553q8286j57309
872.9A07026434k59185m15969o36935r37581j332557j835156k413386k947110l270376
891.3I2978179l238207k729499j668400j96254J270521K411038L235769L733700L670138
909.6I9466985K997429K075016J289320P65503M55606K96247K28262J79326J13058
$$ y = [104580688, 104526365, 104409349, 104265499, 104142845, 104071975, 104044187, 104000223, 103854084, 103505611, 102840602, 101774502, 100376642, 98764992, 96685761, 93327522, 87685353, 79491103, 70357329, 63562548, 61776209, 65176356, 71950573, 79913008, 87431157, 93515646, 97747606, 100241733, 101474702, 102027094, 102387273, 102839255, 103442633, 104135299, 104834962, 105454612, 105942619, 106309319, 106577420, 106774211, 106940043, 107093894, 107217133, 107285702, 107302582, 107272029, 107183743, 107026434, 106767249, 106351280, 105714345, 104776764, 103444207, 101609051, 99195665, 96248555, 92978179, 89739972, 87010473, 85342073, 85145819, 86416340, 88827378, 92063147, 95796847, 99466985, 102464414, 104539430, 105828750, 106594253, 107049859, 107346106, 107574368, 107753694, 107866752]
928A07866752K2936j16098l21698n45096o40786m45616k766M30059O36244N95522M30191
950.4A07909644K61354J38760L8862o9714j59418j79780j20461l0255K2685K1279k2578
972.9A07810378j00374j93286k83825l56400l96622l83424l27850l02231l93117o33788
993.3A04439461j017022j544213k174795k815211l362244l608686l155094j696420
1009.6H5065776N23353K638393L349120J778614j57553O77091L038502L543526K271449
1027.9A02728271R51493J54770k59960m46761m59003l40414j69170n7268q9085k77818
1048.3A01735055n92243j002920j479661k000142k554011l122753l617185l869933
1064.7H3496207l731978l126532k122354r67986K0552N88191N78212J0884q31699j460910
$$ y = [107866752, 107889688, 107773590, 107451892, 106906796, 106266010, 105820394, 105817628, 106247687, 106883931, 107479453, 107909644, 108170998, 108309758, 108348620, 108278906, 108119488, 107939708, 107819247, 107788992, 107811677, 107832956, 107810378, 107710004, 107516718, 107232893, 106876493, 106479871, 106096447, 105768597, 105466366, 105073249, 104439461, 103422439, 101878226, 99703431, 96888220, 93525976, 89917290, 86762196, 85065776, 85589129, 88227522, 91576642, 93355256, 93197703, 93874794, 96913296, 100456822, 102728271, 103679764, 103834534, 103574574, 103127813, 102668810, 102328396, 102159226, 102101958, 102012873, 101735055, 101142812, 100139892, 98660231, 96660089, 94106078, 90983325, 87366140, 83496207, 79764229, 76637697, 74515343, 73547357, 73567909, 74156100, 74734312, 74745196, 73913497, 72452587]
1085G2452587j412654m77362J200134L161359M830169N708760N536700M479330L095490
1103.4I8574513J882011R51505J87707m64476q17918o03652P7772P67731J182330J356733
1123.8A03094256J357376J181114Q85630O05154M07672K75194J89186J31964Q7047
1142.2A08214593N6064L0506L040k2340n0950r2769j43361j77813j72126j33586j20008
1164.6A07391250j89531l36230n49006q89564j378762j746249j488626n02587O16765
1182.9A00927460J240134J195443O35350j35005r27758j771617k542609k691448j657527
1201.3I4272423L46112K230257K930754K349997J272011M96840K71738L57115M21870
1219.7A04949117L46732K03204O9380l2878j06895j75619k48563l17562l86632m54509
$$ y = [72452587, 71039933, 70562571, 71762705, 74924064, 79754233, 85462993, 90999693, 95479023, 98574513, 100456524, 101408029, 101595736, 101131260, 100313342, 99709690, 99787462, 100555193, 101737523, 103094256, 104451632, 105632746, 106518376, 107123530, 107531202, 107806396, 107995582, 108127546, 108214593, 108270657, 108301163, 108304203, 108281863, 108230913, 108138144, 107994783, 107816970, 107644844, 107511258, 107391250, 107201719, 106865489, 106316483, 105426919, 104048157, 102301908, 100813282, 100310695, 100927460, 102167594, 103363037, 103998387, 103863382, 102935624, 101164007, 98621398, 95929950, 94272423, 94618535, 96848792, 99779546, 102129543, 103401554, 103898394, 104170132, 104527247, 104949117, 105295849, 105499053, 105568433, 105535555, 105428660, 105253041, 105004478, 104686916, 104300284, 103845775]
1240.1A03845775n10943n62310o07586o32560o27911n86582n10495l96437k46358q9568
1260.4I9075025L2455Q9830P7063p325j64330l72458n84823o96796n76878k77274l3951
1282.9I6560538K8282l0750j12122j64652j74123j29998r0134k52044o28764o42150
1303.3I4364083J82813J298470J831710J660704J179469O86014K89416j3363k25795
1321.6A01253521l34036l39889k69199j78993j26946j51300k34520l12657l13574k03585
1342I8788822m6200P8356J35452J31190P2670p6115l58856p72274j302886j843202
1362.4I4806957j928222j382756n76276K14440P68465J009237R81898R73653J072526
1380.8I5939922J061541Q58492N60623K31987l2764k04903l46881m41098n11820n47880
$$ y = [103845775, 103334832, 102772522, 102164936, 101532376, 100904465, 100317883, 99807388, 99410951, 99164593, 99075025, 99107480, 99197310, 99274373, 99267048, 99102718, 98730260, 98145437, 97448641, 96871763, 96594489, 96560538, 96588820, 96558070, 96445948, 96281296, 96107173, 95977175, 95887041, 95634997, 95006233, 94364083, 94546896, 95845366, 97677076, 99337780, 100517249, 101203263, 101492679, 101479316, 101253521, 100919485, 100579596, 100310397, 100131404, 100004458, 99853158, 99618638, 99305981, 98992407, 98788822, 98742622, 98820978, 98956430, 99087620, 99160290, 99084175, 98725319, 97953045, 96650159, 94806957, 92878735, 91495979, 90919703, 91134143, 91902608, 92911845, 93893743, 94867396, 95939922, 97001463, 97859955, 98420578, 98652565, 98619801, 98414898, 98068017, 97626919, 97115099, 96567219]
1401.2I6567219n59383n95224n53918m40890l19463j83886m0376J23954L01552L58182
1421.6I4657767L51637L34686K61248J49780j5163k15972n52058r39882j018899r86177
1442I2026967r35751q52812p59643m35740J14352P16734J536679K132773J694864J347697
1462.4I6586120J362956J244902R30608P83598Q01659P06768N31697M39095L92998
1480.7A03780401L58963L09193K73549K67423K42042J84882J19138Q833k10082m60721
1501.1A04873621p42423j554835l513056m576975m360896k963347N59837M088527M995924
1519.5I6806377M289693K790296J436019Q83663N60176L87490L21090K39921K10166
1537.8A07924891K52890J84512J02496R6059R2030Q4495P9465P8738Q3148R1339K1588
$$ y = [96567219, 96007836, 95412612, 94858694, 94417804, 94098341, 93914455, 93874079, 93998033, 94299585, 94657767, 95009404, 95344090, 95605338, 95755118, 95739955, 95523983, 94971925, 94032043, 93013144, 92026967, 91091216, 90238404, 89478761, 89043021, 89157373, 89874107, 91410786, 93543559, 95238423, 96586120, 97949076, 99193978, 100124586, 100908184, 101709843, 102416611, 102948308, 103387403, 103780401, 104139364, 104448557, 104722106, 104989529, 105231571, 105416453, 105535591, 105544424, 105334342, 104873621, 104131198, 102576363, 99063307, 94486332, 90125436, 87162089, 87721926, 91810453, 96806377, 101096070, 103886366, 105322385, 106206048, 106766224, 107153714, 107474804, 107714725, 107924891, 108177781, 108362293, 108464789, 108560848, 108652878, 108737373, 108816838, 108895576, 108978724, 109070063, 109091651]
1560.3A09091651j7273R966L3176L6192J7547K051l350m9436o4337J6164R1815J04702
1584.7A09268868O5613K4473M65q165k6584o5029j13940j75059k48349l24750m06050
1607.2A07991493m97127n29373l99291o2382L78012N25546M48823L55769K11596J03688
1627.6A08526754N1630L3712M8030K5499m7684o7592o2001o9248j19317j88255j47951
1650A07983577r3043j24502p0297L5166J11461J87230K35248K29144K33102K20346
1670.4A08947432J56462J31834J22154R0932Q3077J00041R8312N4383M0460M7004N1009
1692.8A09923100N4276M5193K9921m029k6465j5783q893l004R120J9228L0637L6573
1717.3A10089874J8060R716K2054K6452J6105J2100K4557K2781j0955j2028j407j6057
$$ y = [109091651, 109074378, 109084344, 109117520, 109153712, 109171259, 109173310, 109169960, 109120524, 109056187, 109072351, 109164166, 109268868, 109334481, 109358954, 109359419, 109351254, 109324670, 109259641, 109145701, 108970642, 108722293, 108397543, 107991493, 107494366, 106964993, 106565702, 106503320, 106881332, 107406878, 107855701, 108211470, 108423066, 108526754, 108578384, 108612096, 108660126, 108685625, 108637941, 108570349, 108508348, 108439100, 108319783, 108131528, 107983577, 107890534, 107766032, 107695735, 107730901, 107842362, 108029592, 108264840, 108493984, 108727086, 108947432, 109103894, 109235728, 109357882, 109448814, 109531891, 109631932, 109730244, 109784627, 109825087, 109872091, 109923100, 109977376, 110022569, 110052490, 110048461, 110021996, 110006213, 109997320, 109994316, 110003436, 110022664, 110053301, 110089874, 110107934, 110117650, 110139704, 110166156, 110182261, 110194361, 110218918, 110241699, 110230744, 110218716, 110217309, 110201252]
1741.8A10201252k2018j5355k4223m9174o1571m4072k5451p487K1589L9852L8946L9029
1766.3A10091317M8089N5968L8183K873p021o056j1158k2209m3952o9964q9383j14870
1790.7A09871817j49823j39033p8500j6081L8958R2113J29449J42908J43182J33527
1811.1A10168517J13248R6345Q4770O7139M7767L8862L4452K9206K3222R239K837O974
1835.6A10722578O437K956M697J717j0896j4949j6010j8465j2911q094j0204j4389
1860.1A10632467j9359k3055k9421m6194o2740o2811n8210n5301n1510n0414n2488
1882.5A10120964o3157q8275j37996k08724k77829l42703l75926l39461k37655q9872
1902.9A07959366P3123K13384L10219L47256L29435K91527K58398K13384J50967J06907
$$ y = [110201252, 110179234, 110163879, 110139656, 110090482, 110028911, 109984839, 109959388, 109951901, 109973490, 110013342, 110052288, 110091317, 110139406, 110195374, 110233557, 110236430, 110229409, 110223353, 110212195, 110189986, 110146034, 110076070, 109986687, 109871817, 109721994, 109582961, 109504461, 109488380, 109527338, 109619451, 109748900, 109891808, 110034990, 110168517, 110281765, 110378110, 110462880, 110530019, 110577786, 110616648, 110651100, 110680306, 110703528, 110712767, 110715604, 110722578, 110729015, 110731971, 110736668, 110738385, 110727489, 110712540, 110696530, 110678065, 110665154, 110657060, 110646856, 110632467, 110613108, 110590053, 110560632, 110514438, 110451698, 110388887, 110330677, 110275376, 110223866, 110173452, 110120964, 110057807, 109969532, 109831536, 109622812, 109344983, 109002280, 108626354, 108286893, 108049238, 107959366, 108032489, 108245873, 108556092, 108903348, 109232783, 109524310, 109782708, 109996092, 110147059, 110253966]
1923.3A10253966Q5878P1705O1035N9056N7614N2118M7863M1973L4643K8085K3937
1945.7A10817873J7214N865l469q320j4162k3461k2995n901J0407J7404K2674K2209
1970.2A10835338J3220N829O151N854J216J406L243L564J0455J6999K0623K8217K8098
1996.7A10980213K3210K4032K2269J9312J9121TJ8394J5688J3506J0097P904J0943
2021.2A11183810J0026R596J4412J3090J0729J3232J3649J1945J3518J7309J7095P749
2045.7A11336160o330j1826p999k098K706J824m768q428l350P87k754p200r203o831
2074.2A11270690k265k909p903j1385j0979q166o163n484n734o651l231O127J1492
2100.7A11217439J0598J5461K2662J7345O723M447Q321J1468J1527J1099P700K635
$$ y = [110253966, 110339844, 110411549, 110472584, 110531640, 110589254, 110641372, 110689235, 110731208, 110765851, 110793936, 110817873, 110835087, 110840952, 110837483, 110829163, 110815001, 110791540, 110768545, 110762644, 110773051, 110790455, 110813129, 110835338, 110848558, 110854387, 110860538, 110866392, 110867608, 110869014, 110872257, 110875821, 110886276, 110903275, 110923898, 110952115, 110980213, 111003423, 111027455, 111049724, 111069036, 111088157, 111107278, 111125672, 111141360, 111154866, 111164963, 111172867, 111183810, 111193836, 111203432, 111217844, 111230934, 111241663, 111254895, 111268544, 111280489, 111294007, 111311316, 111328411, 111336160, 111329830, 111318004, 111310005, 111307907, 111310613, 111312437, 111307669, 111299241, 111295891, 111296678, 111293924, 111286724, 111277521, 111270690, 111268425, 111265516, 111257613, 111246228, 111235249, 111227083, 111220920, 111215436, 111209702, 111203051, 111199820, 111205947, 111217439, 111228037, 111243498, 111266160, 111283505, 111290228, 111294675, 111302996, 111314464, 111325991, 111337090, 111344790, 111347425]
2125.2A11347425M387P439O020L957M948P760O044M649P534N484N24p98j121j502L34
2155.8A11403084K157L803P665O426K336N186N746J073j073m101r656j2851j5807j8144
2184.4A11375844j0919O67P04p570q905m244k873k885O92M852P379P653L755L70L349
2215A11367869R776J4877J5092J0705Q356J0515J2910J2338R930L696n985o270l076
2241.5A11460733j0788j6511j4376j9121k7216k5475k2530k4569k6834l0292k9325
2263.9A11213696k1458q881P749J9002K0683J8882J9527K0361J4007O950N817k277
2288.4A11314058k0349l2997l4642l2985k8384j3983M077K0432M0138N7959O1250N3776
2312.9A11388350M9459N3001O1738O5017N7650N6124O7317P5138O1535L1448J6975
$$ y = [111347425, 111351812, 111359251, 111365271, 111369228, 111374176, 111381936, 111387980, 111392629, 111400163, 111405647, 111406171, 111405373, 111404252, 111402750, 111403084, 111405241, 111409044, 111416709, 111423135, 111425471, 111430657, 111436403, 111437476, 111436403, 111432302, 111422646, 111409795, 111393988, 111375844, 111364925, 111365592, 111366296, 111358726, 111349821, 111345577, 111342704, 111339819, 111340511, 111345363, 111352742, 111360395, 111364150, 111364520, 111367869, 111377645, 111392522, 111407614, 111418319, 111426675, 111437190, 111450100, 111462438, 111472368, 111476064, 111470079, 111463809, 111460733, 111449945, 111433434, 111419058, 111399937, 111372721, 111347246, 111324716, 111300147, 111273313, 111243021, 111213696, 111192238, 111183357, 111191106, 111210108, 111230791, 111249673, 111269200, 111289561, 111303568, 111310518, 111316335, 111314058, 111293709, 111260712, 111226070, 111193085, 111164701, 111150718, 111154795, 111175227, 111215365, 111273324, 111334574, 111388350, 111437809, 111490810, 111552548, 111617565, 111675215, 111731339, 111798656, 111873794, 111935329, 111966777, 111983752]
2335.3A11983752K3818L0375J5795k1112q6045j32334o2013Q9502J94991J86026J34671
2357.7A12357426Q4304K9624l9506j07241j29497j29008j38569j34778j15311r5534
2378.1A11581910p8690o1179l6192q261P856N996l194m983k27L672M101l159j2625
2404.6A11395025j6057j7226k1040k6477k7180k2745k3150k7526k7608k4259k2138
2427.1A11139619k2924j7857p236Q3P069J4174J9408J9169R715J359J502Q23l076m959
2455.6A11156869p618r536j0062j0812r048k396M459l6r501r632l493P27L505N877
2484.2A11099303M053L803Q475J1409J2576J1158R382J2207J4544J1348N806k27n269
2510.7A11198568l695P99L683N508Q618J1850J0633J1039J5831J4103m65j0801k563
$$ y = [111983752, 112007570, 112037945, 112053740, 112032628, 111946583, 111814249, 111752236, 111841738, 112036729, 112222755, 112357426, 112441730, 112471354, 112431848, 112324607, 112195110, 112066102, 111927533, 111792755, 111677444, 111581910, 111503220, 111442041, 111405849, 111397588, 111405444, 111411440, 111408246, 111403263, 111403036, 111406708, 111410809, 111407650, 111395025, 111378968, 111361742, 111340702, 111314225, 111287045, 111264300, 111241150, 111213624, 111186016, 111161757, 111139619, 111116695, 111098838, 111091602, 111091685, 111098754, 111112928, 111132336, 111151505, 111161220, 111162579, 111164081, 111164904, 111161828, 111156869, 111149251, 111139715, 111129653, 111118841, 111109793, 111107397, 111111856, 111111820, 111102319, 111092687, 111089194, 111089921, 111093426, 111099303, 111103356, 111107159, 111115634, 111127043, 111139619, 111150777, 111160159, 111172366, 111186910, 111198258, 111204064, 111203837, 111198568, 111194873, 111195672, 111199355, 111204863, 111213481, 111225331, 111235964, 111247003, 111262834, 111276937, 111276472, 111265671, 111263108]
2537.2A11263108N222J752J502P200N913j001j097J192o91n210j5187j9348j4806j8847
2565.8A11209702k1672j6010k1874l6026m0042l7503l9005l7170k7335k1123j8323
2588.2A10893619j7774k0218j1027R453K1899K1577J7417J4722Q881n186j7476k2184
2612.7A10893703k5511k7776k9111l6740m7493m7148l5560k0742j1730j2219j0729
2635.1A10588944l898J538L457M160K456p749j7166j7500j8406k1422k2542k2793k3580
2661.6A10445499k2232j9372j8596j7834j5450j4019j7619k2137j4531M923J4746K992
2686.1A10306370j0335j1456j5509k6632l1233l1507l1960k8741k6131k9528l2329
2708.5A10031009k8062k2233j6713q905j6510m5979p9441j18482j42897j24323p3504
$$ y = [111263108, 111268330, 111270082, 111271584, 111278784, 111284697, 111283696, 111282599, 111283791, 111283100, 111277890, 111262703, 111243355, 111228549, 111209702, 111188030, 111172020, 111150146, 111114120, 111074078, 111036575, 110997570, 110960400, 110933065, 110911942, 110893619, 110875845, 110855627, 110844600, 110854053, 110875952, 110897529, 110914946, 110929668, 110938549, 110933363, 110915887, 110893703, 110868192, 110840416, 110811305, 110774565, 110727072, 110679924, 110644364, 110623622, 110611892, 110599673, 110588944, 110585046, 110586584, 110590041, 110594201, 110596657, 110588908, 110571742, 110554242, 110535836, 110514414, 110491872, 110469079, 110445499, 110423267, 110403895, 110385299, 110367465, 110352015, 110337996, 110320377, 110298240, 110283709, 110288632, 110303378, 110306370, 110296035, 110284579, 110269070, 110242438, 110211205, 110179698, 110147738, 110118997, 110092866, 110063338, 110031009, 110002947, 109980714, 109964001, 109955096, 109938586, 109892607, 109813166, 109694684, 109551787, 109427464, 109353960]
2731A09353960Q189J03379J65021J78909J62852J25992O5375J2350O914K7537L0804
2753.4A10241282J5235L016o282j5235j7846k0468k5225l5465o1965q6951p2992m6909
2777.9A09870195n8245q1599q6045r9945j30892j32024r9075q8108j17528j30403j04416
2800.3A08741915r8741j21462j39988j57451j52684j24669j16324j25110j35315j45805
2820.7A07424366j49214j52957j67310j85812k08080k40528k83492l43978l85368l96037
2841.1A04911590m56882n85747p16972q12376r02676j022315j133275j195157j177370
2859.5I6908820j044244q20804n54305k69866k4104J30922K27779K94053K91360K22254
2879.9I5361865J41257P9310N0503O0862J01429J50412J90467K34777K72465K51734
$$ y = [109353960, 109362149, 109465528, 109630549, 109809458, 109972310, 110098302, 110163677, 110176027, 110182941, 110210478, 110241282, 110256517, 110259533, 110253251, 110238016, 110220170, 110199702, 110174477, 110139012, 110077047, 109990096, 109917104, 109870195, 109811950, 109730351, 109644306, 109544361, 109413469, 109281445, 109182370, 109094262, 108976734, 108846331, 108741915, 108643174, 108521712, 108381724, 108224273, 108071589, 107946920, 107830596, 107705486, 107570171, 107424366, 107275152, 107122195, 106954885, 106769073, 106560993, 106320465, 106036973, 105692995, 105307627, 104911590, 104454708, 103868961, 103151989, 102339613, 101436937, 100414622, 99281347, 98086190, 96908820, 95864576, 95043772, 94489467, 94219601, 94195497, 94326419, 94554198, 94848251, 95139611, 95361865, 95503122, 95582432, 95632935, 95693797, 95795226, 95945638, 96136105, 96370882, 96643347, 96895081]
2900.2I6895081J68448N7263q6773k89595n47606q31180j094896j301414j399022j280636
2920.6I0289670q97646l24720L11619Q99017J369792J641423J631975J384467J029759
2939I7335356O63651L47960J34670J3042r3520k41196m25476o89936j134979j782596
2959.4I4126976k553428l274673l681093l521610k726578j470101q0341J144176K058411
2977.8H0021739K625227K879184K890319K694923K336985J893508J431882J008404
2994.1I7782171O26552K89208M1478j18720k00421k03806j79773j76490j92308k18278
3014.5I7449613k52128k55579j54567O1536L27397N56481O64770O83582O94168O96343
3034.9A00471616O40642M57454J91844j8061j21545j28067n1653R2435K65050L91817
$$ y = [96895081, 97063529, 97120792, 97034019, 96744424, 96196818, 95365638, 94270742, 92969328, 91570306, 90289670, 89392024, 89067304, 89378923, 90277940, 91647732, 93289155, 94921130, 96305597, 97335356, 97999007, 98346967, 98481637, 98494679, 98401159, 98159963, 97734487, 97044551, 95909572, 94126976, 91573548, 88298875, 84617782, 81096172, 78369594, 76899493, 76819152, 77963328, 80021739, 82646966, 85526150, 88416469, 91111392, 93448377, 95341885, 96773767, 97782171, 98408723, 98697931, 98739409, 98620689, 98420268, 98216462, 98036689, 97860199, 97667891, 97449613, 97197485, 96941906, 96787339, 96848875, 97176272, 97732753, 98397523, 99081105, 99775273, 100471616, 101112258, 101569712, 101761556, 101743495, 101621950, 101493883, 101442230, 101534665, 101799715, 102191532]
3055.3A02191532M68838N33700N66101N63335N39255M99738M50313L71361K64382J45447
3075.7A06594002L7301j3709l2377p9847j40083k00581k57826k53129j60360j7786
3096A05475605J30558K51185L05617K62595J52122N6983J9860j6797r1553j32894j24514
3118.5A06288767j12331j08385j31130j68646j84870j66022j25552j01935j10591j19471
3138.9A04959834r8706q0454j00195j36447j75190k10119j99139j64449j72472k01082
3159.3A03421581k15769k22087k25329k34413k43676k45953k53844k64716k72024k75659
3179.7A00968111k76232k88904l04639l01534k88803k91138l05313l16680l29190l32338
3200.1I7933340l24452l24762l32159l36259l37154l39514l48580l57425l55476l54046
$$ y = [102191532, 102660370, 103194070, 103760171, 104323506, 104862761, 105362499, 105812812, 106184173, 106448555, 106594002, 106631303, 106617594, 106585217, 106505370, 106365287, 106164706, 105906880, 105653751, 105493391, 105475605, 105606163, 105857348, 106162965, 106425560, 106577682, 106634665, 106654525, 106637728, 106546175, 106413281, 106288767, 106176436, 106068051, 105936921, 105768275, 105583405, 105417383, 105291831, 105189896, 105079305, 104959834, 104861128, 104780674, 104680479, 104544032, 104368842, 104158723, 103959584, 103795135, 103622663, 103421581, 103205812, 102983725, 102758396, 102523983, 102280307, 102034354, 101780510, 101515794, 101243770, 100968111, 100691879, 100402975, 100098336, 99796802, 99507999, 99216861, 98911548, 98594868, 98265678, 97933340, 97608888, 97284126, 96951967, 96615708, 96278554, 95939040, 95590460, 95233035, 94877559, 94523513]
3220.5I4523513l58736l61818l64363l65037l65257l73382l74710l59327l55482l65841
3240.9I0879560l65812l70073l87502l86107l65418l59577l73751l88134l88735l78245
3261.2H7116206l72225l71582l59291l47465l56740l68517l71015l71272l63314l46595
3281.6H3488190l39341l36647l20411l05044l03817l10022l17502l19207l04198k70110
3302H0361891k41894k50691k79909k88385k71291k45029k23934k14142k06166j89770
3322.4G7950680j74892j78075j85346j73891j52671j29265j02240r2530r9969j01024
3342.8G6560777r2041o0397j7387k1410n4699n1219j5294J3858J8930K8235O7687Q9085
3367.3G6466125N4318J8311L4332P0810Q9330R8192J04404J19078J43582J69557J91486
$$ y = [94523513, 94164777, 93802959, 93438596, 93073559, 92708302, 92334920, 91960210, 91600883, 91245401, 90879560, 90513748, 90143675, 89756173, 89370066, 89004648, 88645071, 88271320, 87883186, 87494451, 87116206, 86743981, 86372399, 86013108, 85665643, 85308903, 84940386, 84569371, 84198099, 83834785, 83488190, 83148849, 82812202, 82491791, 82186747, 81882930, 81572908, 81255406, 80936199, 80632001, 80361891, 80119997, 79869306, 79589397, 79301012, 79029721, 78784692, 78560758, 78346616, 78140450, 77950680, 77775788, 77597713, 77412367, 77238476, 77085805, 76956540, 76854300, 76761770, 76661801, 76560777, 76468736, 76408339, 76390952, 76369542, 76314843, 76263624, 76248330, 76262188, 76281118, 76309353, 76377040, 76466125, 76520443, 76538754, 76573086, 76643896, 76733226, 76831418, 76935822, 77054900, 77198482, 77368039, 77559525]
3389.7G7559525J79159J50395J69051K25049K40791K00468J84095K23398K57528K68221
3410.1G9657680K72184K69425K75809K98154L15500L24064L42822L60549L63940L73089
3430.5H2853216L96359M01974L86279L86149M00090M13651M36061M56125M53442M51511
3450.9H7034857M62562M72009M83591M92358M88794M87458M86350M72636M63342M73648
3471.3I1817605M86482M80717M68773M63575M70835M74977M59421M52477M53889M41700
3491.7I6470451M27044M16189M02200L91484L81160L77637L75455L50786L10593K66469
3512.1A00169468K32565K06018J73187J33193P7593L1674J6069j6784n4193n5361n4514
3534.5A00858915m6408l171L3843N1415R2864J58274K10119K34270K58875K84195K90954
$$ y = [77559525, 77738684, 77889079, 78058130, 78283179, 78523970, 78724438, 78908533, 79131931, 79389459, 79657680, 79929864, 80199289, 80475098, 80773252, 81088752, 81412816, 81755638, 82116187, 82480127, 82853216, 83249575, 83651549, 84037828, 84423977, 84824067, 85237718, 85673779, 86129904, 86583346, 87034857, 87497419, 87969428, 88453019, 88945377, 89434171, 89921629, 90407979, 90880615, 91343957, 91817605, 92304087, 92784804, 93253577, 93717152, 94187987, 94662964, 95122385, 95574862, 96028751, 96470451, 96897495, 97313684, 97715884, 98107368, 98488528, 98866165, 99241620, 99592406, 99902999, 100169468, 100402033, 100608051, 100781238, 100914431, 100992024, 101023698, 101039767, 101022983, 100968790, 100913429, 100858915, 100812507, 100809336, 100843179, 100894594, 100987458, 101145732, 101355851, 101590121, 101848996, 102133191, 102424145]
3557A02424145K86925K69210K72596L07560L08335K76744K89547L26062L41248L49116
3577.4A05451488L42823L16548L10063L39639L69537L41130K96151K85149K66111K31111
3597.8A08549750K09617J95933J83678J89399J89317J58441J38008J33610J49894J70171
3618.2A10267818J43790J18375J43671J95468K13182J35111P5674Q2040Q1790O9666
3638.6A11526585N8376N3919P4935J08909Q2088Q82J1230N0199J3876k9803M435N8198
3663A12013829O8605Q7225J21737J05965R9087R4366L9017K5987M1497M8256O5279
3685.5A12810850P0202N2774M6719M1329L5954M4131M9567L0053L755J3840M7195N7912
3710A13304281M709m4453k1339J6880L4297L5572K8622J2827J1206K6810J9395j1670
$$ y = [102424145, 102711070, 102980280, 103252876, 103560436, 103868771, 104145515, 104435062, 104761124, 105102372, 105451488, 105794311, 106110859, 106420922, 106760561, 107130098, 107471228, 107767379, 108052528, 108318639, 108549750, 108759367, 108955300, 109138978, 109328377, 109517694, 109676135, 109814143, 109947753, 110097647, 110267818, 110411608, 110529983, 110673654, 110869122, 111082304, 111217415, 111293089, 111375129, 111456919, 111526585, 111584961, 111638880, 111713815, 111822724, 111904812, 111905694, 111916924, 111967123, 111980999, 111951196, 111955631, 112013829, 112082434, 112169659, 112291396, 112397361, 112496448, 112590814, 112629831, 112655818, 112697315, 112745571, 112810850, 112881052, 112933826, 112980545, 113021874, 113057828, 113101959, 113151526, 113181579, 113185334, 113199174, 113246369, 113304281, 113308990, 113264537, 113243198, 113260078, 113294375, 113329947, 113358569, 113371396, 113382602, 113409412, 113428807, 113417137]
3734.4A13417137m7827o1500l588P1823N4920m470J3864M053o2824o0582r858P546
3758.9A13318694n710j181O199Q571Q512j1742k5594p117J6474J0109O748K0110R847
3785.4A13353920q976j1874M769L3939L9339K9182M1556J9682k2745j3268k5106n6410
3809.9A13384008l3688J8287L3772K2339J7202k0182m8971l6263j1135Q285J932p976
3834.4A13327610J5402K6226j0275l4321l9136l3987J79O4266R3531j3399r2661m9591
3858.8A13253844N877R572k4080j1134J2863j7322k9277k0683j4424n97k086P201J3494
3885.4A13183248M995J7464Q428k1362j1075J1778J5199R275j2839l8099k6524k814
3909.8A13137674P511J5103J3697L744J812J502q345j5163q440p16p534j6534M41K0802
$$ y = [113417137, 113369310, 113307810, 113304222, 113376045, 113430965, 113426495, 113440359, 113444412, 113381588, 113321006, 113311148, 113318694, 113312984, 113311803, 113318002, 113326573, 113335085, 113323343, 113297749, 113290632, 113307106, 113317215, 113323963, 113344073, 113353920, 113344944, 113333070, 113337839, 113371778, 113411117, 113440299, 113481855, 113501537, 113478792, 113465524, 113440418, 113384008, 113350320, 113368607, 113402379, 113424718, 113441920, 113421738, 113372767, 113336504, 113325369, 113333654, 113335586, 113327610, 113343012, 113369238, 113358963, 113324642, 113285506, 113251519, 113251698, 113315964, 113409495, 113396096, 113303435, 113253844, 113259721, 113269293, 113245213, 113234079, 113246942, 113229620, 113200343, 113179660, 113165236, 113164639, 113162553, 113169754, 113183248, 113188243, 113205707, 113214135, 113192773, 113181698, 113193476, 113208675, 113217950, 113205111, 113167012, 113140488, 113137674, 113145185, 113160288, 113173985, 113177729, 113179541, 113181043, 113172698, 113157535, 113149095, 113148379, 113140845, 113124311, 113124752, 113145554]
3938.4A13145554J2374j6403k6727n150J8752K1732J597j0681j2422j4066j574J9884
3962.9A13132870K1577p272k0015J0061L2747J240k5475K98O699j6558j8513o795l791
3989.4A13107073o807j096O878J2934
3997.5A13118982
$$ y = [113145554, 113157928, 113141525, 113114798, 113109648, 113128400, 113150132, 113151729, 113141048, 113128626, 113114560, 113112986, 113132870, 113154447, 113147175, 113127160, 113137221, 113169968, 113171208, 113145733, 113146031, 113152730, 113136172, 113117659, 113110864, 113107073, 113100266, 113099170, 113106048, 113118982]
##END=$$ End of the data block
