##TITLE=$$ Begin of the data block
##JCAMP-DX=5.00 $$ ACD/SpecManager v 10.08
##SPECTROMETER/DATA SYSTEM=Varian
##DATE=30 Apr 2013 08:52:04
##DATA TYPE=INFRARED SPECTRUM
##DATA CLASS=XYDATA
##ORIGIN=
##OWNER=
##NPOINTS=3735
##FIRSTX=399.26403809
##LASTX=4000.35498047
##MAXX=4000.35498047
##MINX=399.26403809
##MAXY=100.30030823
##MINY=0.00000100
##XFACTOR=1.0000000000
##YFACTOR=0.000001000000000
##FIRSTY=0.00000100
##DELTAX=0.96440572
##XUNITS=1/CM
##YUNITS=TRANSMITTANCE
##XYDATA=(X++(Y..Y))
399.3AV8J4713210%S3O5752480J9834617j3069145J038712m128075n164665N383163
464.8H4360298J547119L833481k337471J447708q754326k931190K090629k70240M065529
473.5H3051537M32502J466278m580703K953407J742294N92957O01661k795745K799888
482.2H6264076m674080R85848n2101r68651J061401j364990L558289m74709Q3450p08580
491.8H3709953O71173o71905j163925J710754k942856j25580l25653Q63785P50473
500.5H2476219l85933K305931j402107o32614p92244K98927k7626l83339m03114r04419
510.2H0149681J032753j31103Q62754O4728l48495k06307r82353M16580o86210O14128
519.8H0786156J09459L11393K82776o80542K00684l74832J26297n42382Q5289J89431
$$ plain form
399.3 1 1 1 1 1 1 1 1 1 1 1 1 1 1 1 1 1 1 1 1 1 1 1 1 1 1 1 1 1 1 1 1 1 1 1 1 1 1 1 1 1 1 1 1 1 1 1 1 14713211 14713211 14713211 14713211 14713211 14713211 14713211 14713211 14713211 14713211 14713211 14713211 14713211 14713211 80465691 100300308 87231163 88269875 84141800 78977135 84360298
464.8 84360298 85907417 89740898 87403427 88851135 80096809 77165619 79256248 78986008 83051537
473.5 83051537 83484039 84950317 80369614 83323021 85065315 85658272 86259933 83464188 86264076
482.2 86264076 81589996 82575844 82523743 81555092 82616493 81251503 84809792 84335083 84418533 83709953
491.8 83709953 84381126 83709221 82545296 84256050 81313194 81187614 80861961 81725746 82476219
500.5 82476219 82090286 84396217 82994110 82361496 81569252 81868179 81840553 81457214 81054100 80149681
510.2 80149681 81182434 81051331 81914085 81978813 81630318 81424011 80441658 80858238 80172028 80786156
519.8 80786156 80895615 81207008 81489784 80809242 81009926 80635094 80761391 80219009 80304298 80493729
529.5H0493729j35483K87124n29121m0489p5234M03962m14254n99830J48613L9245
539.1G9578262Q72567J17721L10654Q1322k17919K1591n2086L17353l60504J98928
548.7H0867889l17382l06351o6872m17503O1142l55118o409j98600K17071J99593p3883
559.4G9603577N27084o6238k45l3615M15429L04519p0427k9419j93268J70487j77971
570H0449913J63605R3841K98340L15430j98303q0407M2733N63186j61979O1470L6537
580.6H1584366k47887K78954k7596K59560r0714J80748P9254R2713K77206l81164P2555
591.2H2077995L1502L34862j152r3315J58203r3735L12019j15806J14509m9865m7173
601.8H2628044J21079k50626K09480N8190Q0864J6685m2862P0145K47909m9766l09738
$$ plain form
529.5 80493729 80358246 80645370 80116249 80075760 80000526 80404488 79990234 79390404 79539017 79578262
539.1 79578262 80450829 80568550 80879204 80960526 80742607 80764198 80712112 81029465 80668961 80867889
548.7 80867889 80550507 80244156 80177284 79759781 79820923 79465805 79459396 79260796 79477867 79677460 79603577
559.4 79603577 80130661 80064423 80064178 80030563 80445992 80750511 80680084 80650665 80457397 80627884 80449913
570 80449913 80613518 80707359 81005699 81321129 81122826 81042419 81085152 81648338 81486359 81547829 81584366
580.6 81584366 81336479 81615433 81587837 81847397 81756683 81937431 82016685 82109398 82386604 82005440 82077995
591.2 82077995 82109497 82444359 82443207 82349892 82508095 82414360 82726379 82610573 82725082 82675217 82628044
601.8 82628044 82749123 82498497 82707977 82766167 82847031 82863716 82820854 82890999 83138908 83089142 82779404
612.4H2779404K59201m9790O7009k14912k69318J59485L7445r170k60002J48323k8786
623H2618889J14433k38273m84940P2449l34122Q0635j05217k29095l26409l79120k29255
633.6H0559975o09482k46956p03117j001564j771073k367500j863670l20763J535965
642.3G3211815J374206Q98049K72957J40007L48228j9623p2700k96326K21436J43356
651.9G6221405J70128K26066p2258L5080j68678J31600p7416O1760R9724o87K59606
662.5G6886330J42730L94722o225r7801n80338j660301J633423Q54568L35381N3154
672.2G7955643M25163J31920Q8959J83075O385K82517o9870m4594k4498L53683K64267
682.8G9552650n1307K14538K8763K68593P263J01486K24709J29051J59767j51046J46926
$$ plain form
612.4 82779404 83038605 82988815 83055824 82840912 82571594 82731079 82768524 82759354 82499352 82647675 82618889
623 82618889 82733322 82495049 82010109 82082558 81748436 81829071 81723854 81494759 81168350 80789230 80559975
633.6 80559975 79950493 79703537 79000420 77998856 76227783 73860283 71996613 71675850 73211815
642.3 73211815 74586021 75484070 75757027 75897034 76245262 76225639 76152939 75856613 76078049 76221405
651.9 76221405 76391533 76617599 76545341 76580421 76411743 76543343 76465927 76527687 76627411 76626724 76886330
662.5 76886330 77029060 77423782 77417557 77319756 76739418 75079117 76712540 77567108 77902489 77955643
672.2 77955643 78380806 78512726 78601685 78784760 78791145 79073662 79003792 78959198 78934700 79288383 79552650
682.8 79552650 79501343 79715881 79744644 80013237 80020500 80121986 80346695 80475746 80635513 80484467 80631393
693.4H0631393m3373m585J82983J17447j52572j62110K66587k0142M0093j67595q782
704H0679344K28142p3967J5419m5486Q3175j89865n7411j46988l58505l58589r49219
714.6G8826050j235695k447441m029625n518166m129516O26999L379371K743004J445351
723.3F9660332R03526N95642K43164m01283j407936j884239j024277K006103L863861
732G2554893L307221K184624J211013Q11547L69888J01883k75948l72894k63725L53813
741.6G9982315Q51036M82666M93256J01486J51573K53723L8254Q7479m5403k7054k88910
752.2H2080421K90J32515K04811K47872j28617M6082o027K6436j13358k08458l08922
762.8H1973045m01016k09640j66901J968n33348o35009j33103M81743O12137P9300
$$ plain form
693.4 80631393 80588020 80583435 80766418 80883865 80731293 80569183 80835770 80815628 80855721 80688126 80679344
704 80679344 80907486 80833519 80848938 80803452 80886627 80696762 80639351 80492363 80133858 79775269 78826050
714.6 78826050 77590355 75142914 71113289 65595123 61465607 62092606 65471977 68214981 69660332
723.3 69660332 70563858 71159500 71402664 71001381 69593445 67709206 66684929 68691032 72554893
732 72554893 75862114 78046738 79257751 80069298 80439186 80541069 80265121 79892227 79628502 79982315
741.6 79982315 80833351 81316017 81809273 81910759 82062332 82316055 82354309 82441788 82396385 82369331 82080421
752.2 82080421 82080711 82213226 82418037 82665909 82537292 82583374 82577347 82603783 82490425 82281967 81973045
762.8 81973045 81572029 81362389 81195488 81197456 80664108 80029099 79895996 80377739 80989876 81069176
772.5H1069176Q3671j61239j90270k76092l23204m31168o61430n02335p76390o55960
782.1G7174759q26569q73314r18197j249207j020889r97803r91112j192375j232040
790.8F7873253j312035j168518r99412j060646j011486j184166q34233q08525o66256
799.5E8827976m91489n83660j24279J7749M746J19541L49060M21593M49665M69143
809.1E9460045N01533N92656K83271K39891K14539M05975N23190K68123L19218J51383
818.8F2959824J83849J66531J92398L59180L23193K72270K05185K30423p8530M2336
828.4F4856659L1601l40721l01346l59036n49877r26040j167492j439205j462433k022374
838.1E6319736k528179k180618j893284j141796n90519R518M82086Q89179J120945
$$ plain form
772.5 81069176 81152847 80991608 80801338 80525246 80202042 79770874 79109444 78607109 77830719 77174759
782.1 77174759 76348190 75474876 74556679 73307472 72286583 71288780 70297668 69105293 67873253
790.8 67873253 66561218 65392700 64393288 63332642 62321156 61136990 60302757 59494232 58827976
799.5 58827976 58336487 57752827 57628548 57646297 57651043 57770584 58119644 58541237 58990902 59460045
809.1 59460045 59961578 60554234 60837505 61077396 61291935 61697910 62221100 62489223 62808441 62959824
818.8 62959824 63143673 63310204 63502602 63861782 64184975 64457245 64662430 64892853 64814323 64856659
828.4 64856659 64888260 64547539 64246193 63887157 63337280 62411240 61243748 59804543 58342110 56319736
838.1 56319736 53791557 51610939 49717655 48575859 47985340 47994858 48476944 49366123 50487068
846.8E0487068J097649J386871J162525R74869Q67848Q87008Q02998M14188O34831
855.4E8715855N37792M91825L81466J64841J31221r8426J11000L55522N61626L83858
865.1F1736580K30148L50651M94308N20375J00574J57078L6884k1816Q1017o7292j7471
875.7F3601036J4801K08061Q9348J17302K38281L23937L75801L10600L93952K14378
885.3F5887497M20196L59437L40072L24677l40508j041588j427696o1203J141441J233277
895F6835602R04602L18077L07449J34575Q7197l2914j24382k22442k50336J3710j78818
905.6F7792320j13334j58242j44256j43395k25357j51451j99333k8908j87370k69875
915.2F6170799m55085n34607m56063m31556j31257j64165k8870j33953k57717k42935
$$ plain form
846.8 50487068 51584717 52971588 54134113 55108982 55976830 56863838 57666836 58081024 58715855
855.4 58715855 59253647 59745472 60126938 60291779 60423000 60324574 60435574 60791096 61352722 61736580
865.1 61736580 61966728 62317379 62811687 63332062 63432636 63589714 63626598 63604782 63685799 63618507 63601036
875.7 63601036 63615837 63823898 63913246 64030548 64268829 64592766 64968567 65279167 65673119 65887497
885.3 65887497 66307693 66667130 67007202 67331879 66991371 65949783 64522087 64460884 65602325 66835602
895 66835602 67740204 68058281 68365730 68500305 68587502 68554588 68430206 68207764 67957428 67971138 67792320
905.6 67792320 67678986 67520744 67376488 67233093 67007736 66856285 66656952 66628044 66440674 66170799
915.2 66170799 65715714 65181107 64725044 64293488 64162231 63998066 63969196 63835243 63577526 63334591
924.9F3334591k95647k62592m32007k51705l91640m63634m74667o41342n43999o01242
934.5E8976116n79731o86649o60515p17373p40787p17400p43141n53681o14925n42015
944.2E2419899m13296j18313O8165O3530J97457K02739K67437K72011L73684L93364
953.8E3726677L16395L23097M39556N62382L38131L73173K72815P4188K5250j92081
963.4E6259583j07224K19582Q75537J392960J608231J656444J435272J229584R66225
972.1F5536194P89879M84268L65532L10760J45951R3689k49810j16188m8362j60256
981.8F7151657k17384k97371j88019l12927k95563l30421l38120l78700l10143k10243
991.4F4272766k99271j88011l04382k03472j15929j36707k00211k89268j55766l48789
$$ plain form
924.9 63334591 63038944 62776352 62344345 62092640 61701000 61237366 60762699 60121357 59577358 58976116
934.5 58976116 58396385 57709736 57049221 56331848 55591061 54873661 54130520 53576839 52961914 52419899
944.2 52419899 52006603 51888290 51956455 52019985 52217442 52420181 52687618 52959629 53333313 53726677
953.8 53726677 54043072 54366169 54805725 55368107 55706238 56079411 56352226 56426414 56451664 56259583
963.4 56259583 56152359 56371941 57247478 58640438 60248669 61905113 63340385 64569969 65536194
972.1 65536194 66326073 66810341 67175873 67486633 67632584 67726273 67476463 67360275 67311913 67151657
981.8 67151657 66934273 66636902 66448883 66135956 65840393 65509972 65171852 64793152 64483009 64272766
991.4 64272766 63973495 63785484 63481102 63277630 63161701 63024994 62824783 62535515 62379749 62030960
1001.1F2030960l65070l73856m52034n22732m89318m30085o53274o06049o52206o88427
1010.7E6797909p99870q06988o76399p55039p64023p09610m53052m08844m09157m88094
1020.3E0526833l95676k35691m04396l77499m37111l84807l04810k36744k92507l36601
1030D7120991k61791k56451k7958j72676j41407p5836j57158j48419k60654m5441m8340
1040.6D5524860j60251k72503j54106j42754k04292K83241N03742M37989l0583k28210
1050.2D5557133j56803j82816j56738l93914m59926q39745j052559j202201j372597
1058.9C9739834j266392r30820o0406M19403P17461N75958M06826J53953j18324j17813
1068.6C9519680k91580k0687j09158k02659l21015n06252n22270p28577n88604p55592
$$ plain form
1001.1 62030960 61665890 61292034 60840000 60317268 59827950 59397865 58744591 58138542 57486336 56797909
1010.7 56797909 55998039 55191051 54514652 53759613 52995590 52285980 51832928 51424084 51014927 50526833
1020.3 50526833 50131157 49895466 49491070 49113571 48676460 48291653 47986843 47750099 47457592 47120991
1030 47120991 46859200 46602749 46574791 46402115 46260708 46184872 46027714 45879295 45618641 45573200 45524860
1040.6 45524860 45364609 45092106 44938000 44795246 44590954 44874195 45377937 45815926 45785343 45557133
1050.2 45557133 45400330 45217514 45060776 44666862 44206936 43367191 42314632 41112431 39739834
1058.9 39739834 38473442 37542622 37482216 37901619 38619080 39195038 39601864 39755817 39637493 39519680
1068.6 39519680 39228100 39207413 39098255 38895596 38574581 38068329 37546059 36817482 36228878 35473286
1078.2C5473286p24198q72131p92946o12465q39430p65392q71862o04592q59854p34724
1087.9B7795692n55484o52918l91785o20277m58748o11393l91649m42820n90443m40637
1097.5B2639538o42195l28468n43356m28375n76428n51485l62696n58506l78671o18170
1107.1A7651188l79231n06557k76442j81385l23269q5191k07428K72624J50758M12464
1116.8A6527531M52757M31219O92054M70801P70588N51573P02318O19934N40478O75464
1126.4B2434717M97339N80262L07163N74407M45786L61231L44713J55979L06011k3061
1136.1B5984547J59923M9431l9736j04805k30798j53233l54683j18063k85408j57869
1145.7B4749306j48745P776M33461O06411J217020J303030J547695J472288J374849
$$ plain form
1078.2 35473286 34749088 33876957 33084011 32471546 31632116 30866724 29994862 29390270 28530416 27795692
1087.9 27795692 27240208 26587290 26195505 25575228 25116480 24505087 24113438 23670618 23080175 22639538
1097.5 22639538 21997343 21668875 21125519 20697144 20120716 19569231 19206535 18648029 18269358 17651188
1107.1 17651188 17271957 16765400 16488958 16307573 15984304 15899113 15691685 15964309 16115067 16527531
1116.8 16527531 16980288 17411507 18103561 18574362 19344950 19896523 20598841 21218775 21759253 22434717
1126.4 22434717 22932056 23512318 23819481 24393888 24839674 25200905 25545618 25701597 26007608 25984547
1136.1 25984547 26144470 26193901 26154165 26049360 25818562 25665329 25310646 25192583 24907175 24749306
1145.7 24749306 24600561 24608337 25041798 25648209 26865229 28168259 29715954 31188242 32563091
1154.4C2563091J471703J380977J420460J231011J443332J559361J589672J510475
1162.1D4170082J240868J169819R43210Q72078O70910M82700N04387L79113L02146
1170.8E0735313K51881L32188J85089J34682K04643J37356J39038O9332K32631L83759
1180.4E2805912N82996O47458O26403O11683L01781Q6277k02488j79691n9178J43185
1190.1E5364338O52279P78137R03912Q82965Q00644P66788N90046M98924L42106L58540
1199.7F1938679J22543m4105n5237l52520m65145l78827J28399N75833P26043N64248
1209.4F2759911L37024K30789l6396j2065O7516J71429O7390j12602j99414m89654
1219F2783928o09074p72381o01974l54149j97708j71352l80482n30911o77021m78603
$$ plain form
1154.4 32563091 34034794 35415771 36836231 38067242 39510574 41069935 42659607 44170082
1162.1 44170082 45410950 46580769 47523979 48396057 49066967 49549667 50054054 50433167 50735313
1170.8 50735313 50987194 51319382 51504471 51639153 51843796 51981152 52120190 52189522 52422153 52805912
1180.4 52805912 53388908 54036366 54662769 55274452 55576233 55662510 55460022 55280331 55221153 55364338
1190.1 55364338 56016617 56794754 57698666 58581631 59382275 60149063 60739109 61238033 61580139 61938679
1199.7 61938679 62061222 62017117 61961880 61609360 61144215 60765388 60893787 61469620 62195663 62759911
1209.4 62759911 63096935 63327724 63291328 63279263 63346779 63518208 63585598 63472996 63273582 62783928
1219 62783928 62174854 61402473 60800499 60446350 60248642 60077290 59696808 59165897 58488876 58010273
1228.6E8010273m63036q22765j319256j411430j031456n26035j03207l19725p37106
1237.3E1276257j151261j364639j562344j378372o47888J32114P11785O40072M76760
1246D7132484K99237L47275L76529K71824K11094k02732n17998o97883o09059m83173
1255.7D6127598l25173k58003l60290k12799k19037J32344M43733Q60985J140167J098976
1265.3D8428501J073792O43238K47490j08529k11242j94245l91494n33547q26118r82300
1274.9D7145546j365749j685093j903229j726074j075013n58353K91050P07260J120869
1283.6D0951214J109955J105739J165436J029629J144554R14524Q43025O31748M78821
1292.3D9374645L82496J22051J10669O2168J72096L8231J1043J3173l8071J63044K08042
$$ plain form
1228.6 58010273 57547237 56724472 55405216 53993786 52962330 52436295 52333088 52013363 51276257
1237.3 51276257 50124996 48760357 47198013 45819641 45171753 45303867 46015652 46655724 47132484
1246 47132484 47431721 47778996 48155525 48427349 48638443 48435711 47917713 47219830 46610771 46127598
1255.7 46127598 45802425 45544422 45184132 44971333 44752296 44884640 45328373 46189358 47329525 48428501
1265.3 48428501 49502293 50145531 50393021 50284492 50073250 49879005 49487511 48953964 48127846 47145546
1274.9 47145546 45779797 44094704 42191475 40465401 39390388 38832035 39123085 39830345 40951214
1283.6 40951214 42061169 43166908 44332344 45361973 46506527 47421051 48264076 48895824 49374645
1292.3 49374645 49757141 49879192 49989861 50052029 50224125 50262356 50273399 50286572 50248501 50411545 50619587
1302.9E0619587L90358L24554L81611L97251L34999M01246L59634N88020O97563R86573
1312.5E5481396J059597R67254R29261O95831P56882O31363N71270M47254P8903m6555
1322.2F1572456j70532k6565N2955J58379K76691K92691L80954K78477L56468L59009
1331.8F3530983L84243L61507K36260K00371k18613l50960o86111j100769k089005
1340.5F0267906k997028l414089m219445l275444j080963R89102J420475J082748R54483
1349.2D9727745R73522Q79799P32643O59008L65948J53244k90913r69905j573315j554398
1358.8D9103378n16807Q33908J947403J919815K833664J891632J400776J319362Q45353
1367.5F1578484P27058O52809O40236M53369L82904K56317J11672L24409K04804J33323
$$ plain form
1302.9 50619587 51009945 51334499 51716110 52113361 52448360 52849606 53209240 53797260 54494823 55481396
1312.5 55481396 56540993 57508247 58437508 59133339 59890221 60521584 61092854 61540108 61619011 61572456
1322.2 61572456 61401924 61375359 61428314 61586693 61863384 62156075 62537029 62815506 63171974 63530983
1331.8 63530983 63915226 64276733 64512993 64713364 64494751 64143791 63457680 62356911 60267906
1340.5 60267906 57270878 53856789 49637344 46361900 45280937 46270039 47690514 48773262 49727745
1349.2 49727745 50701267 51581066 52313709 52972717 53338665 53491909 53200996 52231091 50657776 49103378
1358.8 49103378 48586571 49420479 51367882 53287697 56121361 58012993 59413769 60733131 61578484
1367.5 61578484 62305542 62958351 63598587 64051956 64434860 64691177 64802849 65127258 65332062 65465385
1377.2F5465385N1476J32599J79329J53404K58408J55090J78505Q2710L525N3940m7608
1387.8F6666763J79985J12030J90133J69860Q8036J83342L3134J03981n851n310j10787
1398.4F7605316n30754o43211q68515j157006j325298o71436L93917Q91651P03896
1407.1F4398560N93246N03235K40745P7660o26K877J0635q0826O8871L2791K13974
1417.7F6061142Q7898J48102N84503K97753L04901O8779j3306l2021k9075j88805l54812
1428.3F6935059k66709j026748r91944q02677j191074j603325j547867r75666k18323
1437E8310726J00063K5548L5652j30589k65430j77445k06760m09119n83969n90820
1446.6E6107857q49556j067654l90579J33644J48567j99505l67111n20325m24484k56302
$$ plain form
1377.2 65465385 65516861 65649460 65828789 65982193 66240601 66395691 66574196 66656906 66660431 66714371 66666763
1387.8 66666763 66846748 66958778 67148911 67318771 67406807 67590149 67623283 67727264 67721413 67716103 67605316
1398.4 67605316 67074562 66431351 65562836 64405830 63080532 62409096 62803013 63694664 64398560
1407.1 64398560 64991806 65495041 65735786 65813446 65812820 65815697 65826332 65745506 65814377 65847168 66061142
1417.7 66061142 66149040 66297142 66881645 67179398 67484299 67553078 67539772 67507751 67478676 67289871 66935059
1428.3 66935059 66668350 65641602 64649658 63846981 62655907 61052582 59504715 58529049 58310726
1437 58310726 58410789 58436337 58471989 58341400 58075970 57898525 57691765 57282646 56698677 56107857
1446.6 56107857 55258301 54190647 53800068 53933712 54082279 53882774 53515663 52995338 52570854 52314552
1456.2E2314552J23169o57417j646366k262093k844013l224411j884228r77180q72242
1464.9C8069771l03318n49397M02878K32426M45778k45125k068459j356128M665664
1473.6C9294090O306912K418594M834126L792698J825363J849727J054905J456806
1481.3F2833221Q37948R35665M70742M62089M40804L7544P78862K182N55496P35840
1491F8090393R69017Q40675O06736P01454Q5335O55296L89183L53950K01096K27791
1500.6G3120926L17909P1518L25920J09230L33130n19569j508698O38466J33797K96013
1510.2G3318642L4607n845k71575m2038q1559k19322j11564p09382K5750m349k93923
1520.8G1639442o54708m84353k60101l22601m45175m16108j19583l46420m07539k78107
$$ plain form
1456.2 52314552 52437721 51780304 50133938 47871845 45027832 41803421 39919193 38942013 38069771
1464.9 38069771 37766453 37217056 37619934 37852360 38298138 38053013 35984554 34628426 39294090
1473.6 39294090 45601002 48019596 52853722 56646420 58471783 60321510 61376415 62833221
1481.3 62833221 63671169 64606834 65077576 65539665 65980469 66018013 66796875 66799057 67354553 68090393
1491 68090393 69059410 69900085 70506821 71208275 71293610 71948906 72338089 72692039 72893135 73120926
1500.6 73120926 73438835 73510353 73836273 73945503 74278633 73759064 72250366 72888832 73022629 73318642
1510.2 73318642 73353249 73347404 73075829 73033791 72952232 72732910 72621346 71911964 71937714 71933365 71639442
1520.8 71639442 70984734 70500381 70240280 69917679 69472504 69056396 68936813 68590393 68182854 67904747
1530.5F7904747l90266l76603m83009k43179j03180j2535P3654k34169j276093Q25043
1540.1F5684410J962013Q59658J078491N96237L41370N24849L77334L31612K14432
1548.8G1970406n7770l66745K5665k0180m7523o87271m88640R5985K01645M56642j781395
1559.4F9300819j330398n36728l36945m55917m34441o55105p74628m53361m78459k87010
1569.1F3557827r03717n04097l87814m39048k59991l52997j68983J57058K35718K5307
1578.7F0959263j7430O6575L3046J54469J73153L03806K82768K33593L49717L32649
1588.4F2871609L93451K62654K67944K44412J09207J73088J1795L8299r4909p9285
1598F4198265j59286k68517k56546m02267l34828n78056n15263n80551n20061n68024
$$ plain form
1530.5 67904747 67514481 67137878 66654869 66411690 66308510 66295975 66369629 66135460 64859367 65684410
1540.1 65684410 67646423 68506081 69584572 70180809 70522179 71047028 71424362 71755974 71970406
1548.8 71970406 71912636 71545891 71571556 71551376 71503853 70816582 70327942 70423927 70625572 71082214 69300819
1559.4 69300819 67970421 67433693 67096748 66640831 66206390 65551285 64776657 64323296 63844837 63557827
1569.1 63557827 62654110 62150013 61762199 61323151 61063160 60710163 60541180 60698238 60933956 60959263
1578.7 60959263 60941833 61008408 61041454 61195923 61369076 61672882 61955650 62189243 62538960 62871609
1588.4 62871609 63265060 63527714 63795658 64040070 64149277 64322365 64334160 64372459 64277550 64198265
1598 64198265 64038979 63770462 63513916 63111649 62776821 62198765 61683502 61102951 60582890 60014866
1607.6F0014866n58880l49155l89061o2855l34328m37134o50833o60637n25764j728993
1617.3E4317226o29161q97141o72241p69516l70396p3215M27913M70288J50345M68971
1626.9E2423073P93300J439133Q28373R00395R25598P85438O05927O6063K52060J646053
1636.6F0665413J022007P22111O41082M16737M85249L99345L38730L37143J31561O6780
1646.2F5226158j5694P99355N41168L76892K51847L4301j904083M1763K668915O37505
1655.9F8658127L71200J69106K18018K76527J05278J67496k12242L1112J30676J34400
1665.5G0049698K3033M005J08788p32246j90125k46742m00665k51931j2993k05192
1675.1F8145630j263580k87812l41522l71269n37407r70429n45421p7774P05868k572533
$$ plain form
1607.6 60014866 59455986 59106831 58717770 58654915 58320587 57883453 57232620 56571983 56046219 54317226
1617.3 54317226 53688065 52790924 52118683 51349167 50978771 50905556 51333469 51803757 51954102 52423073
1626.9 52423073 53216373 54655506 55483879 56384274 57309872 58095310 58701237 58767300 59019360 60665413
1636.6 60665413 61687420 62409531 63050613 63467350 63952599 64351944 64690674 65027817 65159378 65226158
1646.2 65226158 65210464 66009819 66550987 66927879 67179726 67214027 65309944 65351707 68020622 68658127
1655.9 68658127 69029327 69198433 69416451 69692978 69798256 69965752 69753510 69784622 69915298 70049698
1665.5 70049698 70072731 70076736 70185524 69453278 69263153 69016411 68615746 68363815 68350822 68145630
1675.1 68145630 66882050 66594238 66252716 65881447 65344040 64373611 63828190 63750416 64456284 61883751
1684.8F1883751k447102j128807j161220j370358j220131j039791o45374m69483k1640
1693.5E2379845j29582k37114J373135J199306M26411m1138j92234L03887K45369q6785
1703.1E5241100k14546k99637n09491q37059j013363q22189j105125j242802j087986
1711.8D8108902r60827p24026n56282K54158j54346K80739J299061L60054J64402n5439
1721.4D8016396o245k92698k45510l65685n40294p11399j078179q95054j243961p83409
1731.1D1853962p98370j014786k03789M71657P2269n02571R9697j40857P89146J763519
1740.7D2389877K55761O16394J195400J873894R21138J326439J419800J701248K587712
1749.4E4287663J142215K065472K420841J653332J283516J191181Q95699R62059J422546
$$ plain form
1684.8 61883751 59436649 58307842 57146622 55776264 54556133 53516342 52870968 52401485 52379845
1693.5 52379845 52250263 52013149 53386284 54585590 55012001 54970863 54778629 55082516 55327885 55241100
1703.1 55241100 55026554 54726917 54217426 53380367 52367004 51544815 50439690 49196888 48108902
1711.8 48108902 47148075 46424049 45867767 46121925 45967579 46248318 47547379 47907433 48071835 48016396
1721.4 48016396 48010151 47717453 47471943 47106258 46565964 45854565 44776386 43881332 42637371 41853962
1731.1 41853962 41055592 40040806 39837017 40308674 40380943 39878372 39978069 39837212 40626358 42389877
1740.7 42389877 42645638 43262032 44457432 46331326 47252464 48578903 49998703 51699951 54287663
1749.4 54287663 55429878 57495350 59916191 61569523 62853039 64044220 64939919 65901978 67324524
1758.1F7324524Q27919Q42903M14024O20102R54590N76943N81848M36378M85085K25967
1767.7G3290283L47710M47708L45787M8973r2018N69031L82477L09745Q1284K26128
1777.4G5957108N8151P5432J90887L3897K68319J03592R3330L296P7507J55258N2292
1788G7069069P4913J175R4696J1337K5803P0198J55838J19636k2873J59920L6972l2203
1799.5G7764481p3410Q9843M4594j3077J31470k7756P3433N0072O889M9652j6372j3619
1811.1G8066200P6615J30447m1840L8681L7850P4890L2288p5867P1556l7575p93r8694
1822.7G8273758L6079J29547k17659R2171J21163R8861j04423j96404J47476Q1582
1832.3G8462151M5234q621L4279j8936k4887p233L3348K9816k3377M517m4716j23238
$$ plain form
1758.1 67324524 68152443 68995346 69409370 70029472 70984062 71561005 72142853 72579231 73064316 73290283
1767.7 73290283 73637993 74085701 74431488 74480461 74388443 74957474 75339951 75649696 75730980 75957108
1777.4 75957108 76015259 76090691 76281578 76315475 76583794 76687386 76780716 76784012 76861519 77016777 77069069
1788 77069069 77143982 77145157 77239853 77251190 77276993 77347191 77503029 77622665 77599792 77759712 77796684 77764481
1799.5 77764481 77691071 77780914 77825508 77812431 77943901 77916145 77989578 78039650 78046539 78096191 78079819 78066200
1811.1 78066200 78142815 78273262 78231422 78270103 78307953 78382843 78415131 78339264 78410820 78373245 78372452 78273758
1822.7 78273758 78309837 78439384 78221725 78313896 78435059 78533920 78429497 78233093 78380569 78462151
1832.3 78462151 78507385 78498764 78533043 78514107 78489220 78481987 78515335 78545151 78521774 78526291 78481575 78358337
1843.9G8358337k92930K25662J98311n0385m3708j5641O1676l8200r445j1032m7470
1854.5G8335175j564m9798N959q9149j1284L1036n676k7245n3924J4824m6929P6058
1866.1G8177483k4170j41602j30165o5727J22673l952M6730p301m8188n8906j02455
1876.7G7764420n0911m4999N3276m2472j1330m7104j03989j3504p8781l0563n1399
1887.3G7342644l319j07292j84342j6571o5109o0791n1102L5073p2892n9715j0666
1897.9G6745918k5909N4176m5578n2086l7109L0670n5466q3534L6476q5975m5906k2858
1909.5G6412819p385K693j0338n4520m8263K0691j12175l9192j16707p1015P5745k9724
1921.1G6022629n3932j75988n1933j312m6562m2443p1319n5077p4715o9847j21215
$$ plain form
1843.9 78358337 78065407 78291069 78489380 78438995 78395287 78379646 78441322 78403122 78393677 78382645 78335175
1854.5 78335175 78333611 78283813 78289772 78200623 78189339 78220375 78214699 78187454 78133530 78148354 78101425 78177483
1866.1 78177483 78153313 78011711 77881546 77815819 77938492 77934540 77981270 77973969 77925781 77866875 77764420
1876.7 77764420 77713509 77668510 77721786 77679314 77667984 77620880 77516891 77503387 77424606 77394043 77342644
1887.3 77342644 77339325 77232033 77047691 77031120 76966011 76905220 76854118 76889191 76816299 76756584 76745918
1897.9 76745918 76720009 76774185 76728607 76676521 76639412 76670082 76614616 76531082 76567558 76481583 76435677 76412819
1909.5 76412819 76405434 76408127 76397789 76343269 76295006 76315697 76203522 76164330 76047623 75976608 76052353 76022629
1921.1 76022629 75968697 75792709 75740776 75739464 75692902 75650459 75579140 75524063 75449348 75379501 75258286
1931.7G5258286l4935l7308o3957o9107j35170n1171p8766n5305j22414n4214o974
1942.3G4548965k07847j091J709k7489n8685o3568m6234n9014j434p1411k5643k3864
1953.8G3964394l9505j8616J6060J4473o9664O401k7130k877K8397j8700k5558l4378
1965.4G3793297j8059l0724R0157J4046Q08M8302j6098j4313n6816J0926J8661K1462
1977G3861649l5744o2233K6817k7786P843L9070O8199k1980l4737N7671R99K6200j4099
1989.5G3891869K7595L9314J5046K4902j68M7836L4134P3197O401j22P5500N3497l738
2002.1G4285263m3945O5750M1359K8412J1863K0035R2468M1443L1479m7905l2158J8868
2013.6G4512932L7079J2710q1756o8787l6217K9579K8580L2845j4786k411M5830m2465
$$ plain form
1931.7 75258286 75223351 75186043 75122086 75052979 74917809 74866638 74787872 74732567 74610153 74555939 74548965
1942.3 74548965 74341118 74340027 74341736 74314247 74255562 74191994 74145760 74086746 74085312 74013901 73988258 73964394
1953.8 73964394 73924889 73906273 73922333 73936806 73867142 73873543 73846413 73843536 73871933 73853233 73827675 73793297
1965.4 73793297 73775238 73744514 73834671 73848717 73849525 73897827 73881729 73867416 73810600 73821526 73840187 73861649
1977 73861649 73825905 73763672 73790489 73762703 73770546 73809616 73877815 73855835 73821098 73878769 73879768 73905968 73891869
1989.5 73891869 73919464 73958778 73973824 73998726 73998558 74046394 74080528 74153725 74160126 74160004 74235504 74289001 74285263
2002.1 74285263 74241318 74307068 74348427 74376839 74388702 74408737 74501205 74542648 74574127 74526222 74494064 74512932
2013.6 74512932 74550011 74562721 74480965 74412178 74375961 74405540 74434120 74466965 74452179 74449768 74495598 74453133
2025.2G4453133l1182p8598j37K3361n9212m3159n3543k4582r6344n0697j5824k7946
2036.8G3995270k2537r4674r9716j50314j04195o4789o6574j23253j36116j05613k00791
2047.4G2826698j28997j52436j66221j58768k22298k01195k39135k09214k53715k34299
2057G0860420k12082k55546k46483k98973k70958k88429k34551k84546m14169l34038
2066.7F8020645l32031l25752l36365l22624l44490l91816l98254m31740l86566m27521
2076.3F4323486m67895n12692n26573n16895n97717n85000o11312n98565o23634o52901
2086E8630302n79010n73688n08938n47729n63118n18101m62818l96717m52614m04949
2095.6E3622620l52459k68128k65960k70981j88958j96140j18648p9987l2444k8461
$$ plain form
2025.2 74453133 74421951 74343353 74343216 74366577 74307365 74264206 74210663 74186081 74089737 74039040 74023216 73995270
2036.8 73995270 73972733 73878059 73778343 73628029 73523834 73459045 73392471 73269218 73133102 73027489 72826698
2047.4 72826698 72697701 72545265 72379044 72220276 71997978 71796783 71557648 71348434 71094719 70860420
2057 70860420 70648338 70392792 70146309 69847336 69576378 69287949 69053398 68768852 68354683 68020645
2066.7 68020645 67688614 67362862 67026497 66703873 66359383 65967567 65569313 65137573 64751007 64323486
2076.3 64323486 63855591 63342899 62816326 62299431 61701714 61116714 60505402 59906837 59283203 58630302
2086 58630302 58051292 57477604 56968666 56420937 55857819 55339718 54876900 54480183 54027569 53622620
2095.6 53622620 53270161 53002033 52736073 52465092 52276134 52079994 51961346 51881359 51848915 51820454
2105.2E1820454K132O6731O3407R7447J09753J50291J09173J91269K75612L06541L93951
2115.9E3586761L91156M61117M73751M82296M92645N47310N11406M10827M79077M76421
2125.5E8312767M63348M09420L87574L86768M28108M61941M06090M04758L55767L75816
2135.1F2392357L60542L90110L77167L12653L61782L19465L14408K52037K59330K62215
2144.8F5602066K65320L42590K76268K53159K21481K56744K20002J68976K20520K38227
2154.4F8065353K33292J51115J87958J62232J49688J61194J68465K46429J80870J68633
2164.1F9875229J68419K19780J77658R7618J73172J82297J55716J02867J07376O5780
2173.7G1325912J04706J42273J15067Q9088l5507N9372Q3092P2151Q6754L4691M5852
$$ plain form
2105.2 51820454 51822586 51889317 51952724 52050171 52159924 52310215 52419388 52610657 52886269 53192810 53586761
2115.9 53586761 53977917 54439034 54912785 55395081 55887726 56435036 56946442 57357269 57836346 58312767
2125.5 58312767 58776115 59185535 59573109 59959877 60387985 60849926 61256016 61660774 62016541 62392357
2135.1 62392357 62752899 63143009 63520176 63832829 64194611 64514076 64828484 65080521 65339851 65602066
2144.8 65602066 65867386 66209976 66486244 66739403 66960884 67217628 67437630 67606606 67827126 68065353
2154.4 68065353 68298645 68449760 68637718 68799950 68949638 69110832 69279297 69525726 69706596 69875229
2164.1 69875229 70043648 70263428 70441086 70538704 70711876 70894173 71049889 71152756 71260132 71325912
2173.7 71325912 71430618 71572891 71687958 71777046 71741539 71800911 71884003 71956154 72042908 72077599 72123451
2184.3G2123451j7677L1326M7333M6265L4179L7644P0884N784K7900M860K5208K1484
2195.9G2458641K6253L3989m578L8155l4539J8837M0085p034J2222k0195K0722L7735
2207.5G2620293K6466j7334o56l510J2909M8775j0887k0531o9488j1040J1475j5786
2219G2570686j838j1902J7692l8444r064l2295m8271K685k5581k9366l8261L5957J8456
2231.6G2410454k2461l8635k7909L8132l998J5038J0383l692K350K2934M3914K098
2243.2G2448608k075j9462j3657k3521O424K1133K9152K4025k2087P942m1145M5707
2254.7G2461044N8861o2080j7998K3514J4457o7886l2707Q415R865K3422J7380O943
2266.3G2443230n6450J869n379P073K5329k678M731l4119K4147O416O554l4508m2206
$$ plain form
2184.3 72123451 72105774 72137100 72184433 72230698 72264877 72302521 72373405 72379189 72407089 72411949 72437157 72458641
2195.9 72458641 72484894 72518883 72514305 72552460 72517921 72536758 72576843 72569809 72582031 72561836 72582558 72620293
2207.5 72620293 72646759 72629425 72628769 72625259 72638168 72686943 72676056 72655525 72586037 72574997 72586472 72570686
2219 72570686 72568848 72556946 72574638 72536194 72527130 72494835 72446564 72449249 72423668 72394302 72356041 72391998 72410454
2231.6 72410454 72387993 72349358 72321449 72359581 72355583 72370621 72381004 72377312 72379662 72402596 72446510 72448608
2243.2 72448608 72446533 72427071 72413414 72389893 72396317 72417450 72446602 72470627 72448540 72456482 72415337 72461044
2254.7 72461044 72519905 72457825 72439827 72463341 72477798 72409912 72377205 72385620 72395485 72418907 72436287 72443230
2266.3 72443230 72386780 72388649 72383270 72390343 72415672 72412994 72417725 72383606 72407753 72414169 72420723 72386215 72344009
2278.8G2344009M3045M883J3367l510K7184J8623J7334J5564j4991L723p6783j1306
2290.4G2381142M310k3376p6584n5351K4276q4838k5208k7100k7816n5817n1727o432
2302G1975479k0416P9422j16478j18981p4913p2586m1793j18317K4208j22467o4957
2312.6G1328201J15J4786k4895k18132m3175j33347n3024j26381j50543k4246j26152
2323.2G0443207J7944k26295n7503K7374m1786q5205j45928K7558p1816J70159o0654
2333.8F9997055m6143j26853k87011R9991l3142J10771j36184j53191q9325L3279K55234
2344.4F9624481j5312K11624K16240M16115J76567k43950k56348m07905k43996j98105
2354.1F9279411j22535j63216k25044j65840k73957l1440j91460K67547L42835K06810
$$ plain form
2278.8 72344009 72387054 72391937 72405304 72401794 72428978 72447601 72464935 72480499 72465508 72469231 72392448 72381142
2290.4 72381142 72385452 72362076 72285492 72230141 72254417 72169579 72144371 72117271 72089455 72033638 71981911 71975479
2302 71975479 71955063 72034485 71918007 71799026 71724113 71651527 71609734 71491417 71515625 71393158 71328201
2312.6 71328201 71328316 71343102 71318207 71100075 71056900 70923553 70870529 70744148 70593605 70569359 70443207
2323.2 70443207 70461151 70234856 70177353 70204727 70162941 70077736 69931808 69959366 69887550 70057709 69997055
2333.8 69997055 69950912 69824059 69537048 69637039 69603897 69714668 69578484 69425293 69335968 69369247 69624481
2344.4 69624481 69609169 69820793 70037033 70453148 70629715 70385765 70129417 69721512 69477516 69279411
2354.1 69279411 69156876 68993660 68768616 68602776 68328819 68297379 68105919 68373466 68716301 68923111
2363.7F8923111L4721n9089L70910J77681J26435L3142K62443L10715J81046K54356
2373.3G0615471P6332Q6441J33957K12547Q8684R7435J69113P9087J28227J28235J73973
2383.9G1989502M7829J457O4606K6390L7185r903K6512l0502l7544N981j2397J869
2395.5G2110985M349K3498n0209L1876K2422j8493J945m7546J9745n0255l8002j9798
2407.1G1990517j7807L509l7117l158o997L6202k9495j4237m6814q4976M2679j5061
2418.7G1817245n119k9144k0332k6589m0253K2606k6466M555l5508J5069L2012j1001
2430.2G1697075k2217p4264K8801n013j8211j4931k8488n34j7525j793m7600j3038
2441.8G1482262j8479O951O340n4848m5784m5128J3435m8873j8784l2654r6649m7348
$$ plain form
2363.7 68923111 68957832 68898743 69269653 69447334 69573769 69606911 69869354 70180069 70361115 70615471
2373.3 70615471 70691803 70778244 70912201 71124748 71213432 71310867 71479980 71559067 71687294 71815529 71989502
2383.9 71989502 72037331 72038788 72103394 72129784 72166969 72157066 72183578 72153076 72115532 72121513 72109116 72110985
2395.5 72110985 72115334 72138832 72088623 72120499 72142921 72124428 72126373 72078827 72098572 72048317 72010315 71990517
2407.1 71990517 71972710 71976219 71939102 71935944 71928947 71965149 71935654 71921417 71874603 71789627 71832306 71817245
2418.7 71817245 71812126 71782982 71762650 71736061 71695808 71718414 71691948 71696503 71660995 71676064 71708076 71697075
2430.2 71697075 71674858 71600594 71629395 71624382 71606171 71591240 71562752 71562218 71544693 71542900 71495300 71482262
2441.8 71482262 71463783 71470734 71477074 71422226 71376442 71331314 71344749 71295876 71277092 71244438 71147789 71100441
2453.4G1100441m4144N5474j4450q5412j5403L3897k907n3199n387l9093k4879k6818
2465G0878120l974j4634l1852K9060l4599n6313r8785k4308J7067o5765k0431k3057
2476.5G0550529n8914p2296l0685m7074o71K2140k2682J6289l8521l761m158k4490
2488.1G0285706j3489L2287L1807j29623m7844k0706n3948q735j8318q111j7181k3109
2499.7G0008736p7721K464J7845j9828p363k7404K5764n3803p4974o2446k8954L0640
2511.2F9732956Q530K97m9003n0400p5508j7662k6764m0810L4180j2772L5973j8662
2522.8F9520355n6099o027O477k2644n0216J8982m8401k8488q835j3260j213l1426
2534.4F9279205K1500k7107r125m0199n5062P7k4773l5400n1903j6426r5085o4454
$$ plain form
2453.4 71100441 71056297 71111771 71097321 71011909 70996506 71030403 71027496 70974297 70968910 70929817 70904938 70878120
2465 70878120 70874146 70859512 70827660 70856720 70822121 70765808 70667023 70642715 70659782 70594017 70573586 70550529
2476.5 70550529 70491615 70419319 70388634 70341560 70340889 70363029 70340347 70356636 70318115 70314354 70310196 70285706
2488.1 70285706 70272217 70304504 70336311 70206688 70158844 70138138 70084190 70075455 70057137 70049026 70031845 70008736
2499.7 70008736 69931015 69933479 69951324 69931496 69924133 69896729 69922493 69868690 69793716 69731270 69702316 69732956
2511.2 69732956 69741486 69741783 69692780 69642380 69566872 69549210 69522446 69481636 69515816 69503044 69539017 69520355
2522.8 69520355 69464256 69458229 69464706 69442062 69391846 69410828 69362427 69333939 69325104 69311844 69310631 69279205
2534.4 69279205 69300705 69273598 69264473 69224274 69169212 69169289 69144516 69109116 69057213 69040787 68945702 68881248
2546F8881248j0932n6603n7571n0492J2688j00861o0264M5746j6030p8643j09688R460
2557.5F8408058J4153L952k3339p2525k1034J76m1459p2517K9648l8818j21567o4621
2569.1F8000107R521N3299l5606p1365n0248j213p9376o3782M7379M951l7307j00037
2580.7F7676323j8066J9691j961p1190j17881k793j0681j45p0915o2325k0706p7911
2592.2F7241440n646J3763N242n7076k8045j8944k4880j1825p7385k1736l2509M5479
2603.8F7027878N4031j4992l1959q7784m9744m4632L8910k3704k9259L7048l4660K014
2615.4F6843147m8790l5698m5791l9803m7775q1879l5705q9539l6171r0721n6931o782
2627F6227562o8695l9726j02692l0464p7149r4352j1002m9103j205j7967l0053j3870
$$ plain form
2546 68881248 68870316 68813713 68756142 68705650 68718338 68617477 68557213 68602959 68586929 68508286 68398598 68408058
2557.5 68408058 68422211 68426163 68402824 68330299 68309265 68309441 68267982 68195465 68225113 68186295 68064728 68000107
2569.1 68000107 68009628 68062927 68027321 67955956 67905708 67904495 67825119 67761337 67808716 67813667 67776360 67676323
2580.7 67676323 67658257 67677948 67675987 67604797 67486916 67484123 67473442 67473297 67402382 67340057 67319351 67241440
2592.2 67241440 67235794 67249557 67254799 67197723 67169678 67150734 67125854 67114029 67036644 67014908 66982399 67027878
2603.8 67027878 67081909 67066917 67034958 66947174 66897430 66852798 66891708 66868004 66838745 66875793 66841133 66843147
2615.4 66843147 66794357 66758659 66712868 66673065 66625290 66543411 66507706 66418167 66381996 66291275 66234344 66227562
2627 66227562 66158867 66119141 66016449 65985985 65908836 65814484 65803482 65754379 65753174 65735207 65705154 65691284
2638.5F5691284K1568K8351p354o0685m7126K6764j7128l3020m8920K3063J5549q0688
2650.1F5511658j02898p4432L3989o5338p2434m7646r0103r5535r0286N0148n9105
2660.7F4898018j00670o6902j12915m9233o8992m1222l8811l646N1284K2713Q041Q6029
2672.3F4583694Q8013q4282q0421o3637q5121j16623j01196l3409p6043r8106j76540
2682.9F3756329j36578r7393j63685k20302k33475j85189k80071k75245l03730l81958
2692.5F1478703m16150m35108k22576k4101R8881R4265N5217O6464J36284J27578o7058
2703.1F0892399j4641K1740k9659k0508j0460J3710m4033q2470r0965l0369q6182j08345
2714.7F0410217n4931r1069p9868j12892p5871q6353o8108q5021j42472l8612o9435
$$ plain form
2638.5 65691284 65712852 65741203 65733849 65673164 65626038 65652802 65635674 65602654 65553734 65576797 65592346 65511658
2650.1 65511658 65408760 65334328 65368317 65302979 65230545 65182899 65092796 64997261 64906975 64957123 64898018
2660.7 64898018 64797348 64730446 64617531 64568298 64499306 64458084 64419273 64415627 64466911 64489624 64497665 64583694
2672.3 64583694 64671707 64587425 64507004 64443367 64358246 64241623 64140427 64107018 64030975 63932869 63756329
2682.9 63756329 63619751 63522358 63358673 63138371 62904896 62719707 62439636 62164391 61860661 61478703
2692.5 61478703 61062553 60627445 60404869 60380768 60479649 60573914 60629131 60695595 60831879 60959457 60892399
2703.1 60892399 60877758 60899498 60869839 60849331 60838871 60852581 60808548 60726078 60635113 60604744 60518562 60410217
2714.7 60410217 60355286 60264217 60184349 60071457 59995586 59909233 59841125 59756104 59613632 59575020 59505585
2725.3E9505585n8392n9521m5539j6209q2775r3666j52691j44375j65211j30829j17515
2735.9E8438862k22782j88568j29921p3311r0454j21346q1371L4828J05202N0407J8929
2746.5E7740475k026J3432j2787l578l6049o9729l1761r1919q9493o5235m2454j03790
2758.1E7205086j19683q0268j29540j02058j57158j73126j43593j61221k25300j93988
2767.8E5719151n5905j63315k39765k24861j79958j88309k25971j72249k02316j71772
2777.4E3894730k28665k54764k14882k51660k58129k79728k47242l40336l68225l19324
2787E1131775l25485k92393k93202k87033l78784l64681l38261l41484l03119m19812
2796.7D7787521m61284m52782m35883m29878l89034l55095l82755l18379l20198l16246
$$ plain form
2725.3 59505585 59447193 59387672 59342133 59325924 59243149 59149483 58996792 58852417 58687206 58556377 58438862
2735.9 58438862 58216080 58027512 57897591 57824280 57733826 57612480 57531109 57565937 57671139 57721546 57740475
2746.5 57740475 57738449 57751881 57739094 57735516 57699467 57629738 57597977 57506058 57416565 57351330 57308876 57205086
2758.1 57205086 57085403 57005135 56875595 56773537 56616379 56443253 56299660 56138439 55913139 55719151
2767.8 55719151 55663246 55499931 55260166 55035305 54855347 54667038 54441067 54268818 54066502 53894730
2777.4 53894730 53666065 53411301 53196419 52944759 52686630 52406902 52159660 51819324 51451099 51131775
2787 51131775 50806290 50513897 50220695 49933662 49554878 49190197 48851936 48510452 48207333 47787521
2796.7 47787521 47326237 46873455 46437572 46007694 45618660 45263565 44880810 44562431 44242233 43925987
2806.3D3925987l02334k74524k21791j87767j73229k38991k37976k46807k37884k40052
2816D1564632k56469k73094l06805k89097l31078k77515l17741l68084k83596l05699
2825.6C8555454l45295l76114l45840m20071m30378m42039o04164o44963p10838p21996
2835.3C3513756q25428r34218r80348j155453j311060j520452j639903j810991k015301
2843.9B1320602k109924k180506k006519j594651q75846j11393O01536J166376J328271
2852.6A5537946J246331J079832R54525P23503O10768M93726M04083L41748J55170
2861.3B1547632J74570R9877N99r194k9125o7406r3240n2807j55003j26717l6729k2299
2872.9B1230158l4277m9088m6737j40011j53153j77383j71875j83838j78434j15759
$$ plain form
2806.3 43925987 43623653 43349129 43127338 42939571 42766342 42527351 42289375 42042568 41804684 41564632
2816 41564632 41308163 41035069 40728264 40439167 40108089 39830574 39512833 39144749 38861153 38555454
2825.6 38555454 38210159 37834045 37488205 37068134 36637756 36195717 35591553 34946590 34235752 33513756
2835.3 33513756 32688328 31754110 30773762 29618309 28307249 26786797 25146894 23335903 21320602
2843.9 21320602 19210678 17030172 15023653 13429002 12553156 12441763 13043299 14209675 15537946
2852.6 15537946 16784277 17864109 18818634 19542137 20152905 20646631 21050714 21392462 21547632
2861.3 21547632 21722202 21822079 21822678 21813484 21784359 21716953 21623713 21570906 21415903 21289186 21252457 21230158
2872.9 21230158 21195881 21146793 21100056 20960045 20806892 20629509 20457634 20273796 20095362 19979603
2882.5A9979603j82230j63933p8705J9482r098m9830l4856l5216J9529j6700K6357
2893.1A9474403J0090l3485o1073o2891L2709m9263r6415j08951r1134p4384j14687
2903.7A8824919k12553l50994l90274n07637n09112o46471q80468r52888j055137j000075
2913.4A2319310r27084o58278k21257J30744L58359N16631O63479O75430Q21894Q42890
2923A4522118Q35610Q00035P55121Q62360P72087P62150P68840P75582P26763P34947
2932.7B2315613Q09933O97072O28720O17521P88639P32599N41184N85150N86765M59711
2942.3B8762907K56313J87699K00763L74974L60744R9058j2081n6492q0122j85402
2952B9908361j1644L17022O32779R12874R36260R08951P78820P27390O57318O09234
$$ plain form
2882.5 19979603 19797373 19633440 19554735 19574217 19565119 19515289 19480433 19445217 19464746 19448046 19474403
2893.1 19474403 19484493 19451008 19389935 19327044 19359753 19310490 19214075 19105124 19013990 18939606 18824919
2903.7 18824919 18612366 18261372 17871098 17363461 16854349 16207878 15327410 14374522 13319385 12319310
2913.4 12319310 11392226 10733948 10512691 10643435 11001794 11518425 12181904 12857334 13679228 14522118
2923 14522118 15357728 16157763 16912884 17775244 18547331 19309481 20078321 20853903 21580666 22315613
2932.7 22315613 23125546 23822618 24451338 25068859 25857498 26590097 27131281 27716431 28303196 28762907
2942.3 28762907 29019220 29206919 29407682 29782656 30143400 30242458 30230377 30173885 30093763 29908361
2952 29908361 29896717 30213739 30846518 31759392 32695652 33604603 34383423 35110813 35768131 36377365
2961.6C6377365P17014R07875J056103J013779J060039J024468J020664J051796R75556
2970.3D5204659R12326R22459R56383Q07174Q08403Q27099Q06294P39231O48418O72146
2979.9E3304592O25538O60946N28870M90959N71365N19611M51012L14587L49010L20530
2989.6E8137020L21667L42754K88052K88906K43458K25124J94691K34230J51825J10965
2999.2F0538692J62369J51688K04002J59302J07586Q0086J52942N2876o134J72085
3008.8F1775494R3551L7506O6002M8786j4820K4105M2778K1882P4565j9085j1q3504
3020.4F2067249q5945n398r2594n7983o2500J331k3826o1139j02047r5001L8178j09471
3032F1410854q9851L712Q808O7142R5776Q0707O1135J06716L8696N5939Q8173J45500
$$ plain form
2961.6 36377365 37094379 38002254 39058357 40072136 41132175 42156643 43177307 44229103 45204659
2970.3 45204659 46116985 47039444 47995827 48803001 49611404 50438503 51244797 51984028 52632446 53304592
2979.9 53304592 53930130 54591076 55119946 55610905 56182270 56701881 57152893 57467480 57816490 58137020
2989.6 58137020 58458687 58801441 59089493 59378399 59621857 59846981 60041672 60275902 60427727 60538692
2999.2 60538692 60701061 60852749 61056751 61216053 61323639 61403725 61556667 61609543 61603409 61775494
3008.8 61775494 61869045 61906551 61972553 62021339 62006519 62030624 62073402 62095284 62169849 62150764 62150753 62067249
3020.4 62067249 61981304 61975906 61883312 61825329 61762829 61764160 61740334 61679195 61577148 61482147 61520325 61410854
3032 61410854 61321003 61324715 61333523 61400665 61496441 61577148 61638283 61744999 61783695 61839634 61927807 62073307
3043.6F2073307J33495J6568L2837J3786R7069O7485P8232N5271o0142M9518N5241
3054.2F2612667N9971k4689L9925J07727l2147J6697P393K6074L8353L0101O241O1951
3065.7F2950264J34281k1873r095N8079O3122J8936J5335M6478N1270J08189K6760
3076.4F3441746l9173m4983O4888Q2897J2550M0928Q564L4611o870K4627J1006o4968
3087.9F3565823j3874N1063O6158p9971p2304p0255R415J02779j7036j3939J2039Q5068
3099.5F3624966o0875j44276p652K5493K3278k4617O0582k9843j05591p6644n9636
3110.1F3225185K1424p2483o5529m2755k1046q1207r7065N2486j8497j6171L2883O931
3121.7F2924156l8791p4860l0544R5420J02150k8984O1940N8471j6300k1233O123N6561
$$ plain form
3043.6 62073307 62206802 62223370 62256207 62269993 62367062 62434547 62512779 62568050 62507908 62557426 62612667
3054.2 62612667 62672638 62647949 62687874 62795601 62763454 62780151 62787544 62813618 62851971 62882072 62888313 62950264
3065.7 62950264 63084545 63062672 63053577 63111656 63174778 63193714 63209049 63255527 63306797 63414986 63441746
3076.4 63441746 63402573 63357590 63422478 63505375 63517925 63558853 63567417 63602028 63595158 63619785 63630791 63565823
3087.9 63565823 63551949 63603012 63669170 63589199 63516895 63446640 63456055 63558834 63541798 63527859 63539898 63624966
3099.5 63624966 63564091 63419815 63412163 63437656 63460934 63436317 63496899 63467056 63361465 63284821 63225185
3110.1 63225185 63246609 63174126 63108597 63065842 63044796 62963589 62866524 62919010 62900513 62884342 62917225 62924156
3121.7 62924156 62885365 62810505 62779961 62875381 62977531 62948547 63010487 63068958 63052658 63031425 63037548 63094109
3133.3F3094109P9036R4826r464L7811K3727M452L5477J125Q8249L769r967L16K0077
3145.8F3463543P7167P7050O3335o8516K4155l784j4130P0717m6059j9218J2421Q579
3157.4F3645260l2272k194m0142n2998O8356L0746J8185n2204l82P3941q526q2115
3168.9F3565655p5932Q248K510N7407J4351J5377L2124J270m4083j69670J11622J65184
3180.5F3684063k9015o5734o4908n950l9750N5260K3529n9265j6312J1322O1612K8358
3192.1F3583210J0006M887N5522k5245j18767n0236M8195J40743M1233m3144m2465
3202.7F3603939l4454o5518k2697Q6765R2438K9594j10183p5974j3794O5270M5078
3213.3F3600464r0023p1366j03843N4981J01452m894m0875q1009k9617o9950l2898
$$ plain form
3133.3 63094109 63173145 63267971 63258507 63296318 63320045 63324497 63359974 63361099 63449348 63453117 63443150 63443466 63463543
3145.8 63463543 63540710 63617760 63681095 63612579 63636734 63632950 63618820 63689537 63643478 63624260 63636681 63645260
3157.4 63645260 63612988 63610794 63570652 63517654 63586010 63616756 63634941 63582737 63582355 63656296 63647770 63565655
3168.9 63565655 63489723 63497971 63500481 63557888 63572239 63587616 63619740 63621010 63576927 63407257 63518879 63684063
3180.5 63684063 63655048 63589314 63524406 63518456 63478706 63533966 63557495 63498230 63481918 63493240 63554852 63583210
3192.1 63583210 63593216 63598103 63653625 63628380 63509613 63459377 63507572 63648315 63689548 63646404 63603939
3202.7 63603939 63569485 63503967 63481270 63568035 63660473 63690067 63579884 63503910 63490116 63555386 63600464
3213.3 63600464 63510441 63439075 63335232 63390213 63491665 63486771 63445896 63364887 63335270 63265320 63232422
3223.9F3232422n88M5174N566j14926m5688k911M616j8768J0978p4619j28452q3992
3235.5F2828812q3969o1490q6162Q686r3411n0384O4327r4936j26103j48883R597m9289
3247F2116795j89766r4593r102l170j52523p6680n9627k8542M0879n5210m6547o4015
3258.6F1377899m5231n0937o424k0138p4627q8963j06418n1792j33183j06842m8386
3269.2F0644958J5561r24j8138K3052j62640n5015q446o0967L968l2650q2310j31538
3280.8F0134911J1634J2898k1301p2865j76876q3481j7750p3383k18952j53256p8193
3291.4E9263386l9841j17397j99284p2822j59550r8030j24493k68871k51129k88643
3301E7643326k44076k15286j68137k44930k97096k79900k76569k59022l18905k85042
$$ plain form
3223.9 63232422 63231834 63277008 63282574 63167648 63121960 63119049 63123665 63104897 63115875 63041256 62912804 62828812
3235.5 62828812 62744843 62683353 62597191 62605877 62512466 62462082 62526409 62431473 62305370 62156487 62166084 62116795
3247 62116795 61927029 61832436 61823334 61820164 61667641 61590961 61531334 61502792 61543671 61488461 61441914 61377899
3258.6 61377899 61332668 61281731 61275307 61255169 61180542 61091579 60985161 60933369 60800186 60693344 60644958
3269.2 60644958 60660519 60659595 60641457 60664509 60501869 60446854 60438408 60377441 60381409 60348759 60266449 60134911
3280.8 60134911 60146545 60159443 60138142 60065277 59888401 59804920 59787170 59713787 59494835 59341579 59263386
3291.4 59263386 59223545 59106148 58906864 58834042 58674492 58576462 58451969 58183098 57931969 57643326
3301 57643326 57399250 57183964 57015827 56770897 56473801 56193901 55917332 55658310 55339405 55054363
3310.7E5054363l46740l42885l59054l84155k93618k70641k48398l24638k55684k07123
3320.3E2021427j75537j41094j09257K0962m8821M9916R6302J45775K84305K05334
3330E2349312J83597L18257M31610K44339K94746L11737K42470M15859L52364L02730
3339.6E5447021K29786L22487L26424K28657K95318L08716L77865K79823L04165L26321
3349.3E8446583L60679L95161K89414L06293K25410L31601L46431K70512K58820J87797
3358.9F1418701J98136J60640J41812J35296K25570P3250P6767K22004R7504J28822
3368.6F2878502R2884J79298P2235n9860l502M0245J70365o653p298j5922j0891J17851
3380.1F3447254M4972N5042j953J1699l1662j1276P8350N8369K2476m2358P2380L8818
$$ plain form
3310.7 55054363 54707623 54364738 54005684 53621529 53327911 53057270 52808872 52484234 52228550 52021427
3320.3 52021427 51845890 51704796 51595539 51616501 51567680 51617596 51713898 51859673 52143978 52349312
3330 52349312 52532909 52851166 53282776 53527115 53821861 54133598 54376068 54791927 55144291 55447021
3339.6 55447021 55676807 55999294 56325718 56554375 56849693 57158409 57536274 57816097 58120262 58446583
3349.3 58446583 58807262 59202423 59491837 59798130 60023540 60355141 60701572 60972084 61230904 61418701
3358.9 61418701 61616837 61777477 61919289 62054585 62280155 62353405 62430172 62652176 62749680 62878502
3368.6 62878502 62971386 63150684 63222919 63163059 63159557 63199802 63370167 63363514 63356216 63340294 63329403 63447254
3380.1 63447254 63492226 63547268 63545315 63557014 63525352 63514076 63592426 63650795 63673271 63630913 63703293 63742111
3391.7F3742111j6014L9799M5093l6251k6268Q4668J3263P0561o947m9644j4511p6066
3403.3F3769794k0427k804J442n0037O3571k4520j56216o8764n9246N3520j5880m6204
3414.8F3444229m7817j2810J2047n3646j2425j11496m2480k491N9757m970j54778n1086
3426.4F3022034j5156O3732o8878l8273M0852k5681l3367j07128Q606j27754j18237
3437F2600750j6331m7207m2682j07983M2999p6496j27887q969M6433J1364j94203q1302
3448.6F1998486l5572K9972L8162j6720p8178j37902l4347k1477K9541j0429p2480
3459.2F1689056q6105l3550j6121n8621j1112k2350R8415p1972j21990l7483j50681
3469.8F1177486L5248L8994j79l7590q9958m0596K6195Q39j13926K8313K6814l8071
$$ plain form
3391.7 63742111 63726097 63765896 63810989 63774738 63748470 63833138 63846401 63916962 63910015 63860371 63845860 63769794
3403.3 63769794 63749367 63746563 63748005 63697968 63761539 63737019 63580803 63512039 63452793 63506313 63490433 63444229
3414.8 63444229 63396412 63383602 63395649 63342003 63329578 63218082 63175602 63173111 63232868 63227898 63073120 63022034
3426.4 63022034 63006878 63070610 63001732 62963459 63004311 62978630 62945263 62838135 62846741 62718987 62600750
3437 62600750 62584419 62537212 62494530 62386547 62429546 62353050 62225163 62216194 62262627 62273991 62079788 61998486
3448.6 61998486 61962914 61992886 62031048 62014328 61936150 61798248 61763901 61742424 61771965 61761536 61689056
3459.2 61689056 61602951 61569401 61553280 61494659 61483547 61461197 61559612 61487640 61365650 61328167 61177486
3469.8 61177486 61212734 61251728 61251549 61213959 61124001 61083405 61109600 61110439 60996513 61024826 61051640 61013569
3481.4F1013569k06528j20277J17725Q43M5185l9959m8381j02646r2003O3946J5464
3492F0646938P5825j07212j54434n2250J3473J1792o5609j4969j53206m6085j0045
3502.6F0144218o1500K815J9207O3828n3654L2581j01616j25198M8615N98J5889n4055
3514.2E9931728K2519K6191M0375o5666j06495N6263l0365l17j3958M4663k6295o8211
3525.7E9810432N1106M471M2248o5781L2757j683q7539P6980J54923J20739k01184
3536.4E9937469p1754J96445M6261l0964L7365Q5911j7303q4610j21872N0483Q0182
3547F0107613n0831J36646J60034K0313j23035o0715N2334n2318K7603J23348L8441
3557.6F0379433j984l3867j13186m8343J5640k1275o015L047l01574m7734J54030o6639
$$ plain form
3481.4 61013569 60807041 60686764 60804489 60805332 60850517 60810558 60762177 60659531 60567528 60631474 60646938
3492 60646938 60722763 60615551 60461117 60408867 60422340 60434132 60368523 60353554 60200348 60154263 60144218
3502.6 60144218 60082718 60085533 60104740 60168568 60114914 60147495 60045879 59920681 59969296 59969894 59985783 59931728
3514.2 59931728 59954247 59980438 60020813 59955147 59848652 59904915 59874550 59874233 59860275 59904938 59878643 59810432
3525.7 59810432 59861538 59866009 59908257 59842476 59875233 59873550 59786011 59862991 60017914 60138653 59937469
3536.4 59937469 59865715 60062160 60108421 60077457 60114822 60200733 60183430 60098820 59976948 60027431 60107613
3547 60107613 60056782 60193428 60353462 60373775 60250740 60190025 60242359 60190041 60217644 60340992 60379433
3557.6 60379433 60377449 60343582 60230396 60182053 60197693 60176418 60170403 60173450 59871876 59824142 59978172 59911533
3569.1E9911533K51488J47522m0729l7457q6918Q9504J09608j144r0287J5530n0941
3579.7F0217709o5091P7183o5983K1145M5563R5150j2909j69060K5360n0396K24217
3590.4F0342888J02650Q6868n524k6878R3578k69108J62094J06465R9151J50467k32799
3601F0609852J0032M5689R0645P6000J23169L2925o4587K56470k26425L01532M78928
3611.6F1734230j66210m5120J75663J4743K49253K03937m7714m4926k96653K16297
3621.2F1993500M65301K21672J15540Q980p3159k8656J81385q73512m21066J037052
3630.9F2627037N48134L96099k7058r4310K47825J92291K8378q1059J31207L4378L3943
3641.5F4036865N4650L0052J77246K70294K32040o57409k27730K92183k11411K2660
$$ plain form
3569.1 59911533 60163021 60310543 60269814 60232357 60145439 60234943 60344551 60343407 60253120 60268650 60217709
3579.7 60217709 60152618 60229801 60163818 60184963 60230526 60325676 60312767 60143707 60169067 60118671 60342888
3590.4 60342888 60445538 60532406 60526882 60500004 60593582 60324474 60486568 60593033 60692184 60842651 60609852
3601 60609852 60619884 60665573 60756218 60832218 60955387 60988312 60923725 61180195 60953770 61255302 61734230
3611.6 61734230 61568020 61522900 61698563 61713306 61962559 62166496 62118782 62073856 61777203 61993500
3621.2 61993500 62458801 62680473 62796013 62804993 62731834 62703178 62884563 62011051 61589985 62627037
3630.9 62627037 63175171 63571270 63544212 63449902 63697727 63890018 63918396 63837337 63968544 64002922 64036865
3641.5 64036865 64091515 64121567 64298813 64569107 64801147 64143738 63916008 64208191 63996780 64019440
3651.1F4019440K97157M05907J26289J85898k2850m71771L93539K24381q118N2261
3660.8F5202133O9657O8748P8239J02509O7780L5743J38581J27204j40563k96570m84139
3671.4F4969322L94257O35567M13871r09744j855602J042560Q16918L08738j16233
3680F5699654J57829J39442m867J28120j04744m9087J32293l7239q19206J58806N66589
3690.6F5967590m97146K57667L56369P8652L2921j90834n6344M4068J45683R8892M3915
3701.3F6281433m38309j95037L57894N3368O0768j4198J73508J95999o02280J98212
3710.9F6071358l90419m25896O90826J75759o5392J29563J90483q3374k67197p4638
3720.5F5951073J14303n04341k3094M98276j09749q3511k29386R0691J58966J6632
$$ plain form
3651.1 64019440 64316597 64722504 64848793 65034691 65011841 64540070 64933609 65157990 65149872 65202133
3660.8 65202133 65271790 65340538 65418777 65521286 65589066 65624809 65763390 65890594 65750031 65453461 64969322
3671.4 64969322 65363579 65999146 66413017 65503273 63647671 64690231 65507149 65815887 65699654
3680 65699654 65857483 65996925 65992058 66120178 66015434 65966347 66098640 66061401 65242195 65401001 65967590
3690.6 65967590 65470444 65728111 66084480 66163132 66196053 66005219 65948875 65992943 66138626 66237518 66281433
3701.3 66281433 65843124 65648087 66005981 66059349 66120117 66105919 66279427 66475426 65873146 66071358
3710.9 66071358 65680939 65255043 65945869 66121628 66056236 66185799 66376282 66292908 66025711 65951073
3720.5 65951073 66065376 65561035 65537941 66036217 65926468 65842957 65613571 65704262 65863228 65879860
3730.2F5879860L59428k44903l30513K51533j37985n12833K30973K39013j40449K22969
3739.8F5817093J15845j66870M58236P57118j203353o53481P58209K37152L72292n34630
3749.5F5957611n90584O79184k97073j73256J83090J96160J21864j80817J82877J56364
3759.1F6235420o87248m578L32291M9377K4018K2339j86417j47942J68717K12280j15112
3769.7F5903145l49663O8138K09450P3006K5955j04225j43425L3043J94076J6235m50737
3780.3F5474998J51986N6137K4711K57470k02897P271P1327k9602m3106q9866Q9454
3790.9F5767883J4221l9436j23146J53359L09234k61207l31208P6683M09912K68189
3800.6F6244484o78185m60243K21909J31607K14371J86737o53923J1566K88551J20972
$$ plain form
3730.2 65879860 66239288 65994385 65663872 65915405 65777420 65264587 65495560 65734573 65594124 65817093
3739.8 65817093 65932938 65766068 66224304 66981422 65778069 65124588 65882797 66119949 66492241 65957611
3749.5 65957611 65367027 66046211 65749138 65575882 65758972 65955132 66076996 65896179 66079056 66235420
3759.1 66235420 65548172 65543594 65875885 65925262 65949280 65971619 65785202 65637260 65805977 66018257 65903145
3769.7 65903145 65553482 65621620 65831070 65904076 65930031 65825806 65682381 65715424 65909500 65925735 65474998
3780.3 65474998 65626984 65683121 65707832 65965302 65762405 65769676 65841003 65811401 65768295 65678429 65767883
3790.9 65767883 65782104 65742668 65619522 65772881 66082115 65820908 65489700 65566383 65976295 66244484
3800.6 66244484 65566299 65106056 65327965 65459572 65673943 65860680 65206757 65218323 65506874 65627846
3810.2F5627846j3077q1062k7848O2676K97760m63417n66780M64294L02925K93076
3819.9F5896393k17491j034470K04163M45495K06696J19278q7746l33542J14502J36399
3829.5F5449677K98629k8862n94581K42347J99730l17268J04294L54301p54295m8554
3839.2F4905418L47603l70384K53052K69127k26624j73363K64901J25549Q3008K02331
3848.8F5680618o5887J82861J8868p91367n28129p00768R04671N71640j14205k40791
3858.4F4917511K04033K37625P3410l20930K7671M25225n04227p5409K61124J58210
3868.1F5404243K05826q18443l60413M07761M78615N119o33522K75055K49008O149
3877.7F5219398P2464P8301o53633j74614L08540L6652K72377j37596p97615M56375
$$ plain form
3810.2 65627846 65614769 65533707 65505859 65568535 65866295 65402878 64836098 65300392 65603317 65896393
3819.9 65896393 65678902 64644432 64848595 65294090 65500786 65620064 65532318 65198776 65313278 65449677
3829.5 65449677 65748306 65719444 65124863 65367210 65566940 65249672 65353966 65708267 64953972 64905418
3839.2 64905418 65253021 64882637 65135689 65404816 65178192 65004829 65269730 65395279 65478287 65680618
3848.8 65680618 65614731 65797592 65816460 65025093 64496964 63796196 64700867 65272507 65158302 64917511
3858.4 64917511 65121544 65359169 65432579 65111649 65139320 65564545 65060318 64984909 65246033 65404243
3868.1 65404243 65610069 64791626 64431213 64838974 65317589 65322708 64689186 64964241 65213249 65219398
3877.7 65219398 65291862 65370163 64716530 64541916 64850456 64887108 65159485 65021889 64224274 64680649
3887.4F4680649L34495M0787Q6556l84026m38431L88382J76979n6457M0054m1603Q7044
3898F4914429M4464m41117K46735p1693l63770L99666j70464j33049J48636J27167
3907.6F4701004P2830j02119J27884p56k28424j23367N0072J40129J3702k93129j25610
3918.2F4232216L68652r2567k65961J88263J9104O798r4696k6375l624p805J13052
3928.8F4437057o5124q5938j75506j84292Q1867J55983J4923p0488k9953m6676Q0658
3939.5F4112511J2123R4734K281l18512P2304O7284k6726n7865j3443J01215j27972
3950.1F3917934j18316O9652j1158j15509k4147N9098l9669k01832j0727J02558j5377
3960.7F3612507m910o5097L8124p5577j33660N1434m8008m1889k0256L2471M0096L940
$$ plain form
3887.4 64680649 65015144 65055931 65142487 64758461 64320030 64708412 64885391 64828934 64868988 64827385 64914429
3898 64914429 64958893 64517776 64764511 64692818 64329048 64728714 64558250 64425201 64573837 64701004
3907.6 64701004 64773834 64671715 64799599 64798843 64570419 64447052 64497124 64637253 64650955 64357826 64232216
3918.2 64232216 64600868 64508301 64242340 64430603 64449707 64456505 64361809 64335434 64331810 64324005 64437057
3928.8 64437057 64371933 64285995 64110489 63926197 64008064 64164047 64178970 64108482 64078529 64031853 64112511
3939.5 64112511 64124634 64219368 64221649 63903137 63975441 64042725 64015999 63958134 63944691 64045906 63917934
3950.1 63917934 63799618 63869270 63858112 63742603 63718456 63777554 63737885 63536053 63525326 63627884 63612507
3960.7 63612507 63607597 63542500 63580624 63505047 63371387 63422821 63374813 63332924 63312668 63345139 63385235 63389175
3972.2F3389175j3546o2137Q1459J8730j53786j25496J2028R476K8763J17851j5770
3982.8F3286747l9848K5814J0341j49826o8123N7980K186J6247j42357k9751N619o5643
3994.4F2909386N390k9858J5000j9844O0916J0884
4000.2F2951874
$$ plain form
3972.2 63389175 63375629 63313492 63394951 63413681 63259895 63134399 63146427 63155903 63184666 63302517 63286747
3982.8 63286747 63246899 63272713 63283054 63133228 63065105 63123085 63125271 63141518 62999161 62969410 62975029 62909386
3994.4 62909386 62914776 62884918 62899918 62880074 62940990 62951874
4000.2 62951874
##END=$$ End of the data block
