##TITLE=$$ Begin of the data block
##JCAMP-DX=5.00 $$ ACD/SpecManager v 10.08
##SPECTROMETER/DATA SYSTEM=Varian
##DATE=30 Apr 2013 08:58:24
##DATA TYPE=INFRARED SPECTRUM
##DATA CLASS=XYDATA
##ORIGIN=
##OWNER=
##NPOINTS=3735
##FIRSTX=399.26403809
##LASTX=4000.35498047
##MAXX=4000.35498047
##MINX=399.26403809
##MAXY=110.33312988
##MINY=13.57887554
##XFACTOR=1.0000000000
##YFACTOR=0.000001000000000
##FIRSTY=75.07312012
##DELTAX=0.96440572
##XUNITS=1/CM
##YUNITS=TRANSMITTANCE
##XYDATA=(X++(Y..Y))
399.3 75073120 75073120 75073120 75073120 75073120 75073120 75073120 75073120 75073120 75073120 75073120 75073120 75073120 75073120 75073120 75073120 75073120 75073120 75073120 75073120 75073120 75073120 75073120 75073120 75073120 75073120 75073120 75073120 75073120 75073120 75073120 75073120 75073120 75073120 75073120 75073120 75073120 75073120 75073120 75073120 75073120 75073120 75073120 75073120 75073120 75073120 75073120 75073120 75073120 75073120 75073120 75073120 75073120 75073120 75073120 75073120 75073120 75073120 75073120 75073120 57102264 57102264 110333130 90680672 72398437 76225388 80752388 78194710 77173653
464.8 77173653 79153587 84677063 78953934 75835632 77345924 76209175 72400284 68923798 73404411
473.5 73404411 72294525 71635910 74787689 78496964 80031013 77643616 77766975 76407486 75780350
482.2 75780350 76005455 75378349 75537766 75465195 75706833 73805634 73325104 75562714 75848198 74704910
491.8 74704910 74693047 75311287 75774963 75048393 73486160 73209381 73337273 73818024 73462311 72300591
501.5 72300591 71738693 71159225 71311600 72085793 72663033 72798759 72916374 73225548 73807747 74343636
511.1 74343636 73616058 73100060 72757820 72295990 72502975 72808289 73054024 73134926 73182343 73108101
520.8 73108101 72964363 72558784 72317322 72490486 72531509 72675903 72464836 72073662 71823807 71970123
530.4 71970123 72008270 71576332 71486198 71350777 71090958 70654930 70249306 70115662 69784363 69513184
540.1 69513184 69307892 69191780 69044060 68641693 68367409 68495583 68568901 68438797 68652710 69048920
549.7 69048920 69408463 69519051 69627930 70014488 70029442 70069313 70230835 70281082 70402176 70549103
559.4 70549103 70649628 70661644 71149506 71746140 72087578 72298904 72421021 72645782 72438576 72217903
569 72217903 72510170 72798225 72661240 72666100 73004395 73210312 73329391 73243927 73206436 73116440 73115646 73166328
580.6 73166328 73120049 73379890 73560905 73702522 73639893 73593277 74006393 74201607 74066132 74136635 74390938
591.2 74390938 74285316 74331314 74474564 74335915 74349701 74312225 74285439 74510796 74769524 74821747 74869995
601.8 74869995 74803825 74555275 74589966 74706802 74730453 74731201 74785217 74809280 74872780 74946358 74868042 74887360
613.4 74887360 74926308 75105789 75083580 74917519 75016174 74820190 74543106 74443962 74426933 74461830 74538597
624 74538597 74401253 74243362 74307053 74223961 74175011 74001099 73692123 73301056 72931297 72793251 72538506
634.6 72538506 72230537 71716408 71097260 70156296 68657394 67537544 67487335 68314362 69400887 69891243
644.2 69891243 69838249 69819717 69860657 69890968 69890343 69787552 69743568 69730705 69781593 69762077 69650047 69662254
655.8 69662254 69647011 69580742 69582848 69752968 69993851 70087044 69916542 69698250 69653763 69684593 69847206
666.4 69847206 69830070 68882843 69243309 69554352 69446167 69373711 69480553 69492867 69674767 69764915 69635880
677 69635880 69698334 69829842 69761917 69511520 69380089 69251778 69198708 69265900 69311829 69254440 69135292
687.6 69135292 69422127 69765884 70210670 70806938 71223686 71830231 72321304 72604568 72844078 73073013
697.3 73073013 73322067 73651138 74017456 73906998 73832230 73914894 73845825 73696899 73489670 73452545 73340302
707.9 73340302 73111427 72893105 72799065 72572571 72005630 71266251 70205070 68911255 67255058 64854279
717.5 64854279 61753014 59463638 59905293 62738308 65402023 66764603 67085335 66850380 66233574
726.2 66233574 65015793 63586807 63009373 63736427 65623192 67904686 69896202 71390190 72319069
734.9 72319069 72983665 73488892 74089989 74726303 75244873 75574585 75595482 75637138 75681145 75868454
744.5 75868454 76098190 76277061 76489265 76573158 76634560 76581146 76524445 76552322 76458916 76321777 76393883
755.1 76393883 76348984 75823029 74932426 74142136 73959229 74000267 74365845 75132195 75741287 76099129
764.8 76099129 76266731 76349350 76262390 76252129 76176369 76022064 76045692 75866600 75831566 75859901 75658264
775.4 75658264 75474396 75319328 75128334 74876694 74606209 74273781 73999657 73739494 73565315 73525764
785 73525764 73501587 73468918 73393990 73318596 73116440 72956512 72747383 72492332 72393814 72269623 72100510
795.6 72100510 71854744 71728355 71530266 71196419 70893326 70548157 70331970 70129715 69855263 69500198
805.3 69500198 69192482 68792397 68195518 67616959 67323616 67648598 68076904 68278397 68337669 68301003
814.9 68301003 68251030 68050125 67910866 67798279 67485374 67041443 66768593 66571365 66271721 65981895
824.6 65981895 65634911 65387688 65141396 64877640 64542046 64114639 63845821 63439884 62954582 62620007
834.2 62620007 62293228 61861122 61435768 61040573 60528950 60087559 59746971 59314682 58951263 58767376
843.9 58767376 58667084 58639034 58460400 58247303 58200985 58197926 58164841 58019661 57997070 58089775 58181870
854.5 58181870 58319706 58417873 58523163 58552547 58578503 58688961 58757828 58852230 58949471 58942902 58973251
865.1 58973251 59174854 59375191 59541611 59751320 59914501 60144169 60447323 60569008 60567650 60603359
874.7 60603359 60686596 60675232 60448090 60320206 60346043 60321716 60403721 60424324 60331329 60288391 60178917
885.3 60178917 60057373 59947266 59802380 59662952 59407543 58735245 58026192 58154163 59030441 59763596
895 59763596 60013779 60101810 60083145 60074459 60066986 59900826 59843803 59866856 59822636 59778473 59792427 59773636
906.5 59773636 59596592 59318241 59049274 58907928 58727928 58467865 58193939 57944340 57730373 57428608
916.2 57428608 57182827 57025711 56974167 56866661 56698772 56580181 56243244 55877159 55623692 55355389
925.8 55355389 54996815 54623405 54274933 53828487 53388958 52970779 52504421 51984432 51509670 51007881
935.5 51007881 50569382 50154888 49673367 49405449 49105251 48751163 48416473 48254642 48248104 48160748
945.1 48160748 48201557 48193653 48165981 48175182 48247955 48452465 48643745 48857212 49258987 50040672 50882107
955.7 50882107 51635551 52347794 52995853 53736614 54536480 55305923 56016285 56678909 57331539 58007782
965.4 58007782 58741554 59463364 60069965 60607803 61144497 61635101 62093971 62488972 62687107 62858665
975 62858665 62972931 62913872 62856895 62837418 62853832 62651646 62365181 62187946 61872250 61516666 61234188
985.6 61234188 60987438 60746399 60521347 60328094 60195633 60055393 60006134 60127087 60137627 60123726
995.3 60123726 60200798 60355087 60563740 60645233 60758430 60948696 61028698 61056820 61154461 61243729 61325962
1005.9 61325962 61477657 61520943 61460205 61391613 61353413 61233799 60971447 60685097 60227535 59713791
1015.5 59713791 59312473 58918701 58484150 58029991 57601166 57232292 56855869 56421513 55926273 55372627
1025.2 55372627 54830223 54299122 53771194 53233700 52683132 52090275 51645687 51343716 51009304 50710228
1034.8 50710228 50396683 50218353 50026958 49871498 49843704 49826855 49754906 49423195 49223091 49181843
1044.5 49181843 49367706 49807228 50234959 50598324 50734226 50741707 50604736 50677639 50913891 50944038
1054.1 50944038 50879341 50682606 50484436 50180103 49821049 49428459 48965923 48406475 47744919 47254417
1063.7 47254417 46687260 46154995 45511906 44806332 44180336 43626945 43307213 42703560 42174915 41571735
1073.4 41571735 40827217 40190281 39438129 38671352 37831619 37161514 36257912 35287556 34250237 33161156
1083 33161156 32220936 31160810 30388855 29403860 28495768 27661551 26922970 26364510 25644684 25102083
1092.7 25102083 24452505 24012417 23365301 22815468 22370523 21869453 21605368 20988413 20633865 20241350
1102.3 20241350 20042282 19854446 19671349 19664694 19452219 19604595 19388096 19379539 19341887 19196474 19282393
1112.9 19282393 19150261 19273689 19189774 19363161 19411854 19461517 19640425 19639927 19891846 19913162 20199436
1123.5 20199436 20412163 20706699 20933046 21045137 21356794 21393841 21716854 21814480 21965374 22018122
1133.2 22018122 22021526 22243818 22198385 22405626 22391150 22468761 22466183 22459269 22611847 22670258 22999960
1143.8 22999960 23140005 23478479 23683542 24010193 24594261 25177847 25911385 26550671 27611090 28596279
1153.4 28596279 29686510 30868574 32092125 33507076 34834793 36370895 37939739 39750679
1161.1 39750679 41443874 43016262 44535885 45817997 47056622 48054226 48950111 49748051 50449162
1169.8 50449162 50951084 51354820 51862099 52299919 52711212 53002926 53336601 53628483 53745628 53845467
1179.5 53845467 53843155 53829082 53749058 53556759 53149357 52535065 52143883 52611252 54047150 55489605
1189.1 55489605 56511520 57167671 57625175 57927147 58013657 58009426 57917961 57776512 57493031 56987679
1198.8 56987679 56386513 55760021 55430294 55625145 56353683 57363235 58448940 59341743 59877254
1207.4 59877254 60150089 60243484 60298855 60368111 60349541 60188663 59843719 59380127 58797180 58160076
1217.1 58160076 57396866 56530819 55893963 55675983 55769001 56008362 56530632 57115051 57465408 57547821
1226.7 57547821 57381248 57092548 56741516 56359127 55867771 55251549 54604149 53899715 53003086 51915749
1236.4 51915749 50716389 49372665 48118019 47014130 46268337 45918911 45921806 46005512 45973869 46043938
1246 46043938 46074787 46265297 46456619 46636482 46751122 46740124 46819748 46827091 46931168 46936668 46906876
1256.6 46906876 46961857 47154793 47596951 48138512 49031761 50063702 51001110 51567635 51765224 51811954
1266.3 51811954 51731068 51520622 51151096 50857399 50538616 50090107 49584236 48934727 48262077 47573559
1275.9 47573559 46990891 46387585 45940353 45681225 45444153 45356331 45139610 44837593 44336250 43902996
1285.5 43902996 43625317 43400322 43216461 42874367 42573849 42032188 41587307 41140259 40614155 40239052
1295.2 40239052 39855034 39675446 39443794 39622654 40018337 40561714 41279182 42001514 42867882 43450592
1304.8 43450592 44069294 44475655 44758568 44920696 45004822 45419922 45900940 46811558 47892799 49225933
1314.5 49225933 50646385 52085064 53655155 54759964 55560139 55945583 56141006 56185764 56093575
1323.2 56093575 56066727 56012920 56209267 56448833 56685719 56929054 57259029 57750900 58296432 59084621
1332.8 59084621 59828293 60468021 60916908 60910553 60777534 60401428 59628578 58260933 56816795 55320538
1342.4 55320538 53314640 51246250 49377167 48106602 47360222 47178131 47220009 47563297 48168774
1351.1 48168774 48802013 49550865 50271194 51150078 51989735 52874210 53712765 54502472 55322464 56035133
1360.8 56035133 56684914 57217327 57692581 58165546 58586235 58956333 59408195 59740372 59903332 60165226
1370.4 60165226 60382004 60705872 61122723 61446186 61643829 61857899 62167896 62372501 62509556 62629879
1380.1 62629879 62806007 63185230 63521019 63803185 64064140 64343689 64607437 64374550 64459740 64716637
1389.7 64716637 64825539 64867165 64937988 65178772 65018814 64608635 64514397 64578804 64603226 63936230 63477127
1400.3 63477127 63173801 62700081 62094036 61537495 60357613 59313614 58959633 58529285 58318611
1409 58318611 58141685 58297558 58787117 59616299 60716553 61685955 62625278 63293514 63782227 64348770
1418.6 64348770 63728600 63620346 63716915 63782318 63644024 62843143 62416939 62017090 61410168 60774109
1428.3 60774109 60260422 59170486 58253410 57831066 56899860 55784958 54894489 54220211 52908436
1437 52908436 52701839 53235027 53331993 53310459 53258648 53285713 53369087 53146698 52899242 52537106 51925877
1447.6 51925877 50607189 50254025 50591110 50614979 50377895 49960709 49876499 49690559 49337994 49088791
1457.2 49088791 47837440 47320549 46180996 45082272 43012413 41386185 41226433 43056168 46109787
1465.9 46109787 47118076 47973045 47996773 47509827 46644814 45123241 44785912 48315395 53320671
1474.6 53320671 55741482 58891174 60756901 61917439 63020275 63581165 64182213 64159706 64577682
1483.2 64577682 64727310 64900681 65348930 65345703 65743851 66136826 66828575 66831314 67577759 68436409
1492.9 68436409 69006165 69830086 70284515 70246964 70709541 71089699 70824860 71184082 71427612 71303436
1502.5 71303436 71646461 72141159 73134216 72792862 70634682 70928902 71085289 71319626 71516518 71536812
1512.2 71536812 71134811 71380592 71464172 71424095 71168190 69832436 70606232 71222282 70681694 69298500
1521.8 69298500 68632591 69089920 69290146 68647079 68373253 68429420 67750381 67430222 67496559 67306664
1531.5 67306664 67291542 66751915 65502594 65753227 66080452 66530220 67223846 67502808 66302589 67730148
1541.1 67730148 68432610 68722908 69431595 69616264 69382179 69872604 70247917 70499603 70363884 69603081
1550.7 69603081 69791885 70066185 70194794 69151024 68851807 69635048 70336945 69905792 67065094
1559.4 67065094 65948296 66392509 66628731 66538345 66213936 65172623 64464516 64399117 64352600 64193504
1569.1 64193504 61983677 61549686 61488365 61086082 60879280 60942745 60921429 59091949 59466858 59824543
1578.7 59824543 59936493 60064323 60103794 60321480 60480721 60763218 61107479 61451759 61895256 62331059
1588.4 62331059 62844788 63169922 63437675 63674442 63911350 64144844 64122253 64226402 64192131 64198135
1598 64198135 64097679 63970772 63938442 63676525 63416466 62827927 62419735 62033047 61593163 61001831
1607.6 61001831 60475010 60033699 59468033 59497784 59181976 58793228 58298397 57878670 57241879 53509892
1617.3 53509892 52966049 51935764 50779392 49482590 48886505 48436859 47452908 47882336 48352257
1626 48352257 49486225 50577526 52042641 53437122 54801334 55996803 57060604 58109371 59181053
1634.6 59181053 59333340 59739307 60432167 60764305 61383457 61635078 61862751 62113201 62256943 62697273
1644.3 62697273 63141541 63106899 62782280 62583389 62536289 63022514 63564926 64181763 64488754 61484741
1653.9 61484741 62457264 62859486 63172264 63148170 63089664 63011200 62903706 63096153 62552448 61711533
1663.6 61711533 61689625 61668507 61427654 61333641 61424313 59830967 59026947 58712708 57512115 56994446
1673.2 56994446 56933842 55736092 53122501 52569332 51925045 51015980 49968472 48170414 47696465
1681.9 47696465 47828884 47487465 44808853 43988842 44518471 44501198 44296192 44096058 43835571 43860340
1691.5 43860340 43737068 43796577 43875935 44142128 42631760 42330044 42718376 43025036 43883152 41272858
1701.2 41272858 41968822 42351414 42734085 43271591 43715393 44523209 44981647 45894577 46511066 47120838
1710.8 47120838 47736019 48263626 49085922 49358349 50086693 50751671 51708927 51694698 52102707 52939587
1720.5 52939587 53323727 53766228 53770054 53701904 53726955 53681850 53674099 53519588 53714649 53174793 52918335
1731.1 52918335 53389263 53909588 54234329 52794022 53633770 54340332 55183079 56058052 56903236 57681839
1740.7 57681839 58778290 60133865 61114254 62216892 63255192 64367714 65220238 65856392 66453773
1749.4 66453773 67246735 67709373 67598473 68333015 68759491 69283257 69867752 69768906 70121880 70523712
1759 70523712 71105919 71799721 71696632 71718201 72366310 72873215 73200890 73729988 74118782 73843407
1768.7 73843407 74286842 75138031 75385315 74791908 74503029 75135628 75444260 75175919 75534676 75700981
1778.3 75700981 75840874 75843300 75439827 75621361 75846390 76040077 75857635 75704681 75920349 75932961
1788 75932961 76066521 76390755 76522850 76469139 75799828 75625038 76223579 76383591 76084534 76264030
1797.6 76264030 76549866 76387154 76065590 76274178 76067299 75874222 76081917 76036781 76017868 76033150
1807.3 76033150 75946899 76084740 76210068 75911270 75879723 76038879 76070580 76167801 76219307 76322464 76261436
1817.9 76261436 76295784 76494827 76508774 76625351 76572380 76752388 76993729 76326241 76376480 76847984
1827.5 76847984 77201866 77117981 76204437 76395897 76764809 76754356 76699486 76753105 76896194 76846657 76647537
1838.1 76647537 76679352 76731613 76796890 76831078 77095703 77185127 76105438 76352280 76799774 76692726
1847.8 76692726 76494438 76524147 76597687 76623398 76696442 76667137 76661217 76652718 76600227 76635689 76594116 76566719
1859.3 76566719 76594849 76625404 76562225 76533699 76543304 76602608 76782379 76790009 76809662 76451111 76053680
1869.9 76053680 76257660 76397064 76442169 76404510 76400551 76404533 76417580 76420776 76344933 76305214 76253616 76282181
1881.5 76282181 76261253 76284615 76290512 76166908 76177025 76178162 76348717 76311378 75802544 75871704 75980148
1892.1 75980148 75925453 76014389 75878510 75627518 75723122 75762016 75738884 75775955 75759911 75752579 75750977 75777863
1903.7 75777863 75698280 75615829 75681664 75686600 75615196 75576927 75451202 75388496 75502556 75484573 75476624 75454926
1915.3 75454926 75528358 75787720 75333237 75058868 75319672 75470970 75605637 75347084 75104347 75168526
1924.9 75168526 75145615 75099945 75062706 74993439 74927872 74904488 74882927 74836357 74766205 74763046 74740753 74702652
1936.5 74702652 74684196 74640625 74664810 74651672 74808258 74781288 74261559 74346405 74521484 74414925 74319931
1947.1 74319931 74329773 74383995 74327301 74254333 74212540 74192909 74231339 74210915 74140549 74175354 74215492 74197372
1958.7 74197372 74194069 74150604 74134270 74173912 74252815 74291199 74322136 74412987 74290329 74195549 74282852 74298096
1970.2 74298096 74294373 74288651 74283371 74318573 74358704 74346756 74339989 74370628 74349426 74313362 74290329 74323685
1981.8 74323685 74399689 74431946 74480057 74497871 74488686 74528130 74437820 74351868 74540703 74641403 74408112
1992.4 74408112 74392952 74541878 74558495 74557266 74573219 74607681 74653595 74629707 74609444 74649132 74695885 74641464
2004 74641464 74591682 74654266 74671349 74656532 74698616 74726868 74698090 74695419 74744835 74737694 74686707 74728813
2015.6 74728813 74747467 74588768 74520432 74575623 74620979 74634575 74600121 74560295 74492516 74492531 74560913 74544846
2027.1 74544846 74477890 74432091 74402596 74356422 74297279 74215820 74161583 74103760 73999603 73936066 73868774
2037.7 73868774 73763641 73664680 73525162 73332199 73254196 73145782 72882835 72676262 72487724 72287689
2047.4 72287689 72056091 71788460 71529854 71251167 70978561 70675186 70392677 70106102 69770721 69438126
2057 69438126 69076492 68683319 68305038 67938110 67575577 67249016 66873741 66421463 65934151 65500114
2066.7 65500114 65101280 64632889 64148972 63694927 63269619 62763561 62229813 61687859 61089188 60502743
2076.3 60502743 59846127 59185890 58536861 57866711 57141724 56378952 55629929 54842220 54083878 53343204
2086 53343204 52628773 51916592 51264977 50613869 49926224 49370464 48876659 48393570 47910625 47512646
2095.6 47512646 47109550 46761433 46481560 46173031 45964867 45742455 45620857 45562660 45535595 45564747
2105.2 45564747 45584064 45630215 45634972 45756996 45890659 46030651 46202312 46430626 46819710 47211876
2114.9 47211876 47711742 48269047 48884537 49526859 50145008 50794159 51412094 52019108 52571804 53179028
2124.5 53179028 53769981 54323959 54907593 55399117 55876778 56375042 56928936 57471107 57948170 58402027
2134.2 58402027 58810848 59244072 59690399 60138191 60564278 60969101 61384613 61775879 62178425 62603546
2143.8 62603546 63031013 63408546 63742870 64078613 64381256 64725533 65087158 65370499 65661133 65963020
2153.5 65963020 66238121 66525299 66821999 67096733 67340240 67572289 67841049 68126602 68365570 68603577
2163.1 68603577 68847038 69100807 69353622 69564148 69763977 69922134 70078079 70231934 70401062 70604202
2172.8 70604202 70732567 70824265 70917839 71056198 71175888 71233345 71353615 71448715 71481705 71547310 71607536
2183.4 71607536 71670090 71784904 71854347 71894600 71961288 71997292 72023582 72073471 72174400 72247353 72298103
2194 72298103 72355759 72390625 72446800 72457611 72467857 72500366 72556252 72650276 72707428 72729202 72731895 72810600
2205.5 72810600 72895271 72898407 72895073 72933189 72991051 73002205 73042999 73050354 72987114 72989868 73029404 72998268
2217.1 72998268 72957512 73013771 73052017 73051010 73077492 73112473 73113098 73071266 73039886 73062843 73127731 73117302
2228.7 73117302 73094154 73094002 73102913 73138832 73113235 73095749 73088181 73095230 73129219 73147911 73158691 73161385 73165771
2241.2 73165771 73108086 73091331 73109459 73051804 72998566 73013382 73036797 73001938 72999367 73012299 73034729 73025681
2252.8 73025681 73006599 73069153 73098061 73120239 73097542 73054337 73039772 73003967 73016899 73049667 73021477 72950722
2264.4 72950722 72976761 72998055 72999924 73008797 72965652 73004478 73007553 72974922 72969254 72979233 73001999 73031120 73065376
2276.9 73065376 73013191 72996368 72987144 73015579 73054459 73058151 73091415 73047218 73062027 73041130 73067581 73154602
2288.5 73154602 73146347 73201134 73182823 73189255 73173012 73124969 73125862 73109009 73159546 73135185 73175453 73155968
2300 73155968 73082710 73106842 73070152 73092606 73088150 73127716 73109818 73039017 73008484 72892441 72904488 72876068
2311.6 72876068 72850830 72817848 72722893 72720795 72743652 72821602 72779190 72718269 72643860 72565063 72591927 72545891
2323.2 72545891 72459137 72320541 72326416 72406837 72470093 72492798 72492088 72572266 72475533 72364990 72392365 72475273
2334.8 72475273 72349030 72194534 72371658 72461517 72408798 72410301 72490379 72428116 72307274 72121132 71931595
2345.4 71931595 72104942 72194054 72340797 72612709 72690796 72597710 72447777 72442856 72537552 72357399 72136284
2356 72136284 72011253 71852455 71860939 71932144 71887192 71894005 71993698 71999481 71759491 71687614 71910149 72062027
2367.6 72062027 72093628 72086067 72092972 72081810 72134125 72298676 72401573 72381676 72408234 72491234 72514359 72550110
2379.1 72550110 72620773 72672310 72678246 72674820 72700935 72707916 72696930 72721222 72745468 72745445 72798363 72827148 72793396
2391.7 72793396 72780754 72763573 72749779 72730583 72705795 72675812 72628487 72576546 72542160 72566620 72600212 72608963
2403.2 72608963 72608543 72605721 72555138 72522240 72522026 72499702 72554596 72527008 72455048 72444862 72382942 72368149 72304031
2415.8 72304031 72219994 72231407 72248734 72275772 72298286 72294693 72256836 72260544 72287842 72285950 72307083 72325417
2427.3 72325417 72311707 72247955 72199852 72209824 72204514 72136787 72054070 72009155 71975967 71938965 71912346 71906258
2438.9 71906258 71907211 71947197 71965828 71937462 71948410 71930916 71897156 71859215 71811958 71825539 71815140 71716736
2450.5 71716736 71585999 71491272 71474045 71468689 71414673 71400238 71421524 71424347 71416496 71383438 71353561 71337517
2462.1 71337517 71356728 71340683 71299339 71293373 71230507 71117432 70995872 70968384 70942993 70789970 70645142
2472.7 70645142 70579956 70599152 70592819 70557281 70557098 70570740 70549225 70474655 70454590 70444168 70429428 70406349
2484.2 70406349 70367310 70353439 70270767 70144661 70048798 70007553 69976532 69939636 69887009 69817253 69847939
2494.8 69847939 69925659 69968018 69985344 69994759 69941833 69835838 69782722 69718704 69607811 69499641 69421844
2505.5 69421844 69330795 69244469 69174347 69119057 69112167 69097519 69163887 69188896 69134048 69140678 69082024 69030151
2517 69030151 68978020 68876205 68775604 68635628 68494995 68412895 68376694 68287544 68196632 68145744 68141617
2527.6 68141617 68173416 68197906 68255501 68240852 68219429 68234100 68178375 68106270 68044441 67987892 67926331 67897896
2539.2 67897896 67857307 67806168 67823128 67853477 67855614 67788071 67714211 67722786 67755066 67701988 67607346 67573265
2550.8 67573265 67557388 67520584 67450920 67414162 67442802 67489960 67474525 67393608 67360748 67305824 67252968 67256279
2562.4 67256279 67226120 67181816 67160591 67167007 67145988 67096786 67061996 67053429 67061707 67032372 67014496 67030716
2573.9 67030716 67002647 66962181 66964973 66944046 66883209 66815834 66753273 66695518 66632820 66602158 66576164 66566902
2585.5 66566902 66569916 66508278 66439369 66422462 66432762 66392776 66311195 66246315 66173370 66109108 66087013 66037354
2597.1 66037354 65948494 65933868 65961281 65979622 65954781 65907158 65952499 65963158 65880737 65825836 65815666 65786278
2608.6 65786278 65735687 65708611 65671509 65634071 65568459 65505127 65496948 65469696 65433731 65443634 65469231 65429398
2620.2 65429398 65351448 65245079 65157570 65160042 65148407 65073029 64967140 64906044 64879997 64884712 64868042 64793739
2631.8 64793739 64801765 64773636 64754402 64806564 64750946 64675972 64641670 64600883 64517830 64499039 64570396 64568298
2643.4 64568298 64532982 64526627 64526436 64497475 64477867 64450188 64372978 64343674 64319153 64229439 64149101 64118500
2654.9 64118500 64092644 64066666 64013527 63972286 64009735 64016792 64005547 63956806 63820049 63702087 63662392
2665.5 63662392 63698723 63720943 63725315 63757271 63770924 63759571 63769230 63756020 63690327 63696354 63730877 63706898
2677.1 63706898 63659992 63621433 63551842 63406734 63296307 63216267 63139938 63056412 62946808 62917740 62886227
2687.7 62886227 62773853 62637848 62514629 62435867 62370804 62299019 62270401 62307987 62293575 62190994 62088573
2698.3 62088573 62030605 61994995 61925201 61870766 61836834 61774582 61744568 61764729 61735310 61635605 61566837 61557671
2709.9 61557671 61544079 61471119 61413479 61406857 61359505 61311398 61277836 61172592 61077099 61038502 60979794 60956051
2721.5 60956051 60915623 60819405 60760880 60676697 60576984 60497604 60437145 60353573 60225769 60166725 60115608
2732.1 60115608 60037750 59966911 59899601 59862000 59861462 59872097 59833576 59798229 59710732 59600983 59585587 59587914
2743.7 59587914 59545364 59433464 59410305 59430462 59422268 59479317 59434505 59338379 59288910 59234352 59179100 59113400
2755.2 59113400 59031975 58976677 58966385 58863541 58775806 58711430 58548286 58467072 58411503 58298927 58150780
2765.8 58150780 57973721 57851521 57731518 57579391 57440613 57304192 57156620 57029667 56891586 56717049
2775.5 56717049 56541515 56417339 56289566 56073502 55907398 55742481 55539204 55403393 55220299 54984146
2785.1 54984146 54777542 54608589 54414108 54200893 54005421 53777012 53571381 53401276 53229877 53010063
2794.8 53010063 52759007 52540733 52313793 52081238 51845261 51586849 51299519 51024452 50787128 50538334
2804.4 50538334 50302502 50080650 49808758 49513874 49238117 48947784 48665703 48353718 48003704 47741825
2814 47741825 47506382 47217293 46891594 46514431 46169350 45928684 45648335 45279026 44926041 44546677
2823.7 44546677 44110283 43629986 43162991 42748695 42282909 41728142 41141232 40507881 39792171 39067738
2833.3 39067738 38284569 37422462 36503113 35429123 34323280 33221863 31953140 30444086 28826296
2842 28826296 27146315 25267170 23239561 21170856 19218842 17521595 16327900 15876496 16155558
2850.7 16155558 16911459 17729212 18469252 19093832 19616648 20020014 20434410 20856630 21210400 21595751
2860.3 21595751 21823967 21997862 22142506 22158770 22167488 22156794 22109114 21998137 21927271 21882063 21930040
2870.9 21930040 22063629 22225742 22521402 22730679 22862223 23007162 23160540 23262852 23263937 23277407
2880.6 23277407 23303562 23312399 23215242 23101633 22955347 22851128 22837954 22660063 22531542 22508043 22459032
2891.2 22459032 22355089 22247425 22190287 22079897 21986691 21859343 21738325 21611643 21465731 21330473
2900.8 21330473 21118860 20953028 20737936 20483564 20200060 19831303 19447687 18971258 18410557 17760628
2910.5 17760628 17068743 16284292 15442624 14711884 14141110 13762002 13578876 13666307 13894814 14226674
2920.1 14226674 14663684 15181869 15704268 16136810 16653133 17127754 17486305 17914215 18475632 19075939
2929.8 19075939 19638029 20162806 20605583 21106585 21752216 22455980 23168066 23974770 24890295 25752468
2939.4 25752468 26457592 27018986 27473223 27789360 28113729 28634193 29365915 30092863 30597536 30919546
2949.1 30919546 30958221 30689383 30330393 30101067 30230333 30921343 32076099 33413761 34843624
2957.7 34843624 36130608 37139889 37969482 38721680 39493858 40397293 41512424 42733467 43983341
2966.4 43983341 45191910 46354935 47403637 48393188 49363815 50178249 51005798 51785728 52501503
2975.1 52501503 53205654 53808990 54461994 55107601 55651287 56106453 56597496 57177204 57657974 58033085
2984.7 58033085 58381718 58728645 59053547 59359402 59626591 59849079 60075657 60294918 60508514 60672810
2994.4 60672810 60812168 60941868 61091892 61304256 61448261 61535038 61615467 61691353 61755875 61814533 61884087
3005 61884087 61905182 61999016 62126759 62171329 62214088 62258846 62320602 62321198 62300354 62351566 62377689 62406620
3016.6 62406620 62455112 62461994 62437431 62468727 62510033 62479721 62433777 62408318 62405090 62363049 62355858 62360600
3028.1 62360600 62350857 62420406 62392643 62365055 62443958 62478947 62511330 62597603 62725048 62755970 62765713 62903603
3039.7 62903603 63065559 63174553 63259232 63356541 63451881 63561657 63604481 63678444 63826614 63834316 63857204
3050.3 63857204 63930294 63980022 64040413 64099831 64227531 64331551 64323563 64301163 64357849 64420456 64510185
3060.9 64510185 64628487 64645119 64668915 64727715 64816635 64857216 64853188 64940941 64985939 65055733 65143494 65138054
3072.5 65138054 65150414 65239395 65319466 65305298 65353920 65447205 65501114 65569481 65602638 65632164 65663734 65668060
3084.1 65668060 65679710 65745255 65808777 65825195 65785889 65714294 65768349 65891251 65968643 65979942 65967171
3094.7 65967171 65984970 65979027 66053658 66156052 66182159 66211525 66193436 66149368 66174103 66243965 66276642 66263367
3106.2 66263367 66286911 66366989 66424133 66376877 66331192 66415215 66441399 66335297 66282623 66275848 66345482 66430305
3117.8 66430305 66368515 66370972 66501511 66569946 66534897 66517868 66603188 66678535 66699768 66713722 66785210 66894791
3129.4 66894791 66939430 66996758 67112831 67165451 67175011 67210220 67210876 67282242 67430855 67518105 67586304 67572495
3141 67572495 67565018 67628716 67654434 67796005 67925850 67873077 67832382 67867119 67919388 67974747 68033287 68043793
3152.5 68043793 68040192 68065804 68090477 68115662 68137321 68237747 68330284 68321609 68321060 68351898 68419006 68450859
3164.1 68450859 68461319 68480690 68498550 68584724 68636513 68630913 68584763 68582428 68684372 68704124 68670502 68684990
3175.7 68684990 68800812 68863693 68737206 68731102 68834839 68841347 68815254 68888535 68992325 68990753 68970619
3186.3 68970619 69000847 69103882 69230881 69263481 69239670 69272728 69268066 69182350 69234558 69378357 69456863
3196.9 69456863 69392990 69354172 69512367 69544807 69471336 69454674 69443214 69442764 69474701 69601395 69650124 69654884
3208.5 69654884 69647926 69593605 69668335 69770645 69854973 69814011 69722610 69725616 69752853 69911781 69939644 69806618
3220 69806618 69820023 69951187 70046707 69982986 69911804 69899422 69941765 69955627 69919067 69930748 69914856 69974884
3231.6 69974884 69989685 69932617 69954842 69916534 69858414 69834007 69861893 69838539 69730927 69717964 69719910 69678001
3243.2 69678001 69687729 69672401 69557503 69541466 69521835 69432953 69431259 69367043 69325005 69392677 69468788 69463745
3254.8 69463745 69379059 69319534 69212944 69180061 69186287 69160149 69206406 69187714 69149208 69146446 69118179 69078026
3266.3 69078026 69052216 69029747 69019051 69051064 68986145 68944702 68982567 68880615 68848404 68883102 68780571
3276.9 68780571 68745461 68754616 68754623 68808380 68738472 68631638 68618217 68581444 68474792 68379875 68320366 68186768
3288.5 68186768 68093758 68070251 68030045 67950981 67844627 67825737 67711761 67486465 67316978 67174774 66989563
3299.1 66989563 66763634 66611855 66407341 66164452 65932861 65672485 65439255 65152496 64917587 64588524
3308.8 64588524 64097229 63683022 63266869 62863205 62432320 61990372 61562458 61081459 60643711 60169720
3318.4 60169720 59745766 59488914 59217369 58848907 58563496 58516602 58539902 58629173 58754078 58923748
3328.1 58923748 59266323 59602448 60013973 60518036 60953777 61326630 61716621 62170044 62565182 62982800
3337.7 62982800 63437172 63823715 64155449 64466080 64855659 65260010 65624283 66001663 66337784 66629707
3347.3 66629707 66939346 67314453 67757820 68113678 68403816 68769188 69047302 69255211 69534492 69820625
3357 69820625 70049095 70201889 70365295 70530441 70698853 70922455 71114243 71251549 71308876 71389832
3366.6 71389832 71487526 71504875 71587387 71715874 71836052 71820168 71793190 71962753 72008965 72023697 72108200
3377.2 72108200 72116486 72209900 72272644 72203377 72220657 72340706 72373466 72314644 72322411 72443993 72507401 72549896
3388.8 72549896 72637329 72620941 72696938 72759979 72687904 72704376 72769493 72857346 72830231 72858185 72937317 72857849
3400.4 72857849 72819664 72871712 72911507 72871056 72821045 72665985 72578133 72713287 72794411 72776764 72698570
3411 72698570 72833519 72836578 72586060 72583336 72606163 72616760 72586639 72615028 72651360 72442207 72370277 72464462
3422.6 72464462 72512093 72433304 72418243 72468994 72410233 72323166 72307426 72381058 72284523 72160675 72118805
3433.2 72118805 72156075 72249168 72172585 72092163 72011635 72050453 72133408 72185265 72213982 71938339 71765198
3443.8 71765198 71762947 71991943 72162361 71700050 71506905 71546478 71496918 71532410 71515701 71492180 71540451
3454.4 71540451 71602882 71551300 71426201 71403656 71418800 71372490 71327484 71244080 71115112 71063179 71103745
3465 71103745 71184326 71136581 71039856 70994537 70981468 71051773 70967789 70826675 70859634 70828674 70694977 70706726
3476.6 70706726 70788338 70747162 70712715 70769394 70744011 70510941 70375290 70564964 70674095 70577599 70528320
3487.2 70528320 70435585 70375885 70410698 70332588 70275291 70318939 70263268 70098114 70032028 70049744 69955978
3497.8 69955978 69923004 69922806 69948784 70163696 70147446 69843781 69728661 69705971 69632927 69700203 69896118
3508.4 69896118 69688744 69369911 69472954 69486633 69420860 69489258 69501907 69490417 69510109 69487823 69485085
3519 69485085 69475815 69560966 69796555 69665520 69224892 69204727 69358101 69455231 69520958 69473076 69444824
3529.6 69444824 69469322 69392921 69415848 69492241 69534027 69724342 69637505 69398781 69487518 69570091 69607765
3540.2 69607765 69643074 69742699 69815460 69873505 69888596 69751236 69760101 69624908 69685150 69870918 69992943
3550.8 69992943 70076958 69701118 69662857 69747284 69859108 70035828 69833557 69873871 69965416 69853645 69789711
3561.4 69789711 69978203 69989143 69889038 70517593 70393196 69658768 69289261 69053688 69508797 69558846
3571.1 69558846 69561073 69714676 69801964 69770966 69783157 69869888 69623756 69788345 69742203 69452339 69607376
3581.7 69607376 69747742 69712685 69675804 70218773 70108887 69519165 69541168 68999588 69293655 69623718
3591.3 69623718 69998772 70013969 69790230 69961769 69376953 69632141 69952003 69790131 69900246 69658012
3601 69658012 69669495 69713524 69695724 69934280 70448441 70786514 70400635 70588364 70181396 70207184 71387383
3611.6 71387383 71403412 70673836 70792336 70525734 71294403 72007103 71684196 71518074 71012733 71086670
3621.2 71086670 71441719 71672188 72008240 72243279 72338676 72592178 73463814 72831833 70757195 71509148
3630.9 71509148 72255791 72941154 72787743 72453423 72838898 73125237 73097786 72876434 73027771 73281258
3640.5 73281258 73441399 73221252 73095764 73515892 73996735 74648308 74287025 73818596 74491112 73697311
3650.1 73697311 72557419 72738503 73628593 74106689 74566681 74850685 73368050 73636299 74267532
3658.8 74267532 74411736 74408646 74315277 74523994 74571068 74585861 74643890 74752464 75307510 75599197 75457108
3669.4 75457108 74990128 73633667 74099121 75406891 76694221 75679901 72334625 73442284 74703468
3678.1 74703468 75225204 74676048 74733696 75089584 75231071 75360413 75232391 75290924 76021545 76803307
3687.8 76803307 75096062 74820145 75893867 74671188 74710930 75329552 75372704 75527718 75436081 75346024
3697.4 75346024 75453621 75535629 75869957 76103172 75088646 74775162 75434074 75617798 75608261 75673965
3707 75673965 76034660 76294220 75435432 76269440 76533905 74529297 75141953 75552780 75484749 75636772
3716.7 75636772 76004570 76052185 75405418 75625786 76392296 75540787 75032845 75836723 75795082 75565224
3726.3 75565224 75114319 75170052 75723869 75965958 76559509 75835861 75133476 76542847 76597946 75156303
3736 75156303 75083466 75150620 75159981 75618126 76081390 75498718 75837601 77040977 74238739 73377243
3745.6 73377243 75314079 76081230 76849167 76420807 75333328 76554687 75167107 74292763 75052635
3754.3 75052635 75698761 75962173 75192657 75702553 76165665 74561394 74605148 75318619 75506866 75640373
3763.9 75640373 76089195 75593246 74852509 75404350 76215347 76078453 74782585 75123383 75445084 75460907
3773.6 75460907 75677200 75565079 75580833 75716240 76098618 76003143 74925987 75232697 75460709 75573784
3783.2 75573784 75757767 75291870 75257477 75434570 75543312 75556953 75448906 75467094 75450401 75462074 75457436
3793.8 75457436 75754417 76062355 75249474 74747398 75229942 76004097 76821259 75731903 74090546
3802.5 74090546 74519730 75064713 75927750 76577347 74777771 74433113 75222610 75386604 75314636 75413132
3812.2 75413132 75407211 75584877 76417480 75764687 73938103 75074509 76013115 76679367 76544342 73444687
3821.8 73444687 73846977 74769524 75341522 75911835 75739807 74990944 75176651 75513695 75946281 75863823
3831.4 75863823 74646347 75237747 76065979 75266571 75412811 76366432 74997444 74657112 75424278
3840.1 75424278 74437668 74851791 75824020 75263428 74722725 75160965 75427505 75580421 75871414 75809013
3849.8 75809013 76253090 77079041 76006882 75277306 73236145 74135788 75528191 75179283 74789673
3858.4 74789673 75155090 75546112 75810524 75242477 75501953 76305992 74944740 74210426 74969528 75839867
3868.1 75839867 76480415 74494690 73379662 74352875 75449890 75731483 74136139 74477715 75058411
3876.8 75058411 75145294 75612106 76249855 75090179 74107674 74974663 75014938 75330620 75871895 74008606
3886.4 74008606 74315613 74879845 75186462 75782959 75324768 74254059 74564835 74821518 74618439 74837891
3896.1 74837891 75021767 75390404 75567284 74451805 75248116 75407112 74736679 75307632 74621117 74209045
3905.7 74209045 74085793 74328865 74773964 74781769 74876549 74881378 74957314 74967308 74846565 75027031 75130226
3916.3 75130226 74491371 74159660 74683899 74532242 74258232 74749084 75021698 75158417 74653664 74117424
3926 74117424 74373322 74661446 74783432 74607590 74636009 74840034 74502136 74396103 74584984 74545013
3935.6 74545013 74576630 74651718 74577446 74497299 74457893 74747620 74785500 74096245 74145241 74399666 74593323
3946.2 74593323 74714516 74340805 74455254 74504372 74169861 74371796 74462303 74334557 74367737 74450607
3955.8 74450607 74338615 74087273 74149536 74260071 74325836 74320526 74098122 74087708 74145241 74160393 74213547
3966.5 74213547 74202988 74171005 74030350 73979980 74069847 73990440 73919273 73923180 73886368 73874573 73813629 73846809
3978 73846809 73954124 73854500 73758133 73863464 73871353 73755226 73798271 73848122 73797104 73799629 73811722 73843033
3989.6 73843033 73842964 73775101 73782570 73807205 73713684 73605225 73689003 73764412 73723320 73753395 73745552
4000.2 73745552
##END=$$ End of the data block
