##TITLE=Brometo de Potassio - Pastilha do sal puro $$ Begin of the data block
##JCAMP-DX=5.00 $$ ACD/SpecManager v 10.08
##SPECTROMETER/DATA SYSTEM=Alpha
##DATE=25 Jun 2015 13:30:02
##DATA TYPE=INFRARED SPECTRUM
##DATA CLASS=XYDATA
##ORIGIN=
##OWNER=
##NPOINTS=1765
##FIRSTX=399.76428223
##LASTX=3997.64306641
##MAXX=3997.64306641
##MINX=399.76428223
##MAXY=0.90439236
##MINY=0.69478828
##XFACTOR=1.0000000000
##YFACTOR=1.000000000000000e-9
##FIRSTY=0.86411905
##DELTAX=2.03961372
##XUNITS=1/CM
##YUNITS=ARBITRARY UNITS
##XYDATA=(X++(Y..Y))
$$ plain form
399.8 864119053 864358306 865099490 865458071 864304543 863935232 864961445 864949286 864074707 863672554 863316298
420.2 863316298 863347054 864400685 864908338 864269912 864469886 865101039 864388525 863974810 864757657 864583611
440.6 864583611 863918960 864573121 864997923 864496887 864896953 865664661 865179300 864851415 865571320 865496516
461 865496516 865158617 865926504 866147101 865282536 865430295 866179109 865858853 865835428 866632342 866441429
481.3 866441429 865947247 866733372 867134690 866393328 866434753 866898060 866257966 865864456 866220772 865702212
501.7 865702212 865117073 865763783 865956783 865149558 865140498 865447164 864566684 863954723 864518106 864388347
522.1 864388347 863695979 864014149 864313483 863759816 863706827 863974273 863335788 862804472 863125563 862863958
542.5 862863958 862054229 862126231 862324655 861780286 861669719 862010002 861598492 861138225 861494899 861561298
$$ packed form
399.8H64119053K39253P41184L58581j153528l69311J026213j2159q74579m02153l56256
420.2H63316298L0756J053631N07653o38426J99974O31153p12514m13715P82847j74046
440.6H64583611o64651O54161M24802n01036M00066P67708m85361l27885P19905p4804
461H65496516l37899P67887K20597q64565J47759P48814l20256k3425P96914j90913
481.3H66441429m94182P86125M01318p41362M1425M63307o40094l93510L56316n18560
501.7H65702212n85139O46710J93000q07225r060L06666q80480o11961N63383j29759
522.1H64388347o92368L18170K99334n53667n2989K67446o38485n31316L21091k61605
542.5H62863958q09729P2002J98424n44369j10567L40283m11510m60267L56674O6399
$$ plain form
562.9 861561298 861103058 861232340 861537874 861263573 861256301 861732960 861716866 861568034 862076581 862418771
583.3 862418771 862295508 862714231 863362134 863413930 863614142 864335179 864675403 864803076 865576088 866385162
603.7 866385162 866647661 867137194 867905140 868179440 868350029 868905187 869234145 869477570 870452106 871559858
624.1 871559858 872157454 873007715 874108315 874596298 874975860 875939488 876694381 877033293 877793849 878696501
644.5 878696501 879115820 879621804 880478382 880971789 881250262 881920815 882452309 882507086 882932901 883931339
664.9 883931339 884790242 885210037 885612488 885857105 886005163 886647642 887376130 887586594 887965858 888613939
685.3 888613939 888699174 888686895 889271140 889640152 889505386 889715135 890198886 890308917 890421808 890840113
705.7 890840113 890951633 890958667 891516507 891983747 891953051 892264903 892837226 892849922 892867088 893428862 893724978
$$ packed form
562.9H61561298m58240J29282L05534k74301p272M76659j6094j48832N08547L42190
583.3H62418771j23263M18723O47903N1796K00212P21037L40224J27673P73012Q09074
603.7H66385162K62499M89533P67946K74300J70589N55158L28958K43425R74536J107752
624.1H71559858N97596Q50261J100600M87983L79562R63628P54893L38912P60556R02652
644.5H78696501M19319N05984Q56578M93407K78473O70553N31494N4777M25815R98438
664.9H83931339Q58903M19795M02451K44617J48058O42479P28488K10464L79264O48081
685.3H88613939Q5235j2279N84245L69012j34766K09749M83751J10031J12891M18305
705.7H90840113J11520P034N57840M67240l0696L11852N72323J2696J7166N61774K96116
$$ plain form
728.1 893724978 893646359 894033909 894511282 894424260 894528627 895071685 895153284 895044148 895483851 895755947
748.5 895755947 895512879 895666063 896111131 896062195 896047533 896523535 896671653 896487653 896821499 897214293
768.9 897214293 897069633 897134066 897543788 897517323 897432506 897958875 898402035 898376226 898654163 899113297
789.3 899113297 899071515 899148166 899741471 899989009 899915576 900366902 900907576 900926530 901108801 901623070
809.7 901623070 901699245 901667833 902180910 902521789 902361870 902586937 903073132 902983904 902875364 903254807
830.1 903254807 903289020 902951837 903172612 903589308 903485358 903560162 904061973 904055536 903769076 904066145
850.5 904066145 904298723 903970301 904005229 904392362 904162228 903812289 904135585 904266298 903850555 903877854
870.9 903877854 904111028 903720081 903443873 903814793 903877735 903571486 903802812 904049098 903641999 903511941
$$ packed form
728.1H93724978p8619L87550M77373q7022J04367N43058Q1599j09136M39703K72096
748.5H95755947k43068J53184M45068m8936j4662M76002J48118j84000L33846L92794
768.9H97214293j44660O4433M09722k6465q4817N26369M43160k5809K77937M59134
789.3H99113297m1782P6651N93305K47538p3433M51326N40674J8954J82271N14269
809.7I01623070P6175l1412N13077L40879j59919K25067M86195q9228j08540L79443
830.1I03254807L4213l37183K20775M16696j03950P4804N01811o437k86460K97069
850.5I04066145K32578l28422L4928L87133k30134l49939L23296J30713m15743K7299
870.9I03877854K33174l90947k76208L70920O2942l06249K31326K46286m07099j30058
$$ plain form
891.3 903511941 903855145 903633356 903240681 903570592 903775930 903375983 903431952 903855026 903625786 903318882
911.7 903318882 903608680 903561831 903030574 903089941 903339386 902925372 902727425 903119087 902975440 902468264
932.1 902468264 902637005 902797580 902249098 902023196 902282119 901940763 901420176 901534736 901395857 900636852
952.5 900636852 900380492 900490701 899957120 899452984 899626255 899420619 898706436 898601532 898657203 897990406
972.9 897990406 897495151 897586763 897131801 896261930 896090508 896018744 895317733 894980729 895205081 894874275
993.3 894874275 894342601 894540906 894625902 894029260 893827319 894012630 893551946 893048525 893217742 893034697
1013.7 893034697 892266691 892095923 892220736 891667008 891271353 891537130 891303957 890630126 890683949 890880108
1034.1 890880108 890368044 890180886 890649557 890496969 889940202 890108585 890269339 889802814 889846265 890402436
$$ packed form
891.3I03511941L43204k21789l92675L29911K05338l99947N5969M23074k29240l06904
911.7I03318882K89798m6849n31257N9367K49445m14014j97947L91662j43647n07176
932.1I02468264J68741J60575n48482k25902K58923l41356n20587J14560j38879p59005
952.5I00636852k56360J10209n33581n04136J73271k05636p14183j04904N5671o66797
972.9H97990406m95255R1612m54962q69871j71422p1764p01011l37004K24352l30806
993.3H94874275n31674J98305Q4996n96642k01941J85311m60684n03421J69217j83045
1013.7H93034697p68006j70768J24813n53728l95655K65777k33173o73831N3823J96159
1034.1H90880108n12064j87158M68671j52588n56767J68383J60754m66525M3451N56171
$$ plain form
1054.5 890402436 890252650 889948487 890403032 890641093 890286684 890494943 891009450 890761554 890530348 890991986
1074.9 890991986 891043305 890622556 890881360 891253233 890856385 890698254 891180754 891118884 890686393 890974343
1095.3 890974343 891223192 890699685 890526891 890864372 890539587 889996529 890187204 890220404 889687538 889810801
1115.7 889810801 890442431 890393317 890277803 890830040 890982389 890603185 891061783 891998589 892212152 892442107
1136.1 892442107 893260896 893542409 893272102 893563092 893889487 893494308 893371582 893795967 893609524 893086791
1156.5 893086791 893244207 893338263 892782807 892674625 893125117 893078625 893037975 893775940 894285321 894187450
1176.9 894187450 894609630 895350993 895384014 895408332 896084785 896360934 896066308 896321893 896756589 896475613
1197.3 896475613 896336913 896832705 896886230 896556497 896889091 897309184 897084594 897164881 897762716 897768497
$$ packed form
1054.5H90402436j49786l04163M54545K38061l54409K08259N14507k47896k31206M61638
1074.9H90991986N1319m20749K58804L71873l96848j58131M82500o1870m32491K87950
1095.3H90974343K48849n23507j72794L37481l24785n43058J90675L3200n32866J23263
1115.7H89810801O31630m9114j15514N52237J52349l79204M58598R36806K13563K29955
1136.1H92442107Q18789K81513k70307K90990L26395l95179j22726M24385j86443n22733
1156.5H93086791J57416R4056n55456j08182M50492m6492m0650P37965N09381r7871
1176.9H94187450M22180P41363L3021K4318O76453K76149k94626K55585M34696k80976
1197.3H96475613j38700M95792N3525l29733L32594M20093k24590Q0287N97835N781
$$ plain form
1217.7 897768497 897471309 897801399 898027301 897625208 897611141 897996783 897749066 897381127 897688270 897769332
1238.1 897769332 897304296 897375584 897745848 897423863 897116184 897451401 897436261 896956861 897045851 897286594
1258.4 897286594 896848142 896570086 896869123 896710455 896219134 896395683 896695971 896458745 896548510 897119164
1278.8 897119164 897151113 896983206 897450566 897754669 897434354 897512794 897952974 897776783 897497356 897825956
1299.2 897825956 897883117 897374392 897309721 897495091 897055149 896638691 896812797 896660030 896116972 896227717
1319.6 896227717 896591902 896386206 896353722 896796703 896731794 896330893 896456838 896409929 895658135 895509720
1340 895509720 896226764 896410286 896188736 896447778 896579683 896178603 896125495 896394670 896032989 895352840
1360.4 895352840 895241916 895283580 894964397 894838810 894727051 893844604 893027365 892995358 892508388 891115844
$$ packed form
1217.7H97768497k97188L30090K25902m02093j4067L85642k47717l67939L07143Q1062
1238.1H97769332m65036P1288L70264l21985l07679L35217j5140m79400Q8990K40743
1258.4H97286594m38452k78056K99037j58668m91321J76549L00288k37226Q9765N70654
1278.8H97119164L1949j67907M67360L04103l20315P8440M40180j76191k79427L28600
1299.2H97825956N7161n08725o4671J85370m39942m16458J74106j52767n43058J10745
1319.6H96227717L64185k05696l2484M42981o4909m00901J25945m6909p51794j48415
1340H95509720P17044J83522k21550K59042J31905m01080n3108K69175l61681o80149
1360.4H95352840j10924M1664l19183j25587j11759q82447q17239l2007m86970j392544
$$ plain form
1380.8 891115844 890005648 889902771 890652597 892090976 893318236 893250406 892592192 892693400 893004417
1399.2 893004417 892961085 893082857 893492281 893622994 893595815 893951714 894099832 893487811 892804325 892779768
1419.6 892779768 892956972 893098235 893506050 893488407 892964125 893072546 893306851 892758667 892798543 893765867
1440 893765867 894090891 893777013 893664539 893636703 893394172 893212855 892776310 891406775 890885174 892177880
1460.4 892177880 892971575 892812550 893209159 893977880 893706858 893042803 893570423 894465685 894948900 895467997
1480.8 895467997 895958841 895789206 895182490 894934833 895219207 895579100 895636618 895418286 895383418 895829320
1501.2 895829320 896084964 894975662 893704593 894669771 895855129 895979166 895639718 895496428 895176470
1519.5 895176470 894823194 895283818 895737827 895890653 896255195 896292210 895898283 895808220 895366192 894001782
$$ packed form
1380.8H91115844j110196j02877P49826J438379J227260o7830o58214J01208L11017
1399.2H93004417m3332J21772M09424J30713k7179L55899J48118o12021o83486k4557
1419.6H92779768J77204J41263M07815j7643n24282J08421K34305n48184L9876R67324
1440H93765867L25024l13878j12474k7836k42531j81317m36545j369535n21601J292706
1460.4H92177880P93695j59025L96609P68721k71022o64055N27620Q95262M83215N19097
1480.8H95467997M90844j69635o06716k47657K84374L59893N7518k18332l4868M45902
1501.2H95829320K55644j109302j271069R65178J185358J24037l39448j43290l19958
1519.5H95176470l53276M60624M54009J52826L64542L7015l93927r0063m42028j364410
$$ plain form
1539.9 894001782 893507659 894438207 895444453 895646214 895414174 895321548 894856215 893579900 891997576
1558.3 891997576 892203867 893394291 893904984 893852949 893146157 892445207 892380595 891758025 890506923 890124738
1578.7 890124738 889984310 889109671 887877643 886727333 885316551 883498430 881733596 880007446 877971411
1597 877971411 875820041 873739183 871421337 868852019 866375566 863890290 861180127 858391881 855311215
1615.4 855311215 852257192 850408018 849042892 847406387 845862210 844654799 843892217 843426824 843056798
1633.7 843056798 843654752 845566213 847548246 849447668 851205289 852878213 855431736 858085692
1650.1 858085692 860089481 863354087 867515802 870753288 873025179 875122130 877613068 879480064
1666.4 879480064 880507886 881981909 883715808 884865582 886160195 887598276 888192117 887923360 888444901
$$ packed form
1539.9H94001782m94123R30548J006246K01761k32040r2626m65333j276315j582324
1558.3H91997576K06291J190424N10693n2035p06792p00950o4612o22570j251102l82185
1578.7H90124738j40428q74639j232028j150310j410782j818121j764834j726150k036035
1597H77971411k151370k080858k317846k569318k476453k485276k710163k788246l080666
1615.4H55311215l054023j849174j365126j636505j544177j207411p62582m65393l70026
1633.7H43056798N97954J911461J982033J899422J757621J672924K553523K653956
1650.1H58085692K003789L264606M161715L237486K271891K096951K490938J866996
1666.4H79480064J027822J474023J733899J149774J294613J438081N93841k68757N21541
$$ plain form
1684.7 888444901 890065312 891162395 891955316 892449439 892019510 891351998 891286373 891970217 893041611
1703.1 893041611 893870115 894626796 895170450 895370126 895330489 894822538 894434094 895335019 896473467 896847069
1723.5 896847069 897002280 897201896 897020698 896369159 895894647 896433413 896989226 897123754 897381365 897540689
1743.9 897540689 897441208 897315443 897209585 897464514 898053408 898368895 898326397 898210585 898354769 898651242
1764.3 898651242 898554444 898294687 898054242 897785425 898139775 898812711 898961842 898791611 898899257 899085939
1784.7 899085939 899088681 898947835 898579538 898282349 898512244 898918688 898938596 898733258 898951769 899365246
1805.1 899365246 899338663 899074018 899124742 899346411 899359643 899358213 899458647 899312139 898956537 898865461 898849666
1827.5 898849666 898654461 898848951 899233222 899217308 899150610 899268627 899028957 898477435 898524046 898931026
$$ packed form
1684.7H88444901J620411J097083P92921M94123m29929o67512o5625O83844J071394
1703.1H93041611Q28504P56681N43654J99676l9637n07951l88444R00925J138448L73602
1723.5H96847069J55211J99616j81198o51539m74512N38766N55813J34528K57611J59324
1743.9H97540689r9481j25765j05858K54929N88894L15487m2498j15812J44184K96473
1764.3H98651242r6798k59757k40445k68817L54350O72936J49131j70231J07646J86682
1784.7H99085939K742j40846l68297k97189K29895M06444J9908k05338K18511M13477
1805.1H99365246k6583k64645N0724K21669J3232j430J00434j46508l55602r1076j5795
1827.5H98849666j95205J94490L84271j5914o6698J18017k39670n51522M6611M06980
$$ plain form
1847.9 898931026 899051785 899107218 899253726 899224818 899053752 899050057 899074614 898834229 898425519 898160756
1868.3 898160756 898256123 898572087 898840606 898869932 898692191 898645163 898736119 898618042 898346543 898199558
1888.7 898199558 898173094 898111165 898139834 898300946 898265898 898108840 898092926 897996008 897735596 897682905 897810876
1911.1 897810876 897735000 897489190 897301257 897170842 897047400 897121489 897308826 897250473 897147655 897178411
1931.5 897178411 897052526 896847427 896854639 896774352 896398962 896259010 896429181 896387935 896240056 896307111
1951.9 896307111 896320641 896108150 895995259 896000504 895835221 895631611 895617723 895616293 895508230 895480633 895476639
1974.4 895476639 895289779 895160675 895261705 895241618 895021379 894920349 894839764 894556046 894442201 894658506
1994.8 894658506 894693792 894487798 894431412 894419014 894232213 894148350 894255936 894186616 893970370 893900216 893785477
$$ packed form
1847.9H98931026J20759N5433J46508k8908j71066l695K4557k40385m08710k64763
1868.3H98160756R5367L15964K68519K9326j77741m7028R0956j18077k71499j46985
1888.7H98199558k6464o1929K8669J61112l5048j57058j5914r6918k60412n2691J27971
1911.1H97810876p5876k45810j87933j30415j23442P4089J87337n8353j02818L0756
1931.5H97178411j25885k05099P212q0287l75390j39952J70171m1246j47879O7055
1951.9H96307111J3530k12491j12891N245j65283k03610j3888j430j08063k7597l994
1974.4H95476639j86860j29104J01030k0087k20239j01030q0585k83718j13845K16305
1994.8H94658506L5286k05994n6386j2398j86801q3863J07586o9320k16246p0154j14739
$$ plain form
2017.2 893785477 893436730 893091857 892654896 892065287 892094672 892824769 893268406 893241525 893331051 893530428
2037.6 893530428 893444836 893294096 893384993 893401325 893239737 893266737 893398523 893306732 893236756 893373013 893364966
2060 893364966 893198431 893240452 893361747 893277645 893236995 893372774 893348396 893206477 893311262 893468320 893404663
2082.5 893404663 893405139 893540621 893493891 893417180 893590510 893724382 893647969 893674135 893805683 893773615 893760681
2104.9 893760681 893958271 894033730 893894792 893921435 894058943 894002140 893977582 894160748 894221663 894128680 894197702
2127.3 894197702 894303739 894234896 894244015 894405425 894399226 894279957 894355834 894455135 894370258 894383609 894559145
2149.8 894559145 894566894 894467056 894527197 894588828 894531786 894603729 894765377 894678533 894470155 894520760 894678533
2172.2 894678533 894692004 894774675 894935846 894910693 894853532 894948244 894948244 894833565 894909799 895057142 894987404 894906223
$$ packed form
2017.2H93785477l48747l44873m36961n89609K9385P30097M43637k6881Q9526J99377
2037.6H93530428q5592j50740R0897J6332j61588K7000J31786r1791o9976J36257q047
2060H93364966j66535M2021J21295q4102m0650J35779k4378j41919J04785J57058o3657
2082.5H93404663M76J35482m6730p6711J73330J33872p6413K6166J31548l2068j2934
2104.9H93760681J97590P5459j38938K6643J37508n6803k4558J83166O0915r2983O9022
2127.3H94197702J06037o8843R119J61410o199j19269P5877R9301q4877J3351J75536
2149.8H94559145P749r9838O0141O1631n7042P1943J61648q6844k08378N0605J57773
2172.2H94678533J3471Q2671J61171k5153n7161R4712%j14679P6234J47343o9738q1181
$$ plain form
2196.7 894906223 895010591 895043969 894969642 895059466 895167232 895057201 894995213 895109177 895099998 895003676 895088315
2219.1 895088315 895170033 895059288 895022810 895118058 895066321 894984484 895108640 895177424 895037174 895001113 895090461
2241.6 895090461 895035923 894977689 895099521 895148993 895043612 895061672 895144761 895054936 895006776 895142734 895162761
2264 895162761 895038188 895048916 895106554 895029008 895006597 895104408 895063400 894915044 894916356 894971550 894938290 895007551
2288.5 895007551 895184457 895185232 895091236 895190597 895331204 895326138 895412266 895622969 895685554 895701230 895887792
2310.9 895887792 896059752 896144748 896390557 896700978 896776199 896796882 897003949 897182941 897256017 897404850
2331.3 897404850 897479773 897275269 897026181 896931350 896793664 896527648 896378338 896448374 896676660 897129178
2351.7 897129178 897752941 898202062 898490548 898819387 898836195 898344755 897768974 897291541 896764159 896285892
$$ packed form
2196.7H94906223J04368L3378p4327Q9824J07766j10031o1988J13964r179r6322Q4639
2219.1H95088315Q1718j10745l6478R5248n1737q1837J24156O8784j40250l6061Q9348
2241.6H95090461n4538n8234J21832M9472j05381J8060Q3089q9825m8160J35958K0027
2264H95162761j24573J0728N7638p7546k2411R7811m1008j48356J312N5194l3260O9261
2288.5H95007551J76906P75r3996R9361J40607n066Q6128K10703O2585J5676J86562
2310.9H95887792J71960Q4996K45809L10421P5221K0683K07067J78992P3076J48833
2331.3H97404850P4923k04504k49088r4831j37686k66016j49310P0036K28286M52518
2351.7H97129178O23763M49121K88486L28839J6808m91440n75781m77433n27382m78267
$$ plain form
2372.1 896285892 895929396 895481408 894930184 894532084 894295335 894054472 893890560 893909395 893904150 893774092
2392.5 893774092 893718958 893741846 893704057 893712461 893818796 893806875 893662810 893601894 893587589 893505275 893493831
2414.9 893493831 893566608 893503070 893362761 893355072 893362999 893284857 893306375 893402815 893333733 893198848 893215299
2437.4 893215299 893243015 893178344 893185318 893234611 893154204 893034279 893007815 892980337 892918110 892926276 892951846 892876506
2461.8 892876506 892792881 892792881 892763734 892713726 892770767 892796874 892661154 892557263 892563760 892510593 892432749 892489433
2486.3 892489433 892544985 892429769 892327011 892354608 892332971 892284453 892353535 892370701 892233551 892155409 892170966
2508.7 892170966 892127633 892106235 892190039 892183840 892041087 891968489 891965926 891915739 891919374 892007768 891955554 891772568
2533.2 891772568 891716421 891745865 891703248 891693354 891744077 891696811 891587436 891548038 891529202 891483784 891493380 891520023
$$ packed form
2372.1H96285892l56496m47988n51224l98100k36749k40863j63912J8835n245j30058
2392.5H93774092n5134K2888l7789Q404J06335j1921j44065o0916j4305q2314j1444
2414.9H93493831P2777o3538j40309p689P927p8142K1518R6440o9082j34885J6451
2437.4H93215299K7716o4671O974M9293q0407j19925k6464k7478o2227Q166K5570p5340
2461.8H92876506q3625%k9147n0008N7041K6107j35720j03891O497n3167p7844N6684
2486.3H92489433N5552j15216j02758K7597k1637m8518O9082J7166j37150p8142J5557
2508.7H92170966m3333k1398Q3804o199j42753p2598k563n0187L635Q8394n2214j82986
2533.2H91772568n6147K9444m2617r894N0723m7266j09375l9398j8836m5418R596K6643
$$ plain form
2557.7 891520023 891423404 891294837 891296923 891326368 891288042 891297877 891341686 891279578 891169310 891125500 891083658
2580.1 891083658 891034126 891084552 891129553 891021848 890906036 890902698 890900850 890860558 890862823 890873134 890811026 890729785
2604.6 890729785 890683174 890613675 890556753 890609562 890659630 890583932 890509129 890507817 890474081 890430629 890456259 890441000
2629.1 890441000 890301347 890192151 890192032 890166283 890119076 890126407 890079796 889936090 889840186 889827967 889802933
2651.5 889802933 889776766 889777005 889718235 889604926 889561713 889581919 889572263 889580309 889631450 889598608 889487624 889465392
2676 889465392 889513552 889476538 889393449 889366031 889295101 889151216 889086902 889075935 889032722 889048994 889106333 889039218
2700.5 889039218 888891637 888842881 888847172 888800800 888777792 888774753 888691783 888590872 888591051 888617396 888581395 888600647
2724.9 888600647 888626218 888470292 888276398 888227463 888228774 888207614 888221502 888216913 888111353 888060212 888139188
$$ packed form
2557.7H91520023r6619j28567K086K9445l8326R835M3809o2108j10268m3810m1842
2580.1H91083658m9532N0426M5001j07705j15812l338j848m0292K265J0311o2108q1241
2604.6H90729785m6611o9499n6922N2809N0068p5698p4803j312l3736m3452K5630j5259
2629.1H90441000j39653j09196j19k5749m7207P331m6611j43706r5904j2219k5034
2651.5H89802933k6167K39n8770j13309m3213K0206r656Q046N1141l2842j10984k2232
2676H89465392M8160l7014q3089k7418p0930j43885o4314j0967m3213J6272N7339o7115
2700.5H89039218j47581m8756M291m6372k3008l039q2970j00911J79K6345l6001J9252
2724.9H88600647K5571j55926j93894m8935J311k1160J3888m589j05560n1141P8976
$$ plain form
2747.4 888139188 888129652 887998760 887950718 887942374 887823820 887719989 887711108 887669802 887625277 887638688 887578368
2769.8 887578368 887454867 887451947 887467504 887314618 887172043 887180150 887158155 887096405 887170315 887232482 887107074
2792.2 887107074 887000918 887038887 886978149 886704922 886465013 886354327 886272848 886264443 886260033 886059046 885783195
2814.7 885783195 885671973 885629535 885528743 885491788 885505259 885370970 885159314 885098636 885124385 885110021 885133624
2837.1 885133624 885032415 884546876 883961380 883638442 883407712 883036673 882680595 882465839 882294893 882266879
2857.5 882266879 882448554 882557392 882517099 882527232 882526934 882458091 882545352 882659018 882433951 882084727 881959021
2879.9 881959021 881897211 881701827 881508172 881415427 881301641 881212294 881263852 881213903 880910158 880664110
2900.3 880664110 880593479 880474687 880340934 880338967 880339086 880215645 879992545 879593194 878993750 878478408 878267229
$$ packed form
2747.4H88139188r536j30892m8042q344j18554j03831q881m1306m4525J3411o0320
2769.8H87578368j23501k920J5557j52886j42575Q107k1995o1750P3910O2167j25408
2792.2H87107074j06156L7969o0738k73227k39909j10686q1479q405m410k00987k75851
2814.7H85783195j11222m2438j00792l6955J3471j34289k11656o0678K5749j4364K3603
2837.1H85133624j01209m85539n85496l22938k30730l71039l56078k14756j70946k8014
2857.5H82266879J81675J08838m0293J0133k98o8843Q7261J13666k25067l49224j25706
2879.9H81959021o1810j95384j93655r2745j13786q9347N1558m9949l03745k46048
2900.3H80664110p0631j18792j33753j967J19j23441k23100l99351n99444n15342k11179
$$ plain form
2922.8 878267229 878200948 878257871 878570080 878839672 878866315 878953874 879230320 879478037 879743636 880219698
2943.2 880219698 880628943 880663574 880585134 880665183 880645454 880418837 880317926 880380690 880435348 880502939 880531371
2965.6 880531371 880422354 880340576 880473435 880662680 880758166 880941808 881159663 881085217 880858898 880805850
2986 880805850 880867958 881018519 881264925 881349444 881237924 881115258 880980074 880820155 880715728 880747020
3006.4 880747020 880903661 881115377 881321609 881329596 881034315 880688190 880495310 880368590 880182683 879993320
3026.8 879993320 879927218 879927218 879942238 879908204 879693329 879540324 879662991 879725933 879458189 879119039 878987610
3049.2 878987610 878872216 878592610 878347218 878141224 877848625 877662897 877684534 877730548 877636433 877392292
3069.6 877392292 877095640 876882255 876938939 877159595 877102017 876755118 876455069 876157284 875826120 875612199
$$ packed form
2922.8H78267229o6281N6923L12209K69592K6643Q7559K76446K47717K65599M76062
2943.2H80219698M09245L4631p8440Q0049j9729k26617j00911O2764N4658O7591K8432
2965.6H80531371j09017q1778J32859J89245R5486J83642K17855p4446k26319n3048
2986H80805850O2108J50561K46406Q4519j11520j22666j35184j59919j04427L1292
3006.4H80747020J56641K11716K06232P987k95281l46125j92880j26720j85907j89363
3026.8H79993320o6102%J5020l4034k14875j53005J22667O2942k67744l39150j31429
3049.2H78987610j15394k79606k45392k05994k92599j85728K1637M6014r4115k44141
3069.6H77392292k96652k13385N6684K20656n7578l46899l00049k97785l31164k13921
$$ plain form
3090 875612199 875334144 874861419 874503672 874433041 874324799 873978972 873691976 873623788 873503089 873186231
3110.4 873186231 872967303 872995734 873015463 872871995 872444153 871706426 871085465 870827675 870640159 870293856
3130.8 870293856 869906425 869597077 869373679 869184554 868817985 868256211 867783546 867492259 867278874 867069721
3151.2 867069721 866716325 866108537 865389526 864796698 864380896 863942683 863376856 862822890 862321973 861779630
3171.6 861779630 861230493 860712826 860111058 859427154 858791709 858182967 857539415 856927693 856299043 855517030
3192 855517030 854674339 853908718 853162348 852401376 851717353 851057768 850259125 849377692 848603129 847886443
3212.4 847886443 847107768 846360207 845647037 844796598 843849301 842989862 842193663 841412306 840784132 840194464
3232.8 840194464 839249372 838051736 837032795 836207867 835466087 834864855 834228456 833308220 832339287
$$ packed form
3090H75612199k78055m72725l57747p0631j08242l45827k86996o8188j20699l16858
3110.4H73186231k18928K8431J9729j43468m27842p37727o20961k57790j87516l46303
3130.8H70293856l87431l09348k23398j89125l66569n61774m72665k91287k13385k09153
3151.2H67069721l53396o07788p19011n92828m15802m38213n65827n53966n00917n42343
3171.6H61779630n49137n17667o01768o83904o35445o08742o43552o11722o28650p82013
3192H55517030q42691p65621p46370p60972o84023o59585p98643q81433p74563p16686
3212.4H47886443p78675p47561p13170q50439r47297q59439p96199p81357o28174n89668
3232.8H40194464r45092j197636j018941q24928p41780o01232o36399r20236r68933
$$ plain form
3251.1 832339287 831623733 831028402 830363929 829685509 829025090 828327417 827708960 827324510 827059209 826597929
3271.5 826597929 825862050 825002670 824121714 823351264 822674751 821941793 821180999 820490718 819866657 819200933
3291.9 819200933 818397403 817388654 816145062 814914703 813997984 813276052 812319458 810893953 809136271
3310.3 809136271 807332337 805698752 804158926 802524567 800827920 799218059 797639310 795829535
3326.6 795829535 793792665 791736960 789669871 787648559 785769761 783762515 781439126 779009342
3342.9 779009342 776530087 774016678 771653056 769214630 766378403 763402045 760640264 758023024
3359.2 758023024 755254388 752378106 749771118 747374833 744688094 741557360 738406181 735566378
3375.5 735566378 732957065 730474174 728060007 725728929 723609805 721785247 720229089 718626082
$$ packed form
3251.1H32339287p15554n95331o64473o78420o60419o97673o18457l84450k65301m61280
3271.5H26597929p35879q59380q80956p70450o76513p32958p60794o90281o24061o65724
3291.9H19200933q03530j008749j243592j230359r16719p21932r56594j425505j757682
3310.3H09136271j803934j633585j539826j634359j696647j609861j578749j809775
3326.6G95829535k036870k055705k067089k021312j878798k007246k323389k429784
3342.9G79009342k479255k513409k363622k438426k836227k976358k761781k617240
3359.2G58023024k768636k876282k606988k396285k686739l130734l151179k839803
3375.5G35566378k609313k482891k414167k331078k119124j824558j556158j603007
$$ plain form
3391.9 718626082 716685534 714726448 713258862 712112606 710551023 708463967 706590533 705247641
3408.2 705247641 704063594 702809453 701491416 700127840 698892057 697911501 697084188 696382999 695938349
3426.5 695938349 695724010 695489943 695287883 695324600 695322812 695035338 694788277 694904625 695289493 695757210
3446.9 695757210 696307719 696991563 697773576 698654056 699677944 700756490 701722264 702776074 704215765
3465.3 704215765 705772281 706976473 707795799 708593190 709662020 711053729 712473035 713604033 714714050
3483.6 714714050 716025054 717287004 718484163 719835877 721311033 722801864 724258006 725644886
3500 725644886 726959765 728166223 729333282 730620921 732154310 733978927 735734522 737099826 738368809
3518.3 738368809 739871800 741580784 743237376 744718313 746239066 747909784 749670208 751549184
$$ packed form
3391.9G18626082j940548j959086j467586j146256j561583k087056j873434j342892
3408.2G05247641j184047j254141j318037j363576j235783r80556q27313p01189m44650
3426.5F95938349k14339k34067k02060L6717j788k87474k47061J16348L84868M67717
3446.9F95757210N50509O83844P82013Q80480J023888J078546R65774J053810J439691
3465.3G04215765J556516J204192Q19326P97391J068830J391709J419306J130998J110017
3483.6G14714050J311004J261950J197159J351714J475156J490831J456142J386880
3500G25644886J314879J206458J167059J287639J533389J824617J755595J365304J268983
3518.3G38368809J502991J708984J656592J480937J520753J670718J760424J878976
$$ plain form
3534.6 751549184 753405571 755108774 756872177 758694708 760364652 761957705 763634562 765367031
3551 765367031 767174184 769099057 771021903 772881567 774701118 776282787 777644932 779590905 782336354
3569.3 782336354 784904063 787020385 789178193 791539848 793992758 796505809 798853934 800809205
3585.6 800809205 802874148 805567145 808278024 810670912 813160300 815854192 818443358 820887864
3601.9 820887864 823140562 824986815 826786697 828964055 831276119 833502710 835464120 837396920
3618.3 837396920 839913905 842484593 844242334 845037580 845787585 847739100 849997342 851778328 853264213
3636.6 853264213 854549170 855688691 856589198 856921792 856718481 857021093 858633220 860260069 861073971
3655 861073971 861891866 863066435 863915682 864310741 864433527 864116371 863596678 863513649 863353252 863173902
$$ packed form
3534.6G51549184J856387J703203J763403J822531J669944J593053J676857J732469
3551G65367031J807153J924873J922846J859664J819551J581669J362145J945973K745449
3569.3G82336354K567709K116322K157808K361655K452910K513051K348125J955271
3585.6H00809205K064943K692997K710879K392888K489388K693892K589166K444506
3601.9H20887864K252698J846253J799882K177358K312064K226591J961410J932800
3618.3H37396920K516985K570688J757741P95246P50005J951515K258242J780986J485885
3636.6H53264213J284957J139521R00507L32594k03311L02612J612127J626849Q13902
3655H61073971Q17895J174569Q49247L95059J22786l17156n19693q3029j60397j79350
$$ plain form
3675.4 863173902 863966227 865082204 865916133 866442382 866519213 866367519 866611958 867483377 868534505
3693.7 868534505 869314492 869604528 869490743 869534552 870025039 870298386 869924724 869252443 869176626 869915485
3714.1 869915485 870615005 870848358 870730519 870566666 870567501 870774150 870943427 870621741 869845629 869338870
3734.5 869338870 869856894 870827973 870849013 869694531 868913472 869177580 869036138 868881822 869741023 870568335
3754.9 870568335 870702446 870728135 871063530 871268570 871229410 871147573 871036232 871205449 871626675 871806145
3775.3 871806145 871654630 871523142 871526122 871447861 871425748 871564925 871673942 871675611 871455669 871025264 870531440
3797.7 870531440 869945645 869792700 870122492 870227814 870544255 871099949 871089876 870443523 869927526 869731843
3818.1 869731843 869374871 869550765 870162368 870388567 870397508 870287478 870083213 869855165 869381785 868938565
$$ packed form
3675.4H63173902P92325J115977Q33929N26249P6831j51694K44439Q71419J051128
3693.7H68534505P79987K90036j13785M3809M90487K73347l73662o72281p5817P38859
3714.1H69915485O99520K33353j17839j63853Q35K06649J69277l21686p76112n06759
3734.5H69338870N18024R71079K1040j154482p81059K64108j41442j54316Q59201Q27312
3754.9H70568335J34111K5689L35395K05040l9160q1837j11341J69217M21226J79470
3775.3H71806145j51515j31488K980p8261k2113J39177J09017J669k19942m30405m93824
3797.7H70531440n85795j52945L29792J05322L16441N55694j0073o46353n15997j95683
3818.1H69731843l56972J75894O11603K26199Q941j10030k04265k28048m73380m43220
$$ plain form
3838.5 868938565 869065881 869594693 870213807 870591104 870309114 869035125 867480636 867792487 869171381
3856.9 869171381 869786918 869594038 869175673 869047105 868895710 868522584 868568003 869019568 869467914 869579911
3877.3 869579911 869218647 868963540 868929863 869006038 869240105 869181871 869089007 869411469 869504452 868960857
3897.7 868960857 868256509 867870390 868027329 868781090 869521976 869754255 869683027 869474471 869120359 868944108
3918.1 868944108 869117379 869235039 869145572 869174659 869232774 869043171 868959010 869248331 869487762 869401753
3938.5 869401753 869158864 868994772 868961632 868920386 868902206 869001508 869111061 869163871 869175494 869121790 869041562
3960.9 869041562 869069338 869160473 869169593 869149923 869123757 869064808 869101048 869220853 869236469 869201303 869247615
3983.3 869247615 869242609 869156063 869151175 869180441 869133651 869087517 869098485
$$ packed form
3838.5H68938565J27316N28812O19114L77297k81990j273989j554489L11851J378894
3856.9H69171381O15537j92880m18365j28568j51395l73126M5419M51565M48346J11997
3877.3H69579911l61264k55107l3677P6175K34067n8234r2864L22462R2983n43595
3897.7H68960857p04348l86119J56939P53761P40886K32279p1228k08556l54112j76251
3918.1H68944108J73271J17660q9467K9087N8115j89603q4161K89321K39431q6009
3938.5H69401753k42889j64092l3140m1246j8180R9302J09553N2810J1623n3704q0228
3960.9H69041562K7776R1135R120j9670k6166n8949L6240J19805J5616l5166M6312
3983.3H69247615n006q6546m888K9266m6790m6134J0968
$$ plain form
3997.6 869098485
$$ packed form
3997.6H69098485
##END=$$ End of the data block
