##TITLE=Breno - Epoxido $$ Begin of the data block
##JCAMP-DX=5.00 $$ ACD/SpecManager v 10.08
##SPECTROMETER/DATA SYSTEM=Alpha
##DATE=28 Apr 2015 09:23:26
##DATA TYPE=INFRARED SPECTRUM
##DATA CLASS=XYDATA
##ORIGIN=
##OWNER=
##NPOINTS=1765
##FIRSTX=399.76428223
##LASTX=3997.64306641
##MAXX=3997.64306641
##MINX=399.76428223
##MAXY=1.01415765
##MINY=0.33974913
##XFACTOR=1.0000000000
##YFACTOR=0.000000010000000
##FIRSTY=1.00000000
##DELTAX=2.03961372
##XUNITS=1/CM
##YUNITS=ARBITRARY UNITS
##XYDATA=(X++(Y..Y))
399.8 100000000 99945325 100932229 101415765 100733197 100245893 100451434 100000000 99685436 99563146 100231683
420.2 100231683 100292099 99710292 99699831 100279701 100223219 99473828 99298203 99791884 99769807 99261844
440.6 99261844 99393898 100000000 99928093 99293888 99325639 99875516 99794585 99201596 99197030 99556321 99241894
463 99241894 98566163 98594576 99074519 98866278 98167539 98136175 98485458 98184657 97553736 97607744 97992158
485.4 97992158 97673786 97007442 96938121 97080016 96462661 95467806 95059252 94910467 94090945 92962492
505.8 92962492 92372912 91955340 90832418 89319998 88288474 87669921 87137628 87278879 88556218
524.2 88556218 90138096 90767390 90634102 90762568 91156483 91115767 90853453 91145581 91783208 91942722
544.6 91942722 91667765 91737056 92239159 92418283 92165941 92272216 92770433 92770511 92252862 92087412 92191231
567 92191231 91516453 89998227 88931835 89181495 90058702 90627974 91139436 91754198 91783845 91173875
587.4 91173875 90784556 90679061 89904952 88438374 87501663 87443435 87078345 85761148 84318626 83561510
607.8 83561510 83133817 82332706 81641424 82435942 84711337 86776620 87921911 88504815 88488561 88148493
628.2 88148493 88210809 88448966 88124347 87702519 88096988 89013964 89558715 89580971 89690626 90158695
648.6 90158695 90331852 89767295 89117682 88947105 88680172 87725097 86620742 86020625 85387528 83695757
669 83695757 81831443 80097151 77670103 75190371 75037086 77021211 77606833 75805146 73980629
687.3 73980629 73299241 73287904 74030983 75506312 76882172 77447575 76718915 74374753 70607853
705.7 70607853 65963578 61751515 60376734 62902796 67539108 72108626 76070666 79843962 83581144
724.1 83581144 86889964 89593488 92076564 94245183 95301735 95532995 96355653 97782838 98367912
742.4 98367912 97667217 96528691 95371246 93603420 91248918 90120494 91499263 93753135 94572818
760.8 94572818 93713993 92640460 92811996 93927634 94761568 94901919 94095540 92136371 89784062
779.1 89784062 87851137 86004370 83759928 82025921 82098633 83631617 85636735 87952292 90224034
797.5 90224034 91496921 91306573 90070629 88336730 86419195 85004991 84894317 85807353 86427701
815.8 86427701 85566264 83098167 80168539 78499901 78538013 78850996 78394526 77189690 74948496
834.2 74948496 71741879 69060391 68289900 69334567 71901459 75880122 79916197 82463068 83831650
852.6 83831650 85282713 87290323 89348000 90804219 91920102 93434584 95040429 95859265 96006763
870.9 96006763 96108615 96095532 95577848 94747061 94017053 93198639 91957790 90772700 90466893 91058958
891.3 91058958 91936052 92742825 93485433 94034964 94083965 93712825 93361992 93042564 92277509 90976858
911.7 90976858 89659953 88701683 88032317 87705398 88085628 89193201 90440011 91374302 92151701
930.1 92151701 92931837 93426919 93462813 93422699 93627793 93764830 93534398 93335032 93579668 93937129
950.5 93937129 93935227 93736660 93712884 93678570 93265790 92777371 92738611 92933244 92850184 92563665 92446965
972.9 92446965 92443997 92208523 91818452 91658801 91684723 91493833 91067159 90773243 90614992 90188712
993.3 90188712 89467740 88818711 88252634 87517750 86659247 85991991 85636216 85237414 84544575 83825254
1013.7 83825254 83192533 82180399 80350345 77910709 75663888 74210769 73175114 72030467 71152794
1032 71152794 71259028 72645730 75108093 78137416 81107229 83500648 85252309 86596078 87514049
1050.4 87514049 87800157 87600225 87327427 87101811 86683559 85853809 84566194 82972604 81711930
1068.8 81711930 81717557 83193189 85118407 86244267 86334085 85926282 85274041 84124130 82341325
1087.1 82341325 80214977 78046954 75962329 74365753 74081093 75518996 77903593 80058289 81654948
1105.5 81654948 82805157 83459240 83968562 84923607 86279970 87413502 87925237 88057917 88209629
1123.8 88209629 88339978 88200861 87872916 87608832 87328428 86751002 85913593 85147554 84650350 84363961
1144.2 84363961 84176129 83949661 83378446 82122636 80174762 77949798 76011550 74816602 74618167
1162.6 74618167 75278801 76045763 76016182 75026751 73641914 72389537 71651053 71914428 73414963
1180.9 73414963 75859851 78461969 80388659 81567532 82441801 83116615 83487725 83769733 84187698
1199.3 84187698 84500819 84376997 83884794 83239269 82383865 81195766 79897511 78865045 78135335
1217.7 78135335 77431929 76534396 75355941 73816675 71968818 70158422 68719429 67551160 66275555
1236 66275555 64702272 62869143 60774958 58411014 56012857 54033256 52845502 52505094 52848595
1254.4 52848595 53841466 55680603 58492547 62023693 65778357 69335908 72378916 74658483 76105005
1272.7 76105005 76829952 76920992 76474720 75792563 75230920 74980056 75145423 75688565 76227748 76238972
1293.1 76238972 75503546 74275309 73010463 71998972 71263701 70566696 69585621 68464339 67740887
1311.5 67740887 67538834 67438501 67063928 66463304 65941238 65635413 65684980 66582185 68732828 71735007
1331.9 71735007 74545252 76414347 77320558 77670455 77846241 77950352 77960593 77931792 77925199 77838618
1352.3 77838618 77543950 77049875 76399040 75499815 74232119 72765535 71298808 69888777 68977243
1370.6 68977243 69042975 69789565 70215893 69832724 68834883 67565256 66212875 64694548 63054514
1389 63054514 61547458 60064894 58402705 56661522 54886329 53242540 51934522 50932240 50164038
1407.3 50164038 49449933 48642728 47775701 46975827 46300596 45869622 45959455 46846163 48660290 51331139
1427.7 51331139 54855144 58551723 61648715 64404196 66381770 66958463 66814196 66154236 64358729
1446.1 64358729 61103338 57954246 56698847 57677776 61359310 66549784 69538665 70956665 72082645
1464.5 72082645 73413527 74984527 76764667 78756136 80357289 81319839 81939560 82370132 82670450
1482.8 82670450 82818842 82760292 82500523 82265961 82221800 82272202 82236052 81847423 81036049 79848897
1503.2 79848897 77549285 72455657 66955185 62973136 60350579 60046726 62752140 67257017 71777928
1521.6 71777928 74174255 74394983 73559767 72139895 70094162 67117655 64117622 61182731 56631577
1539.9 56631577 51323938 47137603 43652540 40889993 38757953 37425163 36936834 37189651 39128235
1558.3 39128235 43000013 46131709 49332333 52848840 56354946 59735155 62007278 63444555
1574.6 63444555 64764023 65624893 65188390 62391979 57302320 51982838 47954708 44615698 40682974
1593 40682974 36464763 33974913 34445086 37127927 40533319 43613175 45990947 47654712 48818412
1611.3 48818412 49972767 51814657 54382992 56249732 57535928 59091896 60737330 62176007
1627.6 62176007 63243258 63667440 63369071 62103772 60493904 59448427 58957237 58980298 59551966
1646 59551966 60336936 60761023 61139125 61563438 61301744 60493600 59502488 58926380 59304368 60424221
1666.4 60424221 62035340 63656479 64536059 64883947 64932388 64764392 64565355 64568502 64988840 65525800
1686.8 65525800 66094404 66748774 67306554 67960954 68832886 70033395 71872044 73536986 75090426
1705.1 75090426 76646209 77688837 78316396 78737813 79042470 79211813 79125619 78878599 78559130 78160310
1725.5 78160310 77717096 77310282 77007598 76892483 76954740 77178615 77725726 78510743 79356778 80301136
1745.9 80301136 81374002 82553971 83607990 84374446 85060143 85694647 86186755 86659062 87057155
1764.3 87057155 87348151 87610388 87892443 88240671 88502204 88612950 88731796 88927430 89125115 89296246
1784.7 89296246 89467663 89648056 89872724 90120083 90289766 90445399 90656585 90876979 91058409 91223902
1805.1 91223902 91388959 91527975 91646945 91760838 91871661 91970426 92059171 92164409 92303425 92429447
1825.5 92429447 92504251 92625797 92794788 92910659 93006182 93135887 93269968 93382114 93519181 93667036
1845.9 93667036 93771189 93843412 93893689 93951517 94036829 94114006 94157231 94192827 94242907 94298995 94361705
1868.3 94361705 94415897 94447184 94474185 94496053 94520867 94565362 94609284 94624555 94624805 94653434 94687223 94671541
1892.8 94671541 94633019 94605345 94570118 94497275 94375509 94211888 94023585 93902647 93966526 94157952 94329792
1915.2 94329792 94426388 94438303 94404417 94414634 94490445 94604808 94746292 94896930 95031905 95133072 95213729
1937.7 95213729 95300066 95408821 95513707 95585138 95640510 95681840 95694804 95688760 95682341 95670944 95642710 95599478
1962.1 95599478 95559257 95539868 95540321 95555359 95594698 95656341 95727140 95816928 95932871 96054643 96149153 96203488
1986.6 96203488 96227640 96246034 96267557 96274155 96275729 96296030 96325755 96345598 96359551 96376872 96397328 96416676
2011.1 96416676 96437514 96473819 96526575 96565419 96576071 96578747 96604770 96685398 96792406 96881413 96959633 97031629
2035.6 97031629 97087306 97138852 97200722 97254652 97281677 97293210 97310531 97326553 97325230 97332132 97391617 97503507
2060 97503507 97626537 97740680 97854632 97967732 98063838 98141223 98220575 98309213 98386550 98444915 98503691
2082.5 98503691 98569793 98624814 98663634 98710591 98774850 98832011 98866200 98900646 98954839 99006259 99033725 99058408
2106.9 99058408 99104524 99152583 99182296 99209666 99253649 99303901 99336475 99357808 99398202 99452984 99490112 99513775
2131.4 99513775 99553108 99601090 99626297 99634719 99657249 99692297 99709785 99705160 99708778 99733305 99754190 99756527
2155.9 99756527 99760342 99773490 99774629 99759364 99754798 99773222 99792176 99798518 99807024 99830389 99851930 99854445 99859786
2182.4 99859786 99891198 99926579 99938309 99945074 99972165 100000000 100003707 99990118 99988961 99994057 99981624 99960202
2206.9 99960202 99958014 99969995 99964958 99939752 99921227 99912661 99886948 99841648 99810910 99802202 99781388 99739444
2231.4 99739444 99705553 99690354 99668598 99628472 99597472 99596655 99605131 99604583 99618185 99663782 99709475 99720991 99720007
2257.9 99720007 99731565 99730241 99690878 99638748 99611992 99603778 99583095 99556130 99555010 99572629 99574804 99564427
2282.3 99564427 99572092 99590898 99585831 99562871 99564087 99595028 99615997 99611586 99605554 99607074 99591672 99551058 99518120
2308.9 99518120 99513781 99511826 99481362 99439025 99412453 99380511 99313968 99233454 99172837 99140745 99130625 99137980
2333.3 99137980 99166167 99198925 99207604 99215704 99277186 99345773 99305642 99189490 99121159 99135101 99148560 99130815
2357.8 99130815 99130219 99154615 99160659 99157733 99179977 99206442 99197471 99162626 99146354 99148595 99127847 99081731 99049568
2384.3 99049568 99036402 99006051 98951191 98912078 98900479 98874563 98820734 98777771 98760068 98731095 98673451 98622787
2408.8 98622787 98601967 98577875 98528492 98486805 98474169 98459953 98422301 98391032 98390359 98392069 98364484 98324239
2433.3 98324239 98298150 98272622 98226058 98182398 98179358 98200387 98205650 98203820 98223805 98249310 98244423 98219323
2457.8 98219323 98211813 98218256 98203784 98168373 98141211 98126906 98103410 98067892 98049396 98055029 98050606 98027706
2482.2 98027706 98021877 98041552 98051405 98040193 98040718 98060805 98065293 98044854 98034316 98047745 98050267 98021036 97989625
2508.7 97989625 97976863 97957647 97915184 97873700 97852510 97827232 97771186 97710693 97678924 97656834 97615230 97568870
2533.2 97568870 97543514 97526062 97493398 97458947 97449023 97455579 97451067 97443444 97462112 97495568 97511679 97519726 97550595
2559.7 97550595 97596741 97625357 97637916 97661114 97687554 97686201 97661799 97644824 97642338 97636247 97625911 97637963
2584.2 97637963 97674483 97701579 97704077 97705954 97721606 97730720 97731531 97755718 97807437 97855395 97881699 97901112 97929680
2610.7 97929680 97954357 97959167 97956800 97963905 97972375 97970551 97970533 97989839 98018330 98038799 98060906 98098665 98137808
2637.2 98137808 98157126 98171461 98208946 98260838 98300380 98332137 98377311 98431265 98470265 98491967 98521405 98559070
2661.7 98559070 98579079 98583996 98595721 98615712 98626441 98618364 98604095 98593223 98573035 98535478 98495895 98466063
2686.2 98466063 98436201 98398274 98358971 98314548 98240310 98121196 97966927 97792226 97625506 97516280 97483420
2708.6 97483420 97489566 97493166 97490299 97502810 97548980 97623730 97706294 97782367 97838235 97854805 97831726 97790736
2733.1 97790736 97753054 97731578 97732860 97757202 97801995 97863710 97932494 97996432 98057532 98118848 98168790 98205233
2757.6 98205233 98241925 98282856 98318118 98339272 98352349 98364514 98365039 98340046 98288107 98208106 98086077 97908509
2782 97908509 97675502 97393036 97064137 96699572 96337897 96040505 95851308 95763963 95740938 95744324 95746702
2804.5 95746702 95736104 95716089 95693392 95659751 95594352 95478404 95296293 95033079 94675130 94198501 93567902
2826.9 93567902 92764491 91816735 90844262 90123665 90013349 90615052 91615808 92625254 93464023
2845.3 93464023 94098073 94536352 94822979 95038050 95253819 95491230 95737052 95972157 96171254 96307617
2865.7 96307617 96372718 96380949 96349931 96279389 96160710 95998573 95804965 95582587 95330071 95053130 94749403
2888.1 94749403 94396299 93979186 93515986 93038172 92572081 92144573 91782075 91491717 91261590 91106087
2908.5 91106087 91070741 91157484 91311097 91473383 91583991 91575146 91403377 91070288 90625250 90128976
2928.9 90128976 89610291 89098442 88679463 88469374 88484466 88557708 88464433 88109756 87555069 86925191
2949.3 86925191 86338866 85908294 85772544 86042678 86673135 87474543 88254404 88910103 89435053 89882314
2969.7 89882314 90305102 90695274 90996480 91179866 91255599 91225088 91077220 90814823 90463507 90064800
2990.1 90064800 89647239 89218926 88789576 88352668 87913620 87631333 87772423 88344306 89023572 89566380
3010.5 89566380 89965582 90245718 90342528 90170687 89789110 89458954 89442658 89786142 90362430 90997344
3030.9 90997344 91501957 91741943 91716582 91523278 91256094 90923357 90437329 89698577 88770670 87949753
3051.3 87949753 87515593 87470412 87608618 87746614 87848765 87998027 88268471 88618362 88969016 89377362
3071.7 89377362 89970493 90698659 91359258 91843045 92167443 92356735 92430776 92446470 92471623 92534786
3092.1 92534786 92635453 92762870 92876929 92938721 92954135 92963660 93019825 93144834 93300182 93425822 93504173
3114.5 93504173 93547624 93553776 93535203 93523097 93517101 93496847 93464720 93446493 93447316 93435502 93400222 93369889
3139 93369889 93353903 93320698 93254334 93185955 93136299 93085903 93019199 92951268 92896771 92839903 92764276 92685795
3163.4 92685795 92625493 92573482 92508453 92437464 92382109 92334706 92270184 92190909 92120081 92057091 91974568 91871393
3187.9 91871393 91779202 91701669 91615802 91522866 91441941 91371447 91292828 91203707 91123867 91063839 91000468 90917999
3212.4 90917999 90836793 90762430 90680361 90592021 90510035 90439171 90362972 90264970 90158862 90065956 89979255
3234.8 89979255 89880931 89782238 89699036 89614904 89517057 89420581 89339626 89262360 89168060 89065874 88980365
3257.3 88980365 88907403 88826054 88739032 88664877 88599098 88521141 88432860 88357013 88294238 88215870 88116860 88022089
3281.7 88022089 87935859 87837601 87723064 87613851 87519729 87418944 87293452 87159461 87031859 86891043
3302.1 86891043 86721385 86547542 86402619 86287069 86184770 86091065 85998708 85887945 85750157 85602230
3322.5 85602230 85461783 85316843 85148776 84968185 84797937 84639245 84470844 84283388 84092313 83906209
3342.9 83906209 83715695 83519566 83331722 83150440 82952631 82738018 82533479 82345223 82152259 81945920
3363.3 81945920 81746352 81562889 81373996 81171644 80981892 80818141 80661941 80501032 80346477 80212879
3383.7 80212879 80093682 79976183 79868656 79775804 79675293 79564780 79475296 79411393 79342300 79251194 79161841
3406.1 79161841 79098827 79050225 78992879 78928447 78877890 78851563 78834867 78809297 78789210 78799474 78831369 78862756
3430.6 78862756 78899640 78952253 79000062 79027325 79063570 79135364 79237211 79356968 79465419 79559004 79662794
3453.1 79662794 79777503 79904139 80050433 80205345 80355680 80510867 80680513 80840391 80973166 81109297
3473.4 81109297 81272852 81446958 81617272 81784457 81946391 82111919 82280958 82439530 82598108 82775706
3493.8 82775706 82965416 83138949 83305830 83510298 83715296 83861774 84014773 84226680 84442556 84622151
3514.2 84622151 84788883 84967840 85159826 85369366 85580766 85784209 85997683 86194706 86364931 86565018
3534.6 86565018 86793768 86983931 87144727 87343013 87605739 87859589 88025415 88185173 88400513 88592041
3555 88592041 88750285 88940161 89139885 89293021 89505792 89890218 90209752 90342641 90467960 90671641
3575.4 90671641 90919501 91174984 91388720 91550362 91796875 92202550 92499512 92627960 92829770 93127680
3595.8 93127680 93388265 93625849 93855733 94012713 94170123 94450086 94754958 95009506 95223349 95364523
3616.2 95364523 95614821 95969200 96099430 96027106 96051854 96490467 96951175 97017509 97035867 97126412 97219819
3638.7 97219819 97303915 97332132 97309798 97439826 97906816 98258430 98172110 98099011 98255825 98361182 98366010
3661.1 98366010 98367268 98308516 98259711 98441279 98624319 98603928 98806804 99043441 98998749 98903131 98799711
3683.5 98799711 98721790 98874128 99235517 99381709 99305755 99229831 99185401 99202943 99334776 99395794 99280638
3706 99280638 99178863 99303186 99592346 99641621 99472588 99355698 99365908 99425566 99474096 99507838 99444902
3728.4 99444902 99323636 99345011 99604040 99868888 99796987 99462646 99317229 99591452 99684316 99591988
3748.8 99591988 99806923 99979377 99825609 99672925 99710160 99747920 99672508 99630725 99643964 99730766 99831152
3771.2 99831152 99766976 99628890 99619633 99757791 99808347 99750352 99745399 99753308 99721283 99651426 99581248 99595678
3795.7 99595678 99597329 99616033 99797386 99821603 99770522 99843252 99769074 99567807 99503285 99631435 99665254
3818.1 99665254 99734098 99918997 99855065 99719095 99654913 99607253 99581879 99541157 99588299 99770606 99845147
3840.6 99845147 99810356 99765635 99624139 99360317 99179453 99513882 100000000 99894381 99592054 99434590
3861 99434590 99479061 99557614 99502105 99543792 99712551 99763358 99711853 99587196 99574578 99682504 99707615
3883.4 99707615 99774909 99777514 99694747 99763519 99792165 99633825 99515569 99563175 99714601 99901325 99981558
3905.8 99981558 99896079 99792916 99737674 99702954 99733615 99822515 99855721 99833900 99853158 99874741 99837315
3928.3 99837315 99842179 99924684 99956840 99912947 99867445 99862951 99910522 99936545 99928439 99962181 100000000 99997705
3952.7 99997705 99991214 99995363 99998128 100008416 100023675 100019276 100006723 100003779 100007939 100026786 100052309 100056398 100050485
3979.3 100050485 100060272 100070763 100059676 100038648 100029123 100029981 100031567 100032163 100035059
3997.6 100035059
##END=$$ End of the data block
