##TITLE=Benzocaina - Patricia e Janine $$ Begin of the data block
##JCAMP-DX=5.00 $$ ACD/SpecManager v 10.08
##SPECTROMETER/DATA SYSTEM=Alpha
##DATE=24 Apr 2015 08:22:40
##DATA TYPE=INFRARED SPECTRUM
##DATA CLASS=XYDATA
##ORIGIN=
##OWNER=
##NPOINTS=1765
##FIRSTX=399.76428223
##LASTX=3997.64306641
##MAXX=3997.64306641
##MINX=399.76428223
##MAXY=1.00644338
##MINY=0.22702438
##XFACTOR=1.0000000000
##YFACTOR=0.000000010000000
##FIRSTY=1.00000000
##DELTAX=2.03961372
##XUNITS=1/CM
##YUNITS=ARBITRARY UNITS
##XYDATA=(X++(Y..Y))
$$ plain form
399.8 100000000 100006592 100458550 100644338 100434065 100217140 100000000 99849790 99405110 98997086 98840106
420.2 98840106 98593807 98254049 98089713 97887909 97426051 96968216 96718168 96484631 96112305 95733523
440.6 95733523 95508331 95315075 94962227 94591373 94339675 94049054 93611616 93171281 92904425 92685097
461 92685097 92313087 91861403 91460162 91063172 90549505 90011686 89590800 89137661 88559103 87939012
481.3 87939012 87296253 86593413 85802150 84868348 83723658 82295442 80442792 77971661 74822593
499.7 74822593 71566576 70161027 72188503 76107246 78604758 78911161 78934318 79715550 80668026
518.1 80668026 81255710 81481147 81433362 81237543 81048602 80868584 80608958 80303997 80051643 79853851
538.5 79853851 79614460 79333460 79122406 78998774 78829414 78585905 78420061 78358704 78229713 77997893
$$ packed form
399.8A00000000O592M51958J85788k10273k16925k17140j50210m44680m08024j56980
420.2I8840106k46299l39758j64336k01804m61858m57835k50048k33537l72326l78782
440.6I5733523k25192j93256l52848l70854k51698k90621m37438m40335k66856k19328
461I2685097l72010m51684m01241l96990n13667n37819m20886m53139n78558o20091
481.3H7939012o42759p02840p91263r33802j144690j428216j852650k471131l149068
499.7G4822593l256017j405549K027476L918743K497512L06403K3157P81232R52476
518.1H0668026N87684K25437m7785j95819j88941j80018k59626l04961k52354j97792
538.5G9853851k39391k81000k11054j23632j69360k43509j65844o1357j28991k31820
$$ plain form
558.9 77997893 77859420 77850640 77788490 77626455 77547997 77610594 77618527 77489543 77429503 77518684 77538216 77430427
583.3 77430427 77395147 77507597 77548581 77419752 77347058 77431816 77434003 77221489 76997226 76853406 76564324
605.8 76564324 75981092 75301349 74668264 74010855 73766518 75610727 80855536 87593621 92136675
624.1 92136675 93364775 92904532 91936326 90656900 89210403 87245184 84784842 84327382 87132603
642.5 87132603 90248811 91518140 91616130 91607249 91923165 92281508 92342865 92376155 92742282 93140709
662.9 93140709 92939943 92037278 91854280 92714787 93039411 92891330 92956036 93136311 92986166 92680496
683.3 92680496 92613053 92509228 91773635 90334308 88262051 84737515 78896230 73005736 72243637
701.6 72243637 78291869 86604941 92471856 95572865 97297877 98089683 98255080 98461622 98896146
$$ packed form
558.9G7997893j38473q780o2150j62035p8458O2597P933j28984o0040Q9181J9532j07789
583.3G7430427l5280J12450M0984j28829p2694Q4758K187k12514k24263j43820k89082
605.8G6564324n83232o79743o33085o57409k44337J844209N244809O738085M543054
624.1I2136675J228100m60243r68206j279426j446497j965219k460342m57460K805221
642.5H7132603L116208J269329R7990q881L15916L58343O1357L3290L66127L98427
662.9I3140709k00766r02665j82998Q60507L24624j48081O4706J80275j50145l05670
683.3I2680496o7443j03825p35593j439327k072257l524536n841285n890494p62099
701.6G2243637O048232Q313072N866915L101009J725012P91806J65397K06542M34524
$$ plain form
720 98896146 99105567 98964530 98982507 99285513 99322593 98978972 98835975 99030095 98975980 98503757 98185319
742.4 98185319 98208189 97999853 97326159 96696126 96279281 95474035 93902689 91896272 89722008 86748129
762.8 86748129 81719685 73947310 64210618 55390632 51983416 56849164 67952418 79721481
779.1 79721481 88080907 92936522 95941561 97883141 98769104 99080992 99529660 100009286 100000000 99704373
799.5 99704373 99705315 99849868 99562949 98959678 98597854 98397148 97975099 97679222 98018366 98498917
819.9 98498917 98268753 97429430 96643627 95845985 94499856 92860866 91446334 89556193 85650432
838.3 85650432 78963000 70745540 64177257 61772060 64343536 71913314 81654418 89003766 92649359
856.6 92649359 94402599 95815456 96866411 97083801 96829915 96662176 96374238 95597225 94560212
$$ packed form
720I8896146K09421j41037J7977L03006L7080l43621j42997J94120n4115m72223l18438
742.4I8185319K2870k08336o73694o30033m16845q05246j571346k006417k174264k973879
762.8H6748129n028444p772375r736692q819986l407216M865748J1103254J1769063
779.1G9721481Q359426M855615L005039J941580Q85963L11888M48668M79626r286k95627
799.5I9704373R42J44553k86919o03271l61824k00706m22049k95877L39144M80551
819.9I8498917k30164q39323p85803p97642j346129j638990j414532j890141l905761
838.3H5650432o687432q217460o568283k405197K571476P569778R741104P349348L645593
856.6I2649359J753240J412857J050955K17390k53886j67739k87938p77013j037013
$$ plain form
875 94560212 93565744 92544401 91750807 91968638 93454564 95347041 96537238 96924931 97134554 97287887
895.4 97287887 97103190 96751893 96657175 96708030 96487093 96082145 95910221 95918459 95703334 95297897 95097810
917.8 95097810 95096666 94911325 94524336 94305360 94300550 94155371 93800670 93583822 93596995 93500596 93166190
940.3 93166190 92900783 92837125 92674726 92249453 91814637 91511798 91157085 90761155 90553755 90416694
960.7 90416694 89961296 89383000 89394927 89943516 90261537 90074700 89721745 89498216 89291501 88890260
981.1 88890260 88414276 88088369 87815565 87362880 86796612 86327744 85896713 85292423 84549040 83861619
1001.4 83861619 83205646 82342476 81108850 79551429 77880222 76184714 74278384 72013861 69399786
1019.8 69399786 66589576 64348137 64317071 67814308 73934782 79966074 84016275 86054093 86755514
$$ packed form
875I4560212r94468j021343p93594K17831J485926J892477J190197L87693K09623J53333
895.4I7287887j84697l51297r4718N0855k20937m04948j71924Q238k15125m05437k00087
917.8I5097810j144j85341l86989k18976m810j45179l54701k16848J3173r6399l34406
940.3I3166190k65407o3658j62399m25273m34816l02839l54713l95930k07400j37061
960.7I0416694m55398n78296J1927N48589L18021j86837l52955k23529k06715m01241
981.1H8890260m75984l25907k72804m52685n66268m68868m31031o04290p43383o87421
1001.4H3861619o55973q63170j233626j557421j671207j695508j906330k264523k614075
1019.8F9399786k810210k241439l1066L497237O120474O031292M050201K037818P01421
$$ plain form
1038.2 86755514 86686784 86306041 85878855 85378027 84726721 84016663 83347011 82637125 81779200 80830437
1058.6 80830437 79871410 78824681 77575290 76160616 74700093 73235089 71792448 70516157 69590342
1076.9 69590342 69071639 68890154 68970817 69238329 69518989 69582468 69307244 68696183 67709327 66219169
1097.3 66219169 64150733 61504090 58226854 54327220 50539863 48714292 50245500 53893745
1113.6 53893745 56647021 56582278 53906363 50092024 46989527 46325532 48799530 53349012 58156717
1132 58156717 62311161 65858358 68858278 71139628 72610009 73353642 73490912 73080838 72142011
1150.3 72142011 70684761 68780690 66713852 64827579 62944913 60243821 55947763 49978182
1166.7 49978182 43183887 37430093 35313359 39064294 48900989 62181163 74764293 83726484
$$ packed form
1038.2H6755514o8730l80743m27186n00828o51306p10058o69652p09886q57925r48763
1058.6H0830437r59027j046729j249391j414674j460523j465004j442641j276291r25815
1076.9F9590342n18703j81485Q0663K67512K80660O3479k75224o11061r86856j490158
1097.3F6219169k068436k646643l277236l899634l787357j825571J531208L648245
1113.6E3893745K753276o4743k675915l814339l102497o63995K473998M549482M807705
1132E8156717M154444L547197K999920K281350J470381P43633J37270m10074r38827
1150.3G2142011j457250j904071k066838j886273j882666k701092m296058n969581
1166.7D9978182o794295n753794k116734L750935R836695J3280174J2583130Q962191
$$ plain form
1183 83726484 88691550 90799052 91250348 90812343 89917237 88824505 87712181 86718607 85935402
1201.3 85935402 85372579 84942198 84484625 83865744 83094394 82303166 81569839 80814999 79902387 78771299
1221.7 78771299 77423763 75857824 74069732 72080022 69933969 67725384 65717357 64346385
1238.1 64346385 63819563 63752019 63507509 62736356 61408931 59592593 57377309 54882902 52235699
1256.4 52235699 49539417 46881473 44330880 41822672 39161679 36174789 32871076 29532889
1272.7 29532889 26594597 24389122 23066872 22702438 23320463 24792604 27093047 30677190 35989496
1291.1 35989496 42557627 48899019 53585154 55985099 56066954 54432422 51756531 47382045 41377142
1309.4 41377142 37710163 39987782 46460953 53567511 59821880 65115160 69804227 74166298
$$ packed form
1183H3726484M965066K107502M51296m38005q95106j092732j112324r93574p83205
1201.3H5935402n62823m30381m57573o18881p71350p91228p33327p54840r12612j131088
1221.7G8771299j347536j565939j788092j989710k146053k208585k008027j370972
1238.1F4346385n26822o7544k44510p71153j327425j816338k215284k494407k647203
1256.4E2235699k696282k657944k550593k508208k660993k986890l303713l338187
1272.7B9532889k938292k205475j322250l64434O18025J472141K300443L584143N312306
1291.1C5989496O568131O341392M686135K399945Q1855j634532k675891m374486o004903
1309.4D1377142l666979K277619O473171P106558O254369N293280M689067M362071
$$ plain form
1325.8 74166298 78105283 81373942 83810091 85364407 86033243 85906428 85466737 85481292 86256987
1344.1 86256987 87492365 88717890 89621276 89966327 89469320 87778360 84389138 78382748 69255871
1362.5 69255871 59899342 54510772 54337913 58053434 63386041 69082975 74097079 77783215 80188555
1380.8 80188555 81603277 82180011 81680161 80248040 79051018 79412526 81821114 84837699 87093270
1399.2 87093270 88429266 89067042 89358634 89560246 89743108 89862263 89867264 89740723 89475638 89094943
1419.6 89094943 88655227 88069499 87299246 86220616 84536225 82344055 79693681 75330019 69151551
1437.9 69151551 64352894 62972772 65537035 69940925 72970289 74218386 75716329 77834404
1454.3 77834404 79632652 80567592 80801743 80508035 79570246 78190458 76513517 73650575 68991762
$$ packed form
1325.8G4166298L938985L268659K436149J554316O68836j26815m39691J4555P75695
1344.1H6256987J235378J225525R03386L45051m97007j690960l389222o006390r126877
1362.5F9255871r356529n388570j72859L715521N332607N696934N014104L686136K405340
1380.8H0188555J414722N76734m99850j432121j197022L61508K408588L016585K255571
1399.2H7093270J335996O37776K91592K01612J82862J19155N001j26541k65085l80695
1419.6H9094943m39716n85728p70253j078630j684391k192170k650374m363662o178468
1437.9F9151551m798657j380122K564263M403890L029364J248097J497943K118075
1454.3G7834404J798248R34940K34151k93708r37789j379788j676941k862942m658813
$$ plain form
1472.6 68991762 66670245 70454144 77068752 81923056 83679295 83527505 82584304 81225383 79877585
1491 79877585 78804690 77538621 75676191 73608249 71659315 69636160 66598624 61580312 56929529
1509.3 56929529 52791846 49148992 49168026 55250245 65478891 77304643 85869861 89326584
1525.6 89326584 89991456 89220476 87702948 85810024 84313178 82997710 81109995 79380029 78361279
1544 78361279 77530956 76786530 76086569 75395542 74550939 73450863 71686965 69683599 68406254
1562.4 68406254 66875362 64853257 62244099 58790803 55956209 55653864 58391291 59961265 58378005
1580.7 58378005 55320334 51891446 48349613 44746220 41283983 38242495 35852832 34377661
1597 34377661 33984807 34759042 36822328 40251094 44995609 50639170 56056362 60065800 62195677
$$ packed form
1472.6F8991762k321517L783899O614608M854304J756239j51790r43201j358921j347798
1491G9877585j072895j266069j862430k067942j948934k023155l037536n018312m650783
1509.3E6929529m137683l642854J9034O082219J0228646J1825752Q565218L456723
1525.6H9326584O64872p70980j517528j892924j496846j315468j887715j729966j018750
1544G8361279q30323p44426o99961o91027q44603j100076j763898k003366j277345
1562.4F8406254j530892k022105k609158l453296k834594l02345K737427J569974j583260
1580.7E8378005l057671l428888l541833l603393l462237l041488k389663j475171
1597C4377661l92854P74235K063286L428766M744515N643561N417192M009438K129877
$$ plain form
1615.4 62195677 62156665 60646796 58459800 55696189 52943516 50194186 47380623 45112437 43593925
1633.7 43593925 43406299 45270944 48436597 52350980 56540847 61390543 66558331 70278358 73633152
1652.1 73633152 77095807 78177500 77633452 76106966 73285562 69555300 65742052 61089927 55331224
1670.5 55331224 49963570 44176859 38051376 33720055 31066889 29557177 29297048 30345231 32400161
1688.8 32400161 35300109 38331023 41611519 45143959 48477358 52143854 55109733 57622677
1705.1 57622677 60267925 62649357 64777642 66752446 68670797 70839548 73022830 74796128
1721.5 74796128 76398659 77910107 79234576 80425715 81507188 82766455 84150094 85153151
1737.8 85153151 85891348 86479437 86974406 87517363 88156724 88969123 89930040 90755647 91353673 91769481
$$ packed form
1615.4F2195677l9012j509869k186996k763611k752673k749330k813563k268186j518512
1633.7D3593925j87626J864645L165653L914383M189867M849696N167788L720027L354794
1652.1G3633152L462655J081693n44048j526486k821404l730262l813248m652125n758703
1670.5E5331224n367654n786711o125483m331321k653166j509712k60129J048183K054930
1688.8C2400161K899948L030914L280496L532440L333399L666496K965879K512944
1705.1E7622677K645248K381432K128285J974804J918351K168751K183282J773298
1721.5G4796128J602531J511448J324469J191139J081473J259267J383639J003057
1737.8H5153151P38197N88089M94969N42957O39361Q12399R60917Q25607N98026M15808
$$ plain form
1758.2 91769481 92069358 92420286 92862076 93282676 93711448 94198906 94775552 95319194 95669097 95842355
1778.6 95842355 95853096 95736891 95679498 95914346 96349013 96781111 97253883 97764641 98158622 98368406
1799 98368406 98491770 98688096 98931926 99088353 99132866 99188960 99315017 99394178 99371356 99324512 99276489
1821.4 99276489 99175256 99056685 99001706 99037844 99182636 99350005 99501234 99675429 99807221 99800187
1841.8 99800187 99738079 99807185 99938732 99997139 99997687 100001132 100000000 100001681 99979532 99983364 99981380 99898708 99793202
1868.3 99793202 99825251 99935061 99960065 99892497 99813282 99747127 99646044 99491990 99315649 99132800 98957580
1890.7 98957580 98769981 98556203 98366821 98188782 97965765 97718740 97469634 97154319 96698880 96048898
1911.1 96048898 95068568 93847370 93185991 93860227 95306242 96580416 97365677 97784400 98050594
$$ packed form
1758.2I1769481K99877L50928M41790M20600M28772M87458N76646N43642L49903J73258
1778.6I5842355J0741j16205n7393K34848M34667M32098M72772N10758L93981K09784
1799I8368406J23364J96326K43830J56427M4513N6094J26057P9161k2822m6844m8023
1821.4I9276489j01233j18571n4979L6138J44792J67369J51229J74195J31792p034
1841.8I9800187o2108O9106J31547N8407N48L445j132J681k2149L832j984q2672j05506
1868.3I9793202L2049J09810K5004o7568p9215o6155j01083j54054j76341j82849j75220
1890.7I8957580j87599k13778j89382j78039k23017k47025k49106l15315m55439o49982
1911.1I6048898r80330j221198o61379O74236J446015J274174P85261M18723K66194
$$ plain form
1929.5 98050594 98253083 98364848 98380643 98355478 98311388 98238635 98184168 98187864 98215318 98227286 98211884
1951.9 98211884 98190415 98184097 98169327 98112708 98026681 97939366 97859377 97806680 97795373 97807312 97800988 97724468
1976.4 97724468 97564471 97357559 97135431 96909398 96708506 96582782 96563011 96642405 96767515 96872962
1996.8 96872962 96935743 96942377 96884942 96804512 96747446 96703655 96633756 96526694 96395266 96273857 96226519
2019.2 96226519 96294266 96428591 96528625 96547794 96502775 96462458 96504325 96619409 96746081 96858537 96955097
2041.7 96955097 97018558 97043437 97063851 97107351 97147888 97156936 97158897 97180539 97196496 97176242 97141474 97131586
2066.2 97131586 97130316 97096682 97046512 97015017 96987480 96931499 96863192 96823257 96806133 96767825 96703947 96656007
2090.6 96656007 96628124 96579307 96501553 96433938 96388793 96330023 96235955 96132827 96040130 95927113 95769513
$$ packed form
1929.5I8050594K02489J11765J5795k5165m4090p2753n4467L696K7454J1968j5402
1951.9I8211884k1469o318j4770n6619q6027q7315p9989n2697j1307J1939o324p6520
1976.4I7724468j59997k06912k22128k26033k00892j25724j9771P9394J25110J05447
1996.8I6872962O2781O634n7435q0430n7066m3791o9899j07062j31428j21409m7338
2019.2I6226519O7747J34325J00034J9169m5019m0317M1867J15084J26672J12456R6560
2041.7I6955097O3461K4879K0414M3500M0537R048J961K1642J5957k0254l4768r888
2066.2I7131586j270l3634n0170l1495k7537n5981o8307l9935j7124l8308o3878m7940
2090.6I6656007k7883m8817p7754o7615m5145n8770r4068j03128r2697j13017j57600
$$ plain form
2113.1 95769513 95601732 95463771 95346260 95232511 95143640 95097536 95048988 94934273 94759834 94597471
2133.5 94597471 94511753 94524217 94637507 94840515 95078146 95279038 95433056 95575523 95705265 95786321
2153.9 95786321 95821625 95859814 95916355 95952374 95950967 95945442 95958394 95981038 96008486 96052700 96106505 96125358
2178.3 96125358 96088481 96040326 96021217 96004552 95954293 95893586 95864671 95853931 95817435 95757568 95708305 95668525
2202.8 95668525 95612657 95551574 95518905 95505303 95478225 95460039 95500803 95579785 95622987 95613807 95603514 95617884
2227.3 95617884 95626062 95608962 95598805 95612890 95609045 95549947 95456427 95359129 95249152 95130312 95059663 95082158
2251.8 95082158 95164376 95240146 95296878 95354927 95397884 95396483 95370919 95364535 95373267 95362270 95341980 95354193
2276.2 95354193 95393795 95412546 95388627 95338738 95271081 95171559 95036793 94890612 94742006 94567579 94366020
$$ packed form
2113.1I5769513j67781j37961j17511j13749q8871m6104m8548j14715j74439j62363
2133.5I4597471q5718J2464J13290K03008K37631K00892J54018J42467J29742Q1056
2153.9I5786321L5304L8189N6541L6019j407n525J2952K2644K7448M4214N3805J8853
2178.3I6125358l6877m8155j9109j6665n0259o0707k8915j0740l6496n9867m9263l9780
2202.8I5668525n5868o1083l2669j3602k7078j8186M0764P8982M3202r180j0293J4370
2227.3I5617884Q178j7100j0157J4085l845n9098r3520r7298j09977j18840p0649K2495
2251.8I5082158Q2218P5770N6732N8049M2957j401k5564o384Q732j0997k0290J2213
2276.2I5354193L9602J8751k3919m9889o7657r9522j34766j46181j48606j74427k01559
$$ plain form
2298.7 94366020 94174612 94003165 93798214 93523365 93222636 92961013 92743516 92498505 92143190 91696250
2319.1 91696250 91283906 91001046 90808010 90597481 90349138 90157700 90070266 90006536 89915758 89817727
2339.5 89817727 89775646 89970076 90583092 91235137 91289145 90620881 89606845 88682914 88014531 87679255
2359.9 87679255 87673151 87922186 88372898 88993818 89725953 90476996 91180074 91840237 92472279 93028998
2380.2 93028998 93435687 93676168 93796438 93841761 93834513 93798447 93746823 93659884 93528599 93400288 93340224
2402.7 93340224 93357497 93409276 93473059 93563175 93677807 93789458 93890589 94004154 94133973 94250613
2423.1 94250613 94339252 94413155 94475174 94501460 94485098 94458711 94444388 94422799 94372338 94305706 94255018 94234896
2447.6 94234896 94239455 94272995 94342154 94421506 94476306 94513643 94561106 94611645 94636935 94637960 94639033 94639492 94615352
$$ packed form
2298.7I4366020j91408j71447k04951k74849l00729k61623k17497k45011l55315m46940
2319.1I1696250m12344k82860j93036k10529k48343j91438q7434o3730r0778r8031
2339.5H9817727m2081J94430O13016O52045N4008o68264j014036r23931o68383l35276
2359.9H7679255o104K49035M50712O20920P32135P51043P03078O60163O32042N56719
2380.2I3028998M06689K40481J20270M5323p248l6066n1624q6939j31285j28311o0064
2402.7I3340224J7273N1779O3783R0116J14632J11651J01131J13565J29819J16640
2423.1I4250613Q8639P3903O2019K6286j6362k6387j4323k1589n0461o6632n0688k0122
2447.6I4234896M559L3540O9159P9352N4800L7337M7463N0539K5290J025J073M59k4140
$$ plain form
2474.1 94615352 94565529 94516665 94479805 94437218 94376904 94308627 94242954 94181031 94134969 94126487 94152480 94183421
2498.5 94183421 94201952 94218659 94239444 94243622 94213796 94162750 94109344 94050670 93976152 93891156 93803895 93706894
2523 93706894 93615466 93590444 93660069 93759567 93804878 93781590 93725407 93661302 93589973 93515360 93450588 93397576
2547.5 93397576 93360919 93371588 93455058 93587309 93717730 93820614 93901592 93965077 93998325 93997693 93979025
2569.9 93979025 93948638 93889177 93787396 93655539 93506020 93340200 93180990 93081689 93074274 93129337 93196440
2592.4 93196440 93251711 93285769 93279755 93221706 93126982 93012589 92879790 92743385 92645913 92616969 92633092
2614.8 92633092 92663223 92737472 92895293 93090969 93230945 93275464 93246692 93162614 93017215 92819375 92596412
2637.2 92596412 92365640 92145431 91971976 91871989 91835350 91841125 91886902 91957784 91999847 91959888 91828114
$$ packed form
2474.1I4615352m9823m8864l6860m2587o0314o8277o5673o1923m6062q482K5993L0941
2498.5I4183421J8531J6707K0785M178k9826n1046n3406n8674p4518q4996q7261r7001
2523I3706894r1428k5022O9625R9498M5311k3288n6183o4105p1329p4613o4772n3012
2547.5I3397576l6657J0669Q3470J32251J30421J02884Q0978O3485L3248o32j8668
2569.9I3979025l0387n9461j01781j31857j49519j65820j59210r9301p415N5063O7103
2592.4I3196440N5271L4058o014n8049r4724j14393j32799j36405r7472k8944J6123
2614.8I2633092L0131P4249J57821J95676J39976M4519k8772q4078j45399j97840k22963
2637.2I2596412k30772k20209j73455r9987l6639N775M5777P0882M2063l9959j31774
$$ plain form
2659.7 91828114 91628683 91388547 91124713 90857428 90621716 90451819 90366554 90384948 90526265 90774357
2680.1 90774357 91073781 91375178 91656595 91894513 92054659 92125583 92128617 92086726 92010975 91921669 91854900
2702.5 91854900 91837704 91874504 91960692 92093438 92265564 92452174 92621553 92767340 92900091 93015522
2722.9 93015522 93103427 93167770 93218052 93249458 93244547 93200177 93130457 93042022 92940980 92853391 92798942 92760932
2747.4 92760932 92705458 92617357 92509949 92395169 92263961 92113626 91956002 91793287 91627413 91493994
2767.8 91493994 91448343 91515356 91669393 91858143 92042178 92197740 92306173 92364848 92386091 92375219 92323279
2790.2 92323279 92243081 92179888 92151940 92125309 92067772 91984689 91889447 91779673 91659480 91547269 91459709
2812.6 91459709 91405845 91379035 91370803 91385651 91428059 91491741 91557717 91602266 91609424 91574341 91498375 91384000
$$ packed form
2659.7I1828114j99431k40136k63834k67285k35712j69897q5265J8394J41317K48092
2680.1I0774357K99424L01397K81417K37918J60146P0924L034m1891p5751q9306o6769
2702.5I1854900j7196L6800Q6188J32746J72126J86610J69379J45787J32751J15431
2722.9I3015522Q7905O4343N0282L1406m911m4370o9720q8435j01042q7589n4449l8010
2747.4I2760932n5474q8101j07408j14780j31208j50335j57624j62715j65874j33419
2767.8I1493994m5651O7013J54037J88750J84035J55562J08433N8675K1243j0872n1940
2790.2I2323279q0198o3193k7948k6631n7537q3083r5242j09774j20193j12211q7560
2812.6I1459709n3864k6810q232J4848M2408O3682O5976M4549P158l5083p5966j14375
$$ plain form
2837.1 91384000 91225094 91024137 90818453 90643406 90488565 90328544 90172541 90041745 89931101 89818293
2857.5 89818293 89668602 89442384 89124477 88727725 88287771 87895960 87678760 87679005 87801170 87911946
2877.9 87911946 87939334 87864327 87675869 87338191 86780161 85933715 84798318 83448601 82054681 81072915
2898.3 81072915 81245822 82881153 85256636 87299943 88572562 89245087 89559126 89616674 89455003
2916.6 89455003 89097768 88552666 87845200 87094975 86491460 86094028 85767335 85382789 84914261 84344751
2937 84344751 83715034 83304590 83404225 83807480 83959115 83571315 82763392 81821507 81082714 80828232
2957.4 80828232 81033278 81375211 81707323 82255572 83052737 83625454 83519369 82656062 81138927 79084206
2977.8 79084206 76709515 74551564 73439270 74118626 76747268 80519831 84119785 86782467 88557386
$$ packed form
2837.1I1384000j58906k00957k05684j75047j54841j60021j56003j30796j10644j12808
2857.5H9818293j49691k26218l17907l96752m39954l91811k17200K45J22165J10776
2877.9H7911946K7388p5007j88458l37678n58030q46446j135397j349717j393920r81766
2898.3H1072915J72907J635331K375483K043307J272619O72525L14039N7548j61671
2916.6H9455003l57235n45102p07466p50225o03515l97432l26693l84546m68528n69510
2937H4344751o29717m10444R9635M03255J51635l87800q07923r41885p38793k54482
2957.4H0828232K05046L41933L32112N48249P97165N72717j06085q63307j517135k054721
2977.8G9084206k374691k157951j112294O79356K628642L772563L599954K662682J774919
$$ plain form
2996.2 88557386 89726663 90467960 90906781 91149026 91277629 91366762 91461819 91549790 91581047 91527307
3016.6 91527307 91403043 91235906 91054660 90910870 90855724 90870166 90865725 90772021 90577495 90289062 89891016
3039 89891016 89360327 88784432 88478172 88737226 89383674 89919037 90114313 90076429 89932412 89726114
3059.4 89726114 89459854 89128542 88753986 88398594 88172019 88182777 88426214 88775843 89089894 89286679
3079.8 89286679 89367801 89382470 89370483 89349645 89311594 89241678 89152771 89068758 89007872 88979745 88976806 88970125
3104.3 88970125 88923502 88823295 88683951 88533974 88383627 88219929 88041848 87851375 87650269 87458444
3124.7 87458444 87300348 87181461 87073958 86943513 86782330 86591780 86355799 86046982 85683733 85377258
3145.1 85377258 85255527 85310310 85394013 85391068 85292107 85129941 84930372 84701860 84440446 84145939 83828688
$$ packed form
2996.2H8557386J169277P41297M38821K42245J28603Q9133R5057Q7971L1257n3740
3016.6I1527307j24264j67137j81246j43790n5146J4442m441r3704j94526k88433l98046
3039H9891016n30689n75895l06260K59054O46448N35363J95276l7884j44017k06298
3059.4H9726114k66260l31312l74556l55392k26575J0758K43437L49629L14051J96785
3079.8H9286679Q1122J4669j1987k0838l8051o9916q8907q4013o0886k8127k939o681
3104.3H8970125m6623j00207j39344j49977j50347j63698j78081j90473k01106j91825
3124.7H7458444j58096j18887j07503j30445j61183j90550k35981l08817l63249l06475
3145.1H5377258j21731N4783Q3703k945r8961j62166j99569k28512k61414k94507l17251
$$ plain form
3167.5 83828688 83495975 83148932 82784653 82401091 82002914 81591785 81151408 80662876 80121642 79522485
3187.9 79522485 78854936 78110480 77291906 76405722 75452906 74442548 73389733 72309864 71221244
3206.3 71221244 70140177 69079894 68042374 67024088 66058826 65245372 64727211 64625305 64994246
3224.6 64994246 65818512 66987783 68309242 69567651 70593125 71329361 71820766 72145027 72402555
3243 72402555 72716016 73194796 73890817 74772888 75740552 76659620 77413243 77956420 78305829 78491032
3263.4 78491032 78533006 78450710 78270727 78020084 77712411 77353549 76948738 76501787 76012582 75480193
3283.8 75480193 74915081 74322706 73693919 73020297 72293472 71505320 70654851 69753593 68825537 67880511
3304.2 67880511 66891509 65840393 64764661 63727117 62765807 61881608 61044604 60210937 59343594
$$ packed form
3167.5H3828688l32713l47043l64279l83562l98177m11129m40377m88532n41234n99157
3187.9G9522485o67549p44456q18574q86184r52816j010358j052815j079869j088620
3206.3G1221244j081067j060283j037520j018286r65262q13454n18161j01906L68941
3224.6F4994246Q24266J169271J321459J258409J025474P36236M91405L24261K57528
3243G2402555L13461M78780O96021Q82071R67664R19068P53623N43177L49409J85203
3263.4G8491032M1974q2296j79983k50643l07673l58862m04811m46951m89205n32389
3283.8G5480193n65112n92375o28787o73622p26825p88152q50469r01258r28056r45026
3304.2F7880511r89002j051116j075732j037544r61310q84199q37004q33667q67343
$$ plain form
3322.5 59343594 58410418 57387161 56289798 55167437 54051626 52966499 51959842 51095223 50456905
3340.9 50456905 50158191 50295335 50890809 51882643 53183573 54788744 56761593 59071749 61528653
3359.2 61528653 63924581 66130412 68070370 69712967 71071941 72180182 73051447 73680711 74073744
3377.6 74073744 74252170 74240714 74054736 73701751 73199147 72561085 71786171 70878786 69846016 68688178
3398 68688178 67409080 66003245 64472556 62847984 61159301 59433186 57718408 56091624 54647660
3416.3 54647660 53477246 52664649 52297229 52431905 53074062 54187232 55691832 57494861 59487379
3434.7 59487379 61540353 63551933 65475202 67273051 68893409 70323735 71537173 72481108 73185015
3453.1 73185015 73817611 74609345 75635010 76761854 77848125 78845406 79727960 80455476 81027710
$$ packed form
3322.5E9343594r33176j023257j097363j122361j115811j085127j006657q64619o38318
3340.9E0456905k98714J37144N95474R91834J300930J605171J972849K310156K456904
3359.2F1528653K395928K205831J939958J642597J358974J108241Q71265O29264L93033
3377.6G4073744J78426j1456j85978l52985n02604o38062p74914r07385j032770j157838
3398F8688178j279098j405835j530689j624572j688683j726115j714778j626784j443964
3416.3E4647660j170414q12597l67420J34676O42157J113170J504600J803029J992518
3434.7E9487379K052974K011580J923269J797849J620358J430326J213438R43935P03907
3453.1G3185015O32596P91734J025665J126844J086271R97281Q82554P27516N72234
$$ plain form
3471.4 81027710 81511855 81969023 82409364 82809871 83165556 83514124 83865303 84192127 84498888 84805202
3491.8 84805202 85107070 85396862 85662019 85891426 86094886 86292863 86490774 86684912 86897945 87143517
3512.2 87143517 87376130 87561667 87727720 87899041 88077962 88254762 88422394 88610137 88838029 89073205
3532.6 89073205 89287311 89481521 89664978 89848834 90018457 90154427 90283102 90434933 90589100 90747750
3553 90747750 90939635 91139615 91322404 91487026 91604555 91670400 91821176 92145646 92477441 92720217
3573.4 92720217 92929578 93148822 93383050 93621320 93812484 93913960 94022250 94274145 94552261 94752109
3593.8 94752109 94958234 95220661 95484996 95745701 95989841 96151400 96276820 96469712 96690965 96885413
3614.2 96885413 97033983 97148192 97340757 97596395 97763908 97766185 97708327 97891694 98223817 98490810
$$ packed form
3471.4H1027710M84145M57168M40341M00507L55685L48568L51179L26824L06761L06314
3491.8H4805202L01868K89792K65157K29407K03460J97977J97911J94138K13033K45572
3512.2H7143517K32613J85537J66053J71321J78921J76800J67632J87743K27892K35176
3532.6H9073205K14106J94210J83457J83856J69623J35970J28675J51831J54167J58650
3553I0747750J91885J99980J82789J64622J17529O5845J50776L24470L31795K42776
3573.4I2720217K09361K19244K34228K38270J91164J01476J08290K51895K78116J99848
3593.8I4752109K06125K62427K64335K60705K44140J61559J25420J92892K21253J94448
3614.2I6885413J48570J14209J92565K55638J67513K277n7858J83367L32123K66993
$$ plain form
3634.6 98490810 98687899 98832154 98936808 99010170 98997337 98843056 98720616 98922950 99242413 99419111
3655 99419111 99529648 99682379 99780959 99792838 99762863 99635124 99403173 99279785 99228531 99103451 99144500
3677.4 99144500 99333215 99465925 99528182 99529511 99443918 99335170 99385005 99557102 99696124 99748218 99719989
3699.8 99719989 99675894 99711859 99756145 99685985 99539900 99533767 99720937 99855077 99807268 99645638 99489349
3722.3 99489349 99389094 99366617 99416095 99410170 99254644 99093199 99167985 99409014 99553227 99457842 99273521
3744.7 99273521 99285305 99304968 99257249 99398899 99621493 99710768 99708164 99764246 99840289 99840611 99812752 99804270
3769.2 99804270 99851733 99948078 100000000 99974358 99928105 99929500 99941862 99943751 99971062 100002694 100001264 99933773
3793.7 99933773 99799335 99677986 99562365 99473733 99535024 99607444 99654341 99766135 99830115 99740213 99577492
$$ packed form
3634.6I8490810J97089J44255J04654P3362j2833j54281j22440K02334L19463J76698
3655I9419111J10537J52731R8580J1879k9975j27739k31951j23388n1254j25080M1049
3677.4I9144500J88715J32710O2257J329q5593j08748M9835J72097J39022N2094k8229
3699.8I9719989m4095L5965M4286p0160j46085o133J87170J34140m7809j61630j56289
3722.3I9489349j00255k2477M9478n925j55526j61445P4786K41029J44213r5385j84321
3744.7I9273521J1784J9663m7719J41650K22594Q9275k604N6082P6043L22k7859q482
3769.2I9804270M7463R6345N1922k5642m6253J395J2362J889K7311L1632j430o7491
3793.7I9933773j34438j21349j15621q8632O1291P2420M6897J11794O3980q9902j62721
$$ plain form
3816.1 99577492 99489379 99408078 99395877 99526274 99630326 99676412 99679518 99642313 99595940 99485451 99350142
3838.5 99350142 99363351 99494952 99641860 99746752 99739194 99546093 99209899 99159169 99415463 99599314
3858.9 99599314 99608809 99510145 99457991 99461126 99398041 99367034 99466449 99602252 99675345 99623847 99574065 99603182
3883.4 99603182 99610329 99635774 99646902 99602121 99631035 99687117 99620360 99465400 99363762 99381119 99515390
3905.8 99515390 99684173 99785787 99801660 99755132 99673539 99629492 99663007 99704885 99712980 99736410 99771041
3928.3 99771041 99767447 99774343 99845588 99921995 99946344 99915361 99870855 99876159 99901748 99903518 99921197 99965924
3952.7 99965924 100000000 100009072 100005162 100006938 100028265 100056243 100067151 100065184 100064087 100063086 100065470 100077832 100090742
3979.3 100090742 100096560 100101328 100108266 100113392 100108540 100096011 100092638 100104809 100121117
$$ packed form
3816.1I9577492q8113q1301j2201J30397J04052M6086L106l7205m6373j10489j35309
3838.5I9350142J3209J31601J46908J04892p558j93101l36194n0730K56294J83851
3858.9I9599314R495r8664n2154L135o3085l1007R9415J35803P3093n1498m9782K9117
3883.4I9603182P147K5445J1128m4781K8914N6082o6757j54960j01638J7357J34271
3905.8I9515390J68783J01614J5873m6528q1593m4047L3515M1878Q095K3430L4631
3928.3I9771041l594O896P1245P6407K4349l0983m4506N304K5589J770J7679M4727
3952.7I9965924L4076R072l910J776K1327K7978J0908j967j097j001K384J2362J2910
3979.3A00090742N818M768O938N126m852j2529l373J2171J6308
$$ plain form
3997.6 100121117
$$ packed form
3997.6A00121117
##END=$$ End of the data block
