##TITLE=Benzocaina - Oseias e Dalila $$ Begin of the data block
##JCAMP-DX=5.00 $$ ACD/SpecManager v 10.08
##SPECTROMETER/DATA SYSTEM=Alpha
##DATE=24 Apr 2015 08:22:40
##DATA TYPE=INFRARED SPECTRUM
##DATA CLASS=XYDATA
##ORIGIN=
##OWNER=
##NPOINTS=1765
##FIRSTX=399.76428223
##LASTX=3997.64306641
##MAXX=3997.64306641
##MINX=399.76428223
##MAXY=1.00625610
##MINY=0.19199125
##XFACTOR=1.0000000000
##YFACTOR=0.000000010000000
##FIRSTY=1.00000000
##DELTAX=2.03961372
##XUNITS=1/CM
##YUNITS=ARBITRARY UNITS
##XYDATA=(X++(Y..Y))
399.8A00000000L8648M85408J01554j52135o6101m07374m43715k02775J0461n30219
$$ 100000000 100038648 100524056 100625610 100473475 100407374 100000000 99556285 99353510 99363971 98833752
420.2I8833752o49989j95140k32839o89781o19560j90920l21233o50317l57067p3070
$$ 98833752 98183763 97988623 97755784 97066003 96446443 96255523 95934290 95283973 94926906 94853836
440.6I4853836m25553o17272k16186j33103n44274n63246j62255k67709p07149m86815
$$ 94853836 94428283 93811011 93594825 93461722 92917448 92354202 92191947 91924238 91217089 90730274
461I0730274j72431m59182p10261m13072l04842p33155p76487l93618m86481q94785
$$ 90730274 90557843 90098661 89388400 88975328 88670486 87937331 87160844 86767226 86280745 85385960
481.3H5385960q21101n72861q58056j244009j232785j356774k067685k804828l151619
$$ 85385960 84564859 83991998 83133942 81889933 80657148 79300374 77232689 74427861 71276242
499.7G1276242l077800j373434K142865M275793K683162J69605L2950J107228J099950
$$ 71276242 68198442 66825008 68967873 73243666 75926828 76096433 76129383 77236611 78336561
518.1G8336561L95900J82748J47837j84494l53712j28800j04987l90464m08876j39380
$$ 78336561 78732461 78915209 79063046 78878552 78524840 78396040 78291053 77900589 77491713 77352333
538.5G7352333j60676l65400k47592p463j09690k95770j58537j818j31857k15632m0591
$$ 77352333 77191657 76826257 76578665 76571202 76461512 76165742 76007205 76005387 75873530 75657898 75617307
560.9G5617307J8597j34844j31183O5553N2118j32561p8737J00863K8395j21736m339
$$ 75617307 75635904 75501060 75369877 75435430 75487548 75354987 75276250 75377113 75405508 75283772 75279433
583.3G5279433J30045J4377q6350M4972J10692m4644j25003m5532q8453l08329m09758
$$ 75279433 75409478 75423855 75337505 75382477 75493169 75448525 75323522 75277990 75189537 74881208 74471450
605.8G4471450m07422n57142q03793p41619L9411K193320N558777P380604N302358
$$ 74471450 74064028 73506886 72703093 71961474 72000885 74194205 79752982 87133586 92435944
624.1I2435944J333511j013953j388669j290720j555991k376503k607244O9493L482365
$$ 92435944 93769455 92755502 91366833 90076113 88520122 86143619 83536375 83605868 87088233
642.5H7088233L353912J375335L88319J10471J38914K86699K17277N8263J18417K13027
$$ 87088233 90442145 91817480 92205799 92316270 92455184 92741883 92959160 93017423 93135840 93348867
662.9I3348867J30200O3920J07724L1280j07121j16611J8489R996k13826l22616l26377
$$ 93348867 93479067 93542987 93650711 93681991 93574870 93458259 93476748 93486744 93272918 92950302 92623925
685.3I2623925n87755j140863j791573k748793m519033o579000n954027l61341O626290
$$ 92623925 92036170 90895307 89103734 86354941 81835908 75256908 69302881 68941540 75567830
703.7G5567830R218287P033867L844899J786548Q50504N82099M03899J09869K796J08951
$$ 75567830 84786117 91819984 95664883 97451431 98301935 98884034 99287933 99397802 99400598 99509549
724.1I9509549N3328j52933j56123m1490j53673l40867k97028k39724m21029n75549
$$ 99509549 99562877 99409944 99253821 99212331 99058658 98717791 98420763 98181039 97760010 97184461
744.5I7184461n15508n61291q62205j103252j252550j726193k513754l055191l648317
$$ 97184461 96668953 96107662 95245457 94142205 92889655 91163462 88649708 85594517 81946200
762.8H1946200n425000q180541r945017q429110k616188N521175J1463327J2151742
$$ 81946200 76521200 68340659 58395642 49966532 47350344 52871519 64334846 76486588
779.1G6486588R051060N625272L486115K259600J335323P59899N80043L84903L1197
$$ 76486588 85537648 91162920 94649035 96908635 98243958 99003857 99583900 99968803 100000000
797.5A00000000j08856l8266j62149m48131n25201n09440o88225o62172o7413M26274
$$ 100000000 99891144 99852878 99690729 99242598 98717397 98207957 97519732 96857560 96790147 97216421
817.9I7216421J39487m51976p37339r83244j517320j925558j804620j806527k773631
$$ 97216421 97355908 96903932 96166593 95183349 93666029 91740471 89935851 88129324 85355693
836.2H5355693m618812o800162q032245o379181k139139L021419Q037758J0090071
$$ 85355693 80736881 73936719 65904474 59525293 57386154 60407573 68445331 78535402
852.6G8535402P880372M489207K335977J439298J095509N75757j17868m82970n03201
$$ 78535402 86415774 90904981 93240958 94680256 95775765 96351522 96233654 95750684 95247483
870.9I5247483o52146j053476j366193j312619p50196L12024J486475K066588J602453
$$ 95247483 94595337 93541861 92175668 90863049 90112853 90424877 91911352 93977940 95580393
889.3I5580393O74641J66327K4939j49811k64424j76877j36208k71321l25220k08605
$$ 95580393 96255034 96421361 96446300 96296489 96032065 95855188 95718980 95447659 95122439 94913834
909.7I4913834j85293l10021l11297j84405j95736l07399k67041j54012k08634l13652
$$ 94913834 94728541 94418520 94107223 93922818 93727082 93419683 93152642 92998630 92789996 92476344
930.1I2476344k39676j27649j86593k63512j95938j60384k85399l66044l14254l67337
$$ 92476344 92236668 92109019 91922426 91658914 91462976 91302592 91017193 90651149 90336895 89969558
950.5H9969558n84066o15609k83599o5255l51507p34740n18251K16276N39446K52008
$$ 89969558 89385492 88769883 88486284 88421029 88069522 87334782 86816531 87032807 87572253 87824261
970.9H7824261n6553k66689m07964l82745l34412m21458n03588m52864m35233n58114
$$ 87824261 87767708 87501019 87093055 86710310 86375898 85954440 85450852 84997988 84562755 84004641
991.3H4004641o51730o28149o54066p91472q76325q72123r90677j365131j782209j896799
$$ 84004641 83352911 82724762 82070696 81279224 80402899 79530776 78540099 77174968 75392759 73495960
1011.6G3495960j826775j985741k346950k671188k786655k130025J35326L716201O430441
$$ 73495960 71669185 69683444 67336494 64665306 61878651 59748626 59883952 63600153 70030594
1030G0030594O427622M412472K198297O50537j50532m09704n25201p01195p95567p58421
$$ 70030594 76458216 80870688 83068985 83719522 83568990 83159286 82634085 81932890 81137323 80378902
1050.4H0378902p92605r48572j028955j005995j085949j280254j395077j432550j541614
$$ 80378902 79586297 78637725 77608770 76602775 75516826 74236572 72841495 71408945 69867331
1068.8F9867331j638597j515031j212156r02623n75680j66726J72973K49952J18238
$$ 69867331 68228734 66713703 65501547 64598924 64023244 63856518 64029491 64279443 64397681
1087.1F4397681q3751l92395q43942j313567j735455k214885k788216l332615l697395
$$ 64397681 64313930 63921535 63077593 61764026 60028571 57813686 55025470 51692855 47995460
1105.5D7995460l366542j427734J742941L707585K729651j16539k618691l542355k705180
$$ 47995460 44628918 43201184 44944125 48651710 51381361 51264822 48646131 45103776 42398596
1123.8D2398596l41866K602932M520241M701474M032218L494543L046519K321714J442719
$$ 42398596 42056730 44659662 49179903 53881377 57913595 61408138 64454657 66776371 68219090
1142.2F8219090P10427P2015o07127j183242j579988j935929k123433j938862j889044
$$ 68219090 68929517 69001532 68394405 67211163 65631175 63695246 61571813 59632951 57743907
1160.5E7743907k743119m392123n971605o588736n426002j977396L337959Q941001
$$ 57743907 55000788 50608665 44637060 38048324 32622322 30644926 33982885 42923886
1176.9D2923886J2562966J2627155R686154N835664K656841O69348k31486o44094j021927
$$ 42923886 55486852 68114007 77800161 83635825 86292666 86962014 86730528 86086434 85064507
1195.2H5064507j186103r68284o94572o01668n22291m48650o23233r23132r53323p91323
$$ 85064507 83878404 82910120 82215548 81613880 81091589 80642939 80019706 79096574 78143251 77351928
1215.6G7351928q49676j123250j307416j435637j706541j998985k129358k205854k295304
$$ 77351928 76502252 75379002 74071586 72635949 70929408 68930423 66801065 64595211 62299907
1234F2299907k094519j372582n18494j60587l74484q32874j373857j917386k295542
$$ 62299907 60205388 58832806 58314312 58153725 57779241 56946367 55572510 53655124 51359582
1252.3E1359582k497450k656504k769485k745921k622315k579918k687329k861372
$$ 51359582 48862132 46205628 43436143 40690222 38067907 35487989 32800660 29939288
1268.6B9939288k975944k844521k345769j611965q57207j04757P08251J507390K313068
$$ 29939288 26963344 24118823 21773054 20161089 19303882 19199125 19907376 21414766 23727834
1287B3727834L400696M791435N913270N899200M509910K334109J15127j466876k464745
$$ 23727834 27128530 31919965 37833235 43732435 48242345 50576454 50691581 49224705 46759960
1305.4D6759960m094946n523494l254953K137926N887011O567946N946100N097341
$$ 46759960 42665014 37141520 33886567 36024493 41911504 48479450 54425550 59522891
1321.7E9522891M543966M349840M045534L343761K452302J585048O73330k00730m95649
$$ 59522891 64066857 68416697 72462231 75805992 78258294 79843342 80516672 80315942 79820293
1340G9820293P7665R27699J470607J601708J307607N49656m87995j760602l610802
$$ 79820293 79897958 80825657 82296264 83897972 85205579 85755235 85267240 83506638 79895836
1358.4G9895836o421023r482372r436983n349398k12931L642344N382550N782765M974574
$$ 79895836 73474813 63992441 54555458 49206060 48993129 52635473 58018023 63800788 68775362
1376.7F8775362L676963K562415J545710N28657n68461j377911j107269M85527K708775
$$ 68775362 72452325 75014740 76560450 77089107 76520646 75142735 74035466 74520993 77229768
1395.1G7229768L428364K443605J247365O47431M83990K51913Q8453J63103J82986
$$ 77229768 80658132 83101737 84349102 84996533 85480523 85732436 85820889 85983992 86166978
1413.5H6166978l2944k67338l68387m41700o88773r13781j095343j691997k428246
$$ 86166978 86134034 85866696 85498309 85056609 84367836 83454055 82358712 80666715 78238469
1431.8G8238469k949190m565400o415909n037540j488275K552176M394585K940237
$$ 78238469 75289279 70723879 64307970 59270430 57782155 60334331 64728916 67669153
1448.1F7669153J128847J508259K321268K162879J153505J58227l79062r36586j366478
$$ 67669153 68798000 70306259 72627527 74790406 75943911 76102138 75723076 74786490 73420012
1466.5G3420012j694709k869535m687094k482963L563869O547833N031860K035617
$$ 73420012 71725303 68855768 64168674 61685711 65249580 71797413 76829273 78864890
1482.8G8864890L4535q25554j192516j262504j173979j343608j795125k060622k131098
$$ 78864890 78899425 78073871 76881355 75618851 74444872 73101264 71306139 69245517 67114419
1501.2F7114419k187085k967269m935503m934299m329526l491351K55915N973644R948593
$$ 67114419 64927334 61960065 57024562 52090263 47760737 44269386 44525301 50498945 60447538
1519.5F0447538J1809564Q582204L167176K90478q23409j253783j651645j363790r51171
$$ 60447538 72257102 80839306 84006482 84296960 83473551 82219768 80568123 79204333 78253162
1537.9G8253162j308531j612907j196719r17428p87807p61664p01081p25806r10014
$$ 78253162 76944631 75331724 74135005 73217577 72429770 71668106 70967025 70241219 69331205
1556.2F9331205j640374k262175j636701j777667k201361k716607l575456k963215
$$ 69331205 67690831 65428656 63791955 62014288 59812927 57096320 53520864 50557649
1572.6E0557649k96903K775175J440519j764482l163931l447634l494787l463796l199768
$$ 50557649 50260746 53035921 54476440 52711958 49548027 46100393 42605606 39141810 35942042
1590.9C5942042k697751k069455j307321m91187L20908J250267K438215L861052N112251
$$ 35942042 33244291 31174836 29867515 29376328 29697236 30947503 33385718 37246770 42359021
1609.3D2359021N346158M355795K850753P56532j126945j963240k456683k498013k558911
$$ 42359021 47705179 52060974 54911727 55668259 54541314 52578074 50121391 47623378 45064467
1627.6D5064467k594939k011120j222202K056J707709K860820L637657M015365M834366
$$ 45064467 42469528 40458408 39236206 39238262 40945971 43806791 47444448 51459813 56294179
1646E6294179N230331L821642L637689L672647Q98618q04508j745868k987211l908796
$$ 56294179 61524510 65346152 68983841 72656488 73555106 72750598 71004730 68017519 64108723
1664.3F4108723l984153m727548n758247n301070n497900n630290l871796k274486
$$ 64108723 60124570 55397022 49638775 44337705 38839805 33209515 29337719 27063233
1680.7B7063233j183644o5589R23672J617292K195564K306070K663586L026310K977684
$$ 27063233 25879589 25814000 26737672 28354964 30550528 32856598 35520184 38546494 41524178
1699D1524178L344220K720108K379909K567220K401424K279490K224260K245909K477891
$$ 41524178 44868398 47588506 49968415 52535635 54937059 57216549 59440809 61686718 64164609
1717.4F4164609K261096J736140J660520J695246J568859J431567J355231J613718
$$ 64164609 66425705 68161845 69822365 71517611 73086470 74518037 75873268 77486986
1733.7G7486986J571441J039493Q52441P79462O56146O72048Q39830J084477J105529
$$ 77486986 79058427 80097920 80950361 81729823 82385969 83058017 83897847 84982324 86087853
1752H6087853Q62366P18301O19775M51237L79664M67515O25390P55369P87592Q20363
$$ 86087853 86950219 87668520 88288295 88739532 89119196 89586711 90212101 90967470 91755062 92575425
1772.4I2575425O77365L79699J63460j341j22565o3169K86394O66219Q44866Q09139
$$ 92575425 93252790 93632489 93795949 93794608 93672043 93608874 93895268 94561487 95406353 96215492
1792.8I6215492O22440M89485L73793K33477K01440K63160K51300J50328R3431J00648
$$ 96215492 96837932 97327417 97701210 97934687 98136127 98399287 98650587 98800915 98894346 98994994
1813.2I8994994N7018k9343o2216n8210q2862q2767k68P2163R0855J43308K42484K63434
$$ 98994994 99052012 99022669 98960453 98902243 98819381 98736614 98736346 98808509 98899364 99042672 99285156 99548590
1837.7I9548590J71817R6011Q8501O8104J2535R18K1785q261l105q077J9896K349k7097
$$ 99548590 99720407 99816418 99904919 99973023 99985558 99986476 100008261 100000000 99996895 99988818 100008714 100011063 99983966
1864.2I9983966q791J126m5144p2086n6666o4195j22648j66351j62005j76698k37900
$$ 99983966 99975175 99976301 99931157 99859071 99802405 99738210 99615562 99449211 99287206 99110508 98872608
1886.7I8872608k91181k91681k88618l38095l52627l07918l12799l65621l98028m55361
$$ 98872608 98581427 98289746 98001128 97663033 97310406 97002488 96689689 96324068 95926040 95470679
1907.1I5470679o28030r41158j400798j639092q14814R56285J988405J765567J069105
$$ 95470679 94842649 93901491 92500693 90861601 90046787 91003072 92991477 94757044 95826149
1925.4I5826149N79274M04685L03841J51479K6530j2648l6633p8547p2700j7082r060
$$ 95826149 96405423 96810108 97113949 97265428 97291958 97279310 97242677 97164130 97091430 97074348 97065288
1947.9I7065288l3981j7524Q756k0349o7162p0763p1329j10292j31202p4941q243j0598
$$ 97065288 97031307 97013783 97022539 97002190 96935028 96864265 96792936 96682644 96551442 96476501 96468258 96457660
1972.3I6457660m9889r6381j86735l05343l58331l17412k45351j61958k7364J21694
$$ 96457660 96407771 96311390 96124655 95819312 95460981 95143569 94898218 94736260 94708896 94830590
1992.7I4830590J77414J30719O8110J3900n8496j10263r6607o5386q2636j31691j66219
$$ 94830590 95008004 95138723 95206833 95220733 95162237 95051974 94955367 94889981 94807345 94675654 94509435
2015.2I4509435j62024p9900P8237J77169J25873K0105n2315n0312M2021J49775K00527
$$ 94509435 94347411 94267511 94345748 94522917 94648790 94668895 94616580 94566268 94608289 94758064 94958591
2037.6I4958591J84089J22220O4689N1826O0868N2130L5096L5971L9834K4599O491
$$ 94958591 95142680 95264900 95329589 95381415 95442283 95494413 95529509 95565480 95605314 95629913 95636404
2060I5636404L719l600k4152l2806k9231l5059n4479o9856p2474p1078o6644n5373
$$ 95636404 95640123 95636523 95612371 95579565 95550334 95515275 95460796 95390940 95318466 95247388 95180744 95125371
2084.5I5125371m7380n2261o4719p2681p5257q1259q7262q9275r3007j09041j36519
$$ 95125371 95077991 95025730 94961011 94888330 94813073 94731814 94644552 94555277 94462270 94353229 94216710
2106.9I4216710j61612j79684j97244k12824k11984j87814j47361j08081q7148r7859
$$ 94216710 94055098 93875414 93678170 93465346 93253362 93065548 92918187 92810106 92722958 92625099
2127.3I2625099j49220k21067k40845j49012J8657J73890K65217K96158K82341K41989
$$ 92625099 92475879 92254812 92013967 91864955 91883612 92057502 92322719 92618877 92901218 93143207
2147.7I3143207K01160J67399J25480P8815N6535N8234M5258J3590n91J0223L1471
$$ 93143207 93344367 93511766 93637246 93716061 93772596 93830830 93876088 93889678 93889087 93899310 93930781
2170.2I3930781N5557P5680O5691J3053l3343l6669l1560n0122o4516n1856m0072m8262
$$ 93930781 93986338 94062018 94127709 94140762 94107419 94070750 94039190 93989068 93924552 93872696 93832624 93784362
2194.6I3784362n4169m9740o3121r0098q4258n0228m3762o2555m5967J8167O6006O3509
$$ 93784362 93730193 93680453 93617332 93527234 93442976 93392748 93348986 93286431 93240464 93258631 93324637 93388146
2219.1I3388146M8304L4737J794k4378o687J6212K199j5729j4979m2742j16271j66363
$$ 93388146 93436450 93471187 93472981 93448603 93441916 93458128 93460327 93444598 93429619 93386877 93270606 93104243
2243.6I3104243j54161j18369o8420K6059J28788J59859J24109R2638P9059M4340L243
$$ 93104243 92950082 92831713 92763293 92789352 92918140 93077999 93202108 93294746 93373805 93418145 93421388
2266I3421388K950J8048j388k2066J526K1648j1432m3642k2525N54j8745m0150l9911
$$ 93421388 93424338 93442386 93440998 93418932 93420458 93442106 93430674 93387032 93364507 93365061 93346316 93306166 93266255
2292.5I3266255n9253r6751q5032k7424K289j502J5575M6176L7497K205m792P832J1867
$$ 93266255 93207002 93110251 93025219 92997795 93000084 92998582 93014157 93060333 93097830 93100035 93095243 93103075 93114942
2319.1I3114942M6850J23208J58090J08731M6378M2677O1899N4109N9218Q6092O3003
$$ 93114942 93161792 93285000 93443090 93551821 93598199 93640876 93702775 93756884 93816102 93902194 93965197
2341.5I3965197k8301r4443m0198N3931R4258R0880P3433K175j04284j41394j34766
$$ 93965197 93936896 93842453 93802255 93856186 93950444 94041324 94114757 94116932 94012648 93871254 93736488
2363.9I3736488j61118j79726j54787j48576j94669k33030k29812k37680k70521k61885
$$ 93736488 93575370 93395644 93240857 93092281 92897612 92664582 92434770 92197090 91926569 91664684
2384.3I1664684j89662j16676q3494p0525q1151j37431j92505j64431o2210K4337O5440
$$ 91664684 91475022 91358346 91274852 91204327 91123176 90985745 90793240 90628809 90566599 90590936 90656376
2406.8I0656376J04886J46204J54436J47581J58864J69897J59258J45972J47152J32704
$$ 90656376 90761262 90907466 91061902 91209483 91368347 91538244 91697502 91843474 91990626 92123330
2427.2I2123330P6085J7816Q10l957k7359m4894m7737o4666q2379n1093J6814O0243
$$ 92123330 92199415 92217231 92218041 92214084 92186725 92141831 92094094 92029428 91947049 91895956 91912770 91973013
2451.6I1973013P0923Q2690R1862P5490N1898N1885N5868L1250l743j7970k5535n1200
$$ 91973013 92043936 92126626 92218488 92293978 92345876 92397761 92453629 92484879 92481136 92463166 92437631 92386431
2476.1I2386431p3106o4540n1641o6167r2447r9897q3411n1010n656L6698M8620L4922
$$ 92386431 92313325 92248785 92197144 92130977 92038530 91938633 91855222 91804212 91798556 91835254 91883874 91918796
2500.6I1918796K8867L0947J1664k7513n7435p0620q4191j01334j09196j15663j32859
$$ 91918796 91947663 91978610 91990274 91962761 91905326 91834706 91750515 91649181 91539985 91424322 91291463
2523I1291463j22302l6478P8034J16843O0439k0420p4935r7657r4926q1110p4673p4219
$$ 91291463 91169161 91132683 91210717 91327560 91387999 91367579 91292644 91194987 91100061 91018951 90944278 90870059
2547.5I0870059m7601K5738J11275J59705J65409J49202J17189P4273M0651K0462q118
$$ 90870059 90822458 90848196 90959471 91119176 91284585 91433787 91550976 91625249 91665900 91686362 91678244
2569.9I1678244m9222q3637j13582j55592k01023k19429j90490j18899k7299N4198
$$ 91678244 91629022 91545385 91431803 91276211 91075188 90855759 90665269 90546370 90519071 90573269
2590.3I0573269R7180Q2910K7746k7043o9505j13887j56486j76888j64432j20079n7453
$$ 90573269 90670449 90753359 90781105 90754062 90684557 90570670 90414184 90237296 90072864 89952785 89895332
2612.8H9895332J79M4840J04696J96361K55978K11871R2876j9813r7113j65284k34497
$$ 89895332 89895511 89940351 90045047 90241408 90497386 90709257 90802133 90782320 90685207 90519923 90285426
2635.2I0285426k85315l00133k74784k20096j47879o8253O377O7413R6190O3211l5805
$$ 90285426 90000111 89699978 89425194 89205098 89057219 88988966 88995343 89062756 89158946 89222157 89186352
2657.6H9186352j54453k41077k94179l28886l35366k98953k25729j26463M792J58376
$$ 89186352 89031899 88790822 88496643 88167757 87832391 87533438 87307709 87181246 87186038 87344414
2678H7344414K85846L51340L69870L57598K97362J93447Q9067P075o0075j06168j10257
$$ 87344414 87630260 87981600 88351470 88709068 89006430 89199877 89288944 89296019 89235944 89129776 89019519
2700.5H9019519p4208k3263L4046J09029J87832K34467K42537K35301K18618J83582
$$ 89019519 88945311 88922048 88956094 89065123 89252955 89487422 89729959 89965260 90183878 90367460
2720.9I0367460J45853J26046J11055P8482L3295o330m1938q5235j23918j26082r2202
$$ 90367460 90513313 90639359 90750414 90828896 90862191 90855861 90813923 90728688 90604770 90478688 90386486
2743.3I0386486o4641o0171o6853r2274j32173j58280j68455j82360k02954k18665
$$ 90386486 90321845 90261674 90194821 90102547 89970374 89812094 89643639 89461279 89258325 89039660
2763.7H9039660k15412j71935p0191P2784K00939K61652K53409K12032J58644R4175
$$ 89039660 88824248 88652313 88582122 88654906 88855845 89117497 89370906 89582938 89741582 89835757
2784.1H9835757L1209j3620m6539p0250o7371m1360l2687o7335j13875j31661j31446
$$ 89835757 89866966 89853346 89806807 89736557 89669186 89627826 89595139 89527804 89413929 89282268 89150822
2806.5H9150822j36775j35433j09607p0244m0770k0343R471M9359P7677Q1360N9181
$$ 89150822 89014047 88878614 88769007 88698763 88657993 88637650 88647121 88696480 88774157 88855517 88914698
2828.9H8914698O509o0260j13249j59246k17795k59197k50190k24674k22647k29573
$$ 88914698 88921207 88860947 88747698 88588452 88370657 88111460 87861270 87636596 87413949 87184376
2849.3H7184376k07788j64974j43301j50526j90920k88951m20320n23460n64462n07128
$$ 87184376 86976588 86811614 86668313 86517787 86326867 86037916 85617596 85094136 84529674 84022546
2869.7H4022546k99657L010K08152K07031Q3804n0026j84197l73584o44332r64194
$$ 84022546 83722889 83725899 83934051 84141082 84224886 84174860 83990663 83617079 82972747 82008553
2890.1H2008553j275146j508940j543373j084441J40924J699835K551931K288812J497090
$$ 82008553 80733407 79224467 77681094 76596653 76737577 78437412 80989343 83278155 84775245
2908.5H4775245Q16858L83967P7796j91259m46171o90180q94850r54873p83896n15902
$$ 84775245 85592103 85976070 86053866 85862607 85416436 84726256 83831406 82876533 82092637 81576735
2928.9H1576735l87842m28259n26482o39814o93387m43745J21558M61823J79279m39412
$$ 81576735 81188893 80760634 80234152 79594338 78900951 78457206 78578764 79040587 79219866 78780454
2949.3G8780454r22346j065504q35723l09300K07841L90410L75319N56546P86972N49222
$$ 78780454 77858108 76792604 75956881 75647581 75855422 76245832 76621151 77177697 77964669 78513891
2969.7G8513891j70327r73570j640064k165466k462107k194673j070994P84177K774208
$$ 78513891 78343564 77369994 75729930 73564464 71102357 68907684 67836690 68620867 71395075
2988G1395075L992296L926521L047878K142191J487994J008099O39391L70723K15656
$$ 71395075 75387371 79313892 82361770 84503961 85991955 87000054 87639445 88010168 88225824
3006.4H8225824J70505J71929J45114O7395l4488j31225k04080k22117j57833m3303
$$ 88225824 88396329 88568258 88713372 88780767 88746279 88615054 88410974 88188857 88031024 87987721
3026.8H7987721L7193K5112p0131k02412l34650m64463o11991o80643l87460K80851
$$ 87987721 88024914 88050026 87979895 87777483 87442833 86978370 86366379 85685736 85298276 85579127
3047.2H5579127P51317O21277K21991l7533j54269k42602l26866m05538m67867m54474
$$ 85579127 86330444 86951721 87173712 87136179 86981910 86739308 86412442 86006904 85539037 85084563
3067.6H5084563k83730L2944L33619M60571M12089K75564J33794M5705J1742m869k5875
$$ 85084563 84800833 84833777 85167396 85627967 86040056 86315620 86449414 86495119 86506861 86501992 86476117
3090H6476117n6904q4698r2680o8026j4079K5815J0901m6962j04612j45859j71321
$$ 86476117 86419213 86334515 86241835 86173809 86159730 86185545 86196446 86149484 86044872 85899013 85727692
3112.4H5727692j81646j89471k00802k16138k26343k10911j75452j43278j25378j35380
$$ 85727692 85546046 85356575 85155773 84939635 84713292 84502381 84326929 84183651 84058273 83922893
3132.8H3922893j77139k29311k83092l53587m18264l71128j56051P1853J19073J3816
$$ 83922893 83745754 83516443 83233351 82879764 82461500 82090372 81934321 82006174 82125247 82139063
3153.2H2139063j03343j73092k13366k51204k85739l13228l40766l72338m00901m19688
$$ 82139063 82035720 81862628 81649262 81398058 81112319 80799091 80458325 80085987 79685086 79265398
3173.6G9265398m32813m43262m55630m83161n34749o02341o72627p41231q14474q94618
$$ 79265398 78832585 78389323 77933693 77450532 76915783 76313442 75640815 74899584 74085110 73190492
3194G3190492r69749j030553j078254j115048j137560j131880j099575j060963j029598
$$ 73190492 72220743 71190190 70111936 68996888 67859328 66727448 65627873 64566910 63537312
3212.4F3537312j001335r34291p70026m72152n4676M18956Q71580J216257J369828
$$ 63537312 62535977 61601686 60831660 60359508 60304832 60723788 61595368 62811625 64181453
3230.7F4181453J301849J066893P74467N13804L32189K68751L38447N11068P34312
$$ 64181453 65483302 66550195 67324662 67838466 68170655 68439406 68777853 69288921 70023233
3249.1G0023233R33605J023209R62967P89201N79125L77244J92308L2413r5999j93662
$$ 70023233 70956838 71980047 72943014 73732215 74311340 74688584 74880892 74913305 74817306 74623644
3269.5G4623644k69144l36177l95029m43280m87650n28299n64254o02561o47068o84684
$$ 74623644 74354500 74018323 73623294 73180014 72692364 72164065 71599811 70997250 70350182 69665498
3289.9F9665498p14457p60162q25692q88216r34160r67252r92692j021969j057434
$$ 69665498 68951041 68190879 67365187 66476971 65542811 64575559 63582867 62560898 61503464
3308.2F1503464j068914j030779r55784q81434q42481q41588q66741r18794r97758
$$ 61503464 60434550 59403771 58447987 57566553 56724072 55882484 55015743 54096949 53099191
3326.6E3099191j068389j088214j069504j023266r24474p61783n30580k04175K11486
$$ 53099191 52030802 50942588 49873084 48849818 47925344 47163561 46632981 46428806 46640292
3345D6640292O49106J035190J350838J660439J995319K257818K348191K288675K123642
$$ 46640292 47289398 48324588 49675426 51335865 53331184 55589002 57937193 60225868 62349510
3363.3F2349510J870626J582098J316876J079946Q44580O11782L97373J94150k682
$$ 62349510 64220136 65802234 67119110 68199056 69043636 69655418 70052791 70246941 70244259
3381.7G0244259j79875l38471m89450o39260p84254r16725j047802j183391j303368
$$ 70244259 70064384 69725913 69236463 68597203 67812949 66896224 65848422 64665031 63361663
3400F3361663j412362j527375j625192j681024j688057j645834j546561j362992j086452
$$ 63361663 61949301 60421926 58796734 57115710 55427653 53781819 52235258 50872266 49785814
3418.4D9785814p29570l02088J73252O56492J103497J478886J778698J986528K074575
$$ 49785814 49056244 48754156 48927408 49583900 50687397 52166283 53944981 55931509 58006084
3436.7E8006084K058679J992142J886725J724297J530659J292366J020575Q05330P60114
$$ 58006084 60064763 62056905 63943630 65667927 67198586 68490952 69511527 70316857 71076971
3455.1G1076971R25732J143527J224166J170153J081007R77189Q28552O74772N83869
$$ 71076971 72002703 73146230 74370396 75540549 76621556 77598745 78427297 79102069 79685938
3473.4G9685938N40001N16063N00476M69440M39537M21273L97844L73780L58361L55751
$$ 79685938 80225939 80742002 81242478 81711918 82151455 82572728 82970572 83344352 83702713 84058464
3493.8H4058464L61883L40963L02463K84797K66201K35444K19303K32023K63405K61790
$$ 84058464 84420347 84761310 85063773 85348570 85614771 85850215 86069518 86301541 86564946 86826736
3514.2H6826736K18540J97023K17545K40106K18725J82462J94496K24477K30336K30646
$$ 86826736 87045276 87242299 87459844 87699950 87918675 88101137 88295633 88520110 88750446 88981092
3534.6H8981092K18987J89442J91712K19709K07031J47247J23173J50824J67805J66696
$$ 88981092 89200079 89389521 89581233 89800942 90007973 90155220 90278393 90429217 90597022 90763718
3555I0763718J76656K07448K31624K15095J83600J97315K32053K20627K09653K33859
$$ 90763718 90940374 91147822 91379446 91594541 91778141 91975456 92207509 92428136 92637789 92871648
3575.4I2871648K47800K48850K68113K81787K40171J81938K23213K77597K55781K35182
$$ 92871648 93119448 93368298 93636411 93918198 94158369 94340307 94563520 94841117 95096898 95332080
3595.8I5332080K53332K47621K20585K15119K05446J95634K05278K04611K07317J95581
$$ 95332080 95585412 95833033 96053618 96268737 96474183 96669817 96875095 97079706 97287023 97482604
3616.2I7482604J57863J77306K10893J89018J26803N6368R6369J47599J20216J02169
$$ 97482604 97640467 97817773 98028666 98217684 98344487 98400855 98497224 98644823 98765039 98867208
3636.6I8867208J02275R5427R7144J00792O4468K3079O5553J08713P6252N2256P2550
$$ 98867208 98969483 99064910 99162054 99262846 99327314 99350393 99415946 99524659 99600911 99653167 99725717
3659I9725717M6051j73J383j0061o1542j9747J3876r6125r5367q989M793M4042J09696
$$ 99725717 99771768 99771595 99772978 99762917 99701375 99681628 99695504 99599379 99504012 99495023 99499816 99543858 99653554
3685.6I9653554J15263K9886n519M8494P5621P2133N3650K1267K5749M0543J1087n4586
$$ 99653554 99768817 99798703 99793184 99841678 99917299 99989432 100043082 100064349 100090098 100130641 100141728 100087142
3710A00087142q3590j0037M4298K6798p975k3186l3450l0518M721K5690Q356k8044
$$ 100087142 100003552 99993515 100037813 100064611 100056636 100033450 100000000 99969482 99974203 99999893 100008249 99980205
3734.5I9980205l6955K0546L4577p4798j42068R340M5580n8836j2111P5095M2934k0624
$$ 99980205 99943250 99963796 99998373 99923575 99781507 99790847 99836427 99777591 99765480 99840575 99883509 99862885
3759I9862885j3077K4575K8271J7273j0162j5712J7786L8147L6031J3983n108j3071
$$ 99862885 99849808 99874383 99902654 99919927 99909765 99894053 99911839 99949986 99986017 100000000 99994892 99981821
3783.5I9981821k0218j4180j55N013q411k9349j8495l1346o0130k521l213l1280K8670
$$ 99981821 99961603 99947423 99947268 99952281 99943870 99914521 99896026 99864680 99804550 99802029 99798816 99767536 99796206
3810I9796206O2740J9139k7246r435n6881q5878J1939N0211M1073K8175J7751K2399
$$ 99796206 99858946 99878085 99850839 99841404 99784523 99698645 99710584 99760795 99801868 99830043 99847794 99870193
3834.4I9870193k2948q3488m4411J0156L3397N5152N8913p075j64443j19668Q0364
$$ 99870193 99847245 99763757 99719346 99729502 99762899 99818051 99876964 99869889 99705446 99585778 99666142
3856.9I9666142R4420L1454k8027l3080n245k9797k1618L1352N6892N7090l523k2507
$$ 99666142 99760562 99792016 99763989 99730909 99725664 99695867 99674249 99705601 99762493 99819583 99816060 99793553
3881.4I9793553J5170j5408j2481J1342k2846j7160J7553K81l7289m5157k3037K1816
$$ 99793553 99808723 99793315 99780834 99792176 99769330 99752170 99769723 99770004 99732715 99687558 99664521 99686337
3905.8I9686337M3904J9032k080j854p939r352J4990L0411J6474J3811K8926L0237
$$ 99686337 99730241 99749273 99747193 99745339 99737400 99728048 99743038 99773449 99789923 99803734 99832660 99862897
3930.3I9862897K7103L6835L9822L0720J0229j1534L928K1935P224L540K0123K1028
$$ 99862897 99890000 99926835 99966657 99997377 100007606 99996072 100000000 100021935 100029159 100032699 100052822 100073850
3954.8A00073850P153M494P868N161J1790K6572TJ1837k253k789P438Q059P963J5760
$$ 100073850 100081003 100085497 100093365 100098526 100110316 100136888 100163460 100175297 100173044 100170255 100177693 100185752 100193715 100209475
3983.3A00209475J1289j860n865Q82L600k527j311
$$ 100209475 100220764 100218904 100213039 100213921 100217521 100214994 100213683
3997.6A00213683
$$ 100213683
##END=$$ End of the data block
