##TITLE=Benzocaina - Mirela e Fran $$ Begin of the data block
##JCAMP-DX=5.00 $$ ACD/SpecManager v 10.08
##SPECTROMETER/DATA SYSTEM=Alpha
##DATE=24 Apr 2015 08:22:40
##DATA TYPE=INFRARED SPECTRUM
##DATA CLASS=XYDATA
##ORIGIN=
##OWNER=
##NPOINTS=1765
##FIRSTX=399.76428223
##LASTX=3997.64306641
##MAXX=3997.64306641
##MINX=399.76428223
##MAXY=1.00665963
##MINY=0.17095178
##XFACTOR=1.0000000000
##YFACTOR=0.000000010000000
##FIRSTY=1.00000000
##DELTAX=2.03961372
##XUNITS=1/CM
##YUNITS=ARBITRARY UNITS
##XYDATA=(X++(Y..Y))
399.8A00000000j59538N24640L00861k34938j99211k31814l28964l98791p7551k10828
420.2I8983866n11926k91712j68496m87864n49424k39014k92802n25415k67881p6276
440.6I5573056m18484n09060j38146j57547m91851l93498j21117l59440n99366k85012
461I2099535k18421n41454n16373k57707m49425p21300m71329l29972o38145p45886
481.3H7209523n37521o42729r59497r63492r86999j479876k037364k458084l164547
499.7G3979414l609497j837969J884705L964335K557689M65739K26897Q08739R02587
518.1G9342639O99580L21311j26523j78617k0576j99896m11629k38198j23412l26735
538.5G8737944l51828j12325j30451l22544k08611l0207j64175k61736p9179k5028
$$ plain form
399.8 100000000 99840462 100365102 100665963 100431025 100231814 100000000 99671036 99272245 99194694 98983866
420.2 98983866 98471940 98180228 98011732 97523868 96974444 96735430 96442628 95917213 95649332 95573056
440.6 95573056 95154572 94645512 94507366 94349819 93857968 93464470 93343353 92983913 92384547 92099535
461 92099535 91881114 91339660 90823287 90565580 90116155 89394855 88923526 88593554 87955409 87209523
481.3 87209523 86672002 86029273 85069776 84106284 83119285 81639409 79602045 77143961 73979414
499.7 73979414 70369917 68531948 70416653 74380988 76938677 77404416 77631313 78440052 79342639
518.1 79342639 80042219 80363530 80237007 80058390 80037814 79837918 79426289 79188091 79064679 78737944
538.5 78737944 78386116 78273791 78143340 77820796 77612185 77581978 77417803 77156067 77076888 77051860
558.9G7051860j93000j73932J8752k7430j70488m5317R3508m8328j41412L1817P8935
581.3G6474965q7250p5543J04368M7535j16825k2471R4455o4313k00302j23745j96343
603.7G5834531m69667n81873n69582p78371r23669j98555K089328N339557O912696
622.1H6654395N054259J565182p24816j231956j040602j271248k274036k681923j63710
640.4H3885545L127229L092646J352871M70638J13404J12063L17859K22850J5766J42359
660.8I2853230K77353R2327m2194J61165J43760r4604n2798J44160K6333k07436j38843
683.3I3162453j29407n18883r46885j349598k325940m229790o388170o024516p22247
701.6G0527017O204838Q865231O630510L291512J410198Q95107O24871J94472Q3631
$$ plain form
558.9 77051860 76858860 76684928 76703680 76676250 76505762 76460445 76553953 76505625 76364213 76396030 76474965
581.3 76474965 76387715 76312172 76416540 76464075 76347250 76324779 76419234 76354921 76154619 76030874 75834531
603.7 75834531 75364864 74782991 74213409 73435038 72511369 72312814 74402142 79741699 86654395
622.1 86654395 91708654 93273836 92549020 91317064 90276462 89005214 86731178 84049255 83885545
640.4 83885545 87012774 90105420 91458291 91928929 92042333 92154396 92472255 92695105 92710871 92853230
660.8 92853230 93130583 93222910 93180716 93341881 93485641 93391037 93338239 93482399 93508732 93301296 93162453
683.3 93162453 93033046 92514163 91567278 90217680 87891740 83661950 77273780 71249264 70527017
701.6 70527017 76731855 85597086 92227596 95519108 96929306 97824413 98449284 98643756 98727387
720I8727387K62004J42712j12599j2690J26344r0635k37906m8971k8396l02559l38286
742.4I8086405j69498l17025o01697n86450o13159j058585j572102j947355k436227
760.8H8784307l328192n077189p860279j0427565r831297l845578N381554J1961204
777.1F5756965J2379861Q987248N488830L045976J705367J185256P63077K86448J70219
795.4I9769247K28583K170k21270j19555j10358m17281n64175m32051l35866j39254
815.8I7660190K78884L33452k25383p18707q06075j039833j525044j558781j382470
834.2I1016233k185625m231042o801492q474051p153506k861630K669465Q054006J0125297
852.6H0157655P654626M209542K191472J275665R04649N68050J5432m21447m74095
$$ plain form
720 98727387 98989391 99132103 99019504 99006814 99133158 99042523 98804617 98755646 98727250 98424691 98086405
742.4 98086405 97916907 97599882 96998185 96411735 95798576 94739991 93167889 91220534 88784307
760.8 88784307 85456115 80378926 72518647 62091082 52259785 48414207 53795761 65756965
777.1 65756965 78136826 87124074 92612904 95658880 97364247 98549503 99312580 99599028 99769247
795.4 99769247 99997830 100000000 99778730 99659175 99548817 99131536 98567361 98135310 97799444 97660190
815.8 97660190 97939074 98272526 98047143 97328436 96522361 95482528 93957484 92398703 91016233
834.2 91016233 88830608 84599566 77798074 69324023 62170517 59308887 61978352 70032358 80157655
852.6 80157655 87812281 92021823 94213295 95488960 96393609 96961659 96977091 96555644 96081549
870.9I6081549n16683q87102j268291j220739o56635K95288J330489J858305J429391
889.3I6445572N79787J56974O0624j20657k27958j13553r4086k56246k65050j21570
909.7I6043837j59991k96145k24495j10203k06179k87801j65051j11884k40582k54017
930.1I3987489j14614j18619k36637j92046r4747j85126k95258k32851k13981l92610
950.5I1911000n24980m28021k36404j65885k89649n24557m96572M9335M94390L08025
970.9I0096682j14548l05557k67679k79653l98999m05890l26091l77488m92239m81129
991.3H6647409m55212n67776o72734o55341o86914q36092r61817j162648j592248j893253
1011.6G7163374j839441j912164k398837k954698l138721k457171j83028L521633O490982
$$ plain form
870.9 96081549 95564866 94677764 93409473 92188734 91532099 91827387 93157876 95016181 96445572
889.3 96445572 97025359 97182333 97242957 97122300 96894342 96780789 96686703 96430457 96165407 96043837
909.7 96043837 95883846 95587701 95363206 95253003 95046824 94759023 94593972 94482088 94241506 93987489
930.1 93987489 93872875 93754256 93517619 93325573 93230826 93045700 92750442 92517591 92303610 91911000
950.5 91911000 91386020 90957999 90721595 90555710 90266061 89741504 89244932 89294267 89788657 90096682
970.9 90096682 89982134 89676577 89408898 89129245 88730246 88324356 87998265 87620777 87128538 86647409
991.3 86647409 86192197 85624421 84951687 84296346 83609432 82773340 81811523 80648875 79056627 77163374
1011.6 77163374 75323933 73411769 71012932 68058234 64919513 62462342 62279314 65800947 72291929
1030G2291929O589144M423171K157206P92372M5174l67045m85534n15467o33066p19798
1050.4H3578086p05123p49940q87429r56595r79132j118302j321906j432574j494878
1068.8G3932207j585275j561034j306206r50301o05070k19828J55872L30824K64442
1087.1F8455631Q5115j81878n90992j069969j544421k097571k791435l559357m263645
1105.5E2441478m262352k341187J260170L771117L055466J01435k784807m163414l531703
1123.8D3546203r02876K635589N037990N361843M630220L941566L288138K458203J611918
1142.2G1608794Q63653J58400m67247r80228j512313k051956k259207k043229k049851
1160.5F1266816k968610m701394o559255p579777o523883k466816M099524J0717929
$$ plain form
1030 72291929 78881073 83304244 85461450 86253822 86298996 85931951 85446417 84930950 84297884 83578086
1050.4 83578086 82872963 82123023 81235594 80278999 79299867 78181565 76859659 75427085 73932207
1068.8 73932207 72346932 70785898 69479692 68529391 67924321 67704493 67860365 68191189 68455631
1087.1 68455631 68540746 68358868 67767876 66697907 65153486 63055915 60264480 56705123 52441478
1105.5 52441478 48179126 45837939 47098109 50869226 53924692 54026127 51241320 47077906 43546203
1123.8 43546203 42643327 45278916 50316906 55678749 60308969 64250535 67538673 69996876 71608794
1142.2 71608794 72472447 72630847 72163600 71183372 69671059 67619103 65359896 63316667 61266816
1160.5 61266816 58298206 53596812 47037557 39457780 32933897 30467081 34566605 45284534
1176.9D5284534J4221489J3328797R508937N290550K282065O15806l11852q67528j075243
1195.2H8277555j063735j000482q32432n44328l73202m65745o45101p39723p77317
1213.6H1835490p87371p81339q81547j149190j434117j626533j829428k099138k305323
1231.9F8941504k344865k134418j515389o26510o9082k06536p66557j355386j879061
1250.3E8043700k347362k688378k876651k973172k982420k877322k816456k980432
1266.6C5501507l341556l697961l753940l309537k458413j445503l99419O34398J532422
1285A9261998K435686L880320N856201P315350P082784N175480K483529k13927k096033
1303.3E1181388l098172m794315o456381l745624K929008P488602P894916O642157
$$ plain form
1176.9 45284534 59506023 72834820 82343757 87634307 89916372 90532178 90220326 89352798 88277555
1195.2 88277555 87213820 86213338 85380906 84836578 84463376 83997631 83352530 82612807 81835490
1213.6 81835490 81048119 80266780 79385233 78236043 76801926 75175393 73345965 71246827 68941504
1231.9 68941504 66596639 64462221 62946832 62320322 62251240 62044704 61278147 59922761 58043700
1250.3 58043700 55696338 53007960 50131309 47158137 44175717 41298395 38481939 35501507
1266.6 35501507 32159951 28461990 24708050 21398513 18940100 17494597 17095178 17729576 19261998
1285 19261998 21697684 25578004 31434205 38749555 45832339 51007819 53491348 53277421 51181388
1303.3 51181388 48083216 43288901 36832520 33086896 36015904 43504506 51399422 58041579
1319.6E8041579N430626M765475M465586M048121L353304K512306J608777O78563j08475
1338H4795862l81565L8666P70706J314163J385951R88042L32398m63570j647794l535545
1358.4H3597314o390547r694040j0046649n950970l13145M035104N874479O159895
1374.7F7271441N308295L919094K568996J445699N58841m90993j487416j331788L13013
1393.1G8075182K534938L212256K399051J413339O93262L46201K45333K04980J18518
1411.4H9243060L8529j9145j63907l85398m52727n38516p84862j150572j692718k212793
1431.8H1880951k815640m672605o602824n247324j670945K604175M742193L378904
1448.1G1596885J400542J608467K368140K126015J051145J73492k80828q83972j424122
$$ plain form
1319.6 58041579 63472205 68237680 72703266 76751387 80104691 82616997 84225774 84904337 84795862
1338 84795862 84414297 84452963 85223669 86537832 87923783 88911825 89244223 88780653 87132859 83597314
1358.4 83597314 77206767 67512727 57466078 51515108 51201963 55237067 61111546 67271441
1374.7 67271441 72579736 76498830 79067826 80513525 81072366 80581373 79093957 77762169 78075182
1393.1 78075182 80610120 83822376 86221427 87634766 88328028 88674229 88919562 89124542 89243060
1411.4 89243060 89281589 89262444 89098537 88713139 88260412 87721896 86937034 85786462 84093744 81880951
1431.8 81880951 79065311 74392706 67789882 62542558 60871613 63475788 68217981 71596885
1448.1 71596885 72997427 74605894 76974034 79100049 80151194 80324686 80043858 79159886 77735764
1466.5G7735764j791793l043914n100912k915162L617525O999874N410081K165837
1482.8H3077300P9953p89481j222032j280880j114029j321846j874197k138811k166373
1501.2G1249604k312743l390700n681360n663508n238560m568752j67874O849095J1436391
1519.5F2511593J2972623R293741L713793P27927o76900j379519j833576j510138j222479
1537.9H2597065j692712j731015j150149r22060p92324p11400o72257q02910j043200
1556.2G3079038j714212k165026j556426j776469k286416k980685m014313l389645
1572.6E3195846m76682L094053J881075j721549l510123m068083m246938m257477m023829
1590.9C5866293l492853k680865j559347k78031J040750K445016L915804N311987O199679
$$ plain form
1466.5 77735764 75943971 72900057 67799145 64883983 68501508 75501382 80911463 83077300
1482.8 83077300 83157253 82367772 81145740 79864860 78750831 77428985 75554788 73415977 71249604
1501.2 71249604 68936861 65546161 59864801 54201293 48962733 44393981 44226107 51075202 62511593
1519.5 62511593 75484216 84777957 88491750 89219677 88542777 87163258 85329682 83819544 82597065
1537.9 82597065 80904353 79173338 78023189 77101129 76308805 75597405 74925148 74122238 73079038
1556.2 73079038 71364826 69199800 67643374 65866905 63580489 60599804 56585491 53195846
1572.6 53195846 52719164 55813217 57694292 55972743 52462620 48394537 44147599 39890122 35866293
1590.9 35866293 32373440 29692575 28133228 27855197 28895947 31340963 35256767 40568754 46768433
1609.3D6768433N861163M313362K283126r9367j701248k358270k930235k957547k959889
1627.6D6219528l020269k445531j582923p0048K090079L472194M322365M636934N274487
1646E8896816N463522L930223L609974L614455J064521n55760j534223k870852l819853
1664.3F7798823l958183m926205o235445n949968o455835o873906m935855l028002
1680.7B5435424j675518k79461J098871K216784L188359L391728L763884M102305L876081
1699D5118457M195035L339988K807778K922487K590805K313042K160239K095622K294642
1717.4F9838095K191180J715272J558978J525712J372701J210177J097566J331686
1733.7H1841367J399804R35435P04920O39493N41287N28425O56915Q99142R75907P64644
$$ plain form
1609.3 46768433 52629596 56942958 59226084 59126717 57425469 55067199 52136964 49179417 46219528
1627.6 46219528 43199259 40753728 39170805 39100757 41190836 44663030 48985395 53622329 58896816
1646 58896816 64360338 68290561 71900535 75514990 76579511 76023751 74489528 71618676 67798823
1664.3 67798823 63840640 58914435 52678990 46729022 40273187 33399281 28463426 25435424
1680.7 25435424 23759906 23480445 24579316 26796100 29984459 33376187 37140071 41242376 45118457
1699 45118457 49313492 52653480 55461258 58383745 60974550 63287592 65447831 67543453 69838095
1717.4 69838095 72029275 73744547 75303525 76829237 78201938 79412115 80509681 81841367
1733.7 81841367 83241171 84176606 84881526 85521019 86062306 86590731 87247646 88146788 89122695 89887339
1754.1H9887339O11442N20122L62009L20381M30375M96835N12671N39130O39814N74917
1774.5I4895035L23319J51933K7960r7459o0547K38741M81438N22924N56546N39857
1794.9I7579747L88867K15900J69516K27117K09004J32024J07950J11997P0656K5940
1815.3I9238718K5516m810r3370j16534l5333k80r334J00720J97881J67805J30433
1837.7I9601412J34593Q0067j0514K5516J03063O5863k748r912J2660O974l1406J0270
1862.2I9985838K4271n3781p7325K6786M7249m1444o8038m2081q1265j48672j46282
1884.6I9425256j40887k14046k41972j86485j96009k52784k46358k12174k45005l19457
1905I7170079l64656m38839o71458j081484j302964o70695O94072J495415J367766
$$ plain form
1754.1 89887339 90498781 91018903 91380912 91701293 92131668 92628503 93141174 93680304 94320118 94895035
1774.5 94895035 95218354 95370287 95398247 95300788 95240241 95478982 95960420 96483344 97039890 97579747
1794.9 97579747 97968614 98184514 98354030 98581147 98790151 98922175 99030125 99142122 99212778 99238718
1815.3 99238718 99264234 99259424 99166054 99049520 99014187 99013907 99004573 99105293 99303174 99470979 99601412
1837.7 99601412 99736005 99816072 99805558 99831074 99934137 100000000 99997252 99987340 100000000 100006974 99975568 99985838
1862.2 99985838 100010109 99956328 99879003 99905789 99953038 99911594 99843556 99801475 99720210 99571538 99425256
1884.6 99425256 99284369 99070323 98828351 98641866 98445857 98193073 97946715 97734541 97489536 97170079
1905 97170079 96805423 96366584 95695126 94613642 93310678 92639983 93334055 94829470 96197236
1923.4I6197236Q67164M50164K82442K32447J28853J0538j5682k0993p3761o7937J2601
1945.8I8003072K3233k9319k3919K1588j323o0493n7011m2397r5457j24836m4322K0969
1970.3I7589785j4597n0700n9843j33026k43062k66164k17849j92511j54591l0666
1990.7I6226776J01494J27364R4062P6312K5808o4635r1630n4968n7494r5993j01078
2013.1I6186018j07789j40971q6504P4684J41412N6339Q177J6344p397R543J10119
2035.6I6259975J79470J33032O2167O2329P0768L0762J2863M4900M6093L105j377K7329
2060I6931416N436l7867k0403O837l1638o3783l2866k2924o4588o8783k7746k9147
2084.5I6543944o3700m9245j8406m7701q3131o0421m2177p5030q9997o4933p7296j32441
$$ plain form
1923.4 96197236 97064400 97514564 97797006 98029453 98158306 98168844 98153162 98132169 98058408 97990471 98003072
1945.8 98003072 98026305 97996986 97973067 97994655 97993332 97932839 97875828 97833431 97737974 97613138 97568816 97589785
1970.3 97589785 97575188 97524488 97464645 97331619 97088557 96822393 96604544 96412033 96257442 96226776
1990.7 96226776 96328270 96455634 96549696 96626008 96651816 96587181 96495551 96440583 96383089 96287096 96186018
2013.1 96186018 96078229 95937258 95850754 95925438 96066850 96123189 96131366 96147710 96140313 96149856 96259975
2035.6 96259975 96439445 96572477 96634644 96696973 96767741 96798503 96811366 96856266 96902359 96905464 96904087 96931416
2060 96931416 96936852 96898985 96878582 96885419 96853781 96789998 96757132 96734208 96669620 96600837 96573091 96543944
2084.5 96543944 96480244 96430999 96412593 96364892 96281761 96221340 96179163 96104133 96014136 95949203 95871907 95739466
2109I5739466j49137j32406j53768j82753j48005r1541q3881q6338o8223r7322j79106
2131.4I4366986j96177r8777K6578J23501K07036K50161K15924J68907J65689J47468
2151.8I5377296Q4758N0390O2752M9173R179J0479K9653N514m977N0628Q2374L1817
2176.3I5839036j5325o795r775m4036m7022k3389l5214o2347m1848j1069l5363o9606
2200.8I5437247n6977m2921o0153n5778k1583j3572j0657L9506Q0085M5717k689J067
2225.2I5339292J1188j2523j8364J3828J6493k6465n2505o2538j04957j40441j04129
2247.7I4858879l0410K2840O7437J13708J16264O7371L4649L6579J7571j6981r608
2270.1I5278299J3548q70j5527N722J2266k0080l5531j7714j5444m1514n7179n9676
$$ plain form
2109 95739466 95590329 95457923 95304155 95121402 94973397 94881856 94797975 94711637 94643414 94546092 94366986
2131.4 94366986 94170809 94072032 94098610 94222111 94429147 94679308 94895232 95064139 95229828 95377296
2151.8 95377296 95462054 95512444 95575196 95624369 95633548 95644027 95673680 95679194 95674217 95724845 95807219 95839036
2176.3 95839036 95823711 95816916 95807141 95763105 95716083 95692694 95657480 95595133 95553285 95542216 95506853 95437247
2200.8 95437247 95380270 95337349 95277196 95221418 95199835 95186263 95175606 95215112 95295197 95340914 95338225 95339292
2225.2 95339292 95350480 95337957 95319593 95333421 95349914 95323449 95270944 95208406 95103449 94963008 94858879
2247.7 94858879 94828469 94851309 94918746 95032454 95148718 95216089 95250738 95287317 95304888 95287907 95278299
2270.1 95278299 95291847 95290977 95275450 95281172 95293438 95273358 95237827 95220113 95204669 95163155 95105976 95046300
2294.6I5046300p6557q2868m6837q857j5361k7418r161l290k5845l6084l3290l6853
2319.1I4643879j1015N3513Q2052M0698K318J6648L3182K2834K9398N1814L9476P516
2343.5I5012313K0874N4753L3503k2196n4926o9517j00178j09386q5032p1281o0827
2366I4548100l8028k9361m8935p0864o9529p4136j11866j44285j40494j23763j02693
2388.4I3594146o1023l0393o0820j23913j45864j14596o5607l773O4254R7990R7478
2410.8I3247879J07204J29128J27596J12730J22237J39088J21200Q2767N6594K8223
2431.2I4274646j0192k4975j2272j8621n0586o5321n5629l9601p105M6104Q1307P4851
2455.7I4192606N7292N6213N3573L5310K7495L0762J2130j8001l0094l8362n5670n7519
$$ plain form
2294.6 95046300 94969743 94886875 94840038 94831181 94815820 94788402 94779241 94775951 94750106 94714022 94680732 94643879
2319.1 94643879 94632864 94686377 94768429 94809127 94811445 94828093 94861275 94884109 94913507 94965321 95004797 95012313
2343.5 95012313 95033187 95087940 95121443 95099247 95044321 94974804 94874626 94765240 94680208 94608927 94548100
2366 94548100 94510072 94480711 94431776 94360912 94291383 94217247 94105381 93961096 93820602 93696839 93594146
2388.4 93594146 93533123 93502730 93441910 93317997 93172133 93057537 92991930 92988157 93052411 93150401 93247879
2410.8 93247879 93355083 93484211 93611807 93724537 93846774 93985862 94107062 94189829 94246423 94274646
2431.2 94274646 94264454 94239479 94227207 94208586 94158000 94092679 94037050 93997449 93990344 94036448 94117755 94192606
2455.7 94192606 94249898 94306111 94359684 94394994 94422489 94453251 94465381 94447380 94417286 94378924 94323254 94265735
2480.2I4265735m1777m3523p0739q5980o5618l2860q458J6194L6991L2961J7029J5146
2504.7I4035101R704k1214n3262o2579o5107p5465q4323r3275j10078r8836k1696P2473
2529.1I3431443R7835N0074j3244o1149q3148p6521o4814o6960o5690l5250K1225P8672
2553.6I3212473J18643J34010J21653Q9818O0183M0906J6582j5735m1425o3736r5927
2576I3577445j34373j64116j77019j64271j08850k1714N0491P6545O4975L3599j0997
2598.5I3021715n8294r5498j22547j41985j40309j00553l9017M262K8753Q1634J63788
2620.9I2601949K01315J54829O6161j8484q9448j50049k01958k43009k57569k32935
2641.3I1830802j81049j20896o1667p57N5784P6568M1300l5226j28079k11406k63893
$$ plain form
2480.2 94265735 94223958 94180435 94109696 94023716 93958098 93925238 93916780 93932974 93969965 94002926 94019955 94035101
2504.7 94035101 94044805 94023591 93970329 93907750 93842643 93767178 93682855 93589580 93479502 93380666 93358970 93431443
2529.1 93431443 93529278 93579352 93566108 93504959 93421811 93345290 93280476 93213516 93147826 93112576 93133801 93212473
2553.6 93212473 93331116 93465126 93586779 93676597 93736780 93777686 93794268 93778533 93737108 93673372 93577445
2576 93577445 93443072 93278956 93101937 92937666 92828816 92807102 92857593 92934138 92999113 93032712 93021715
2598.5 93021715 92963421 92867923 92745376 92603391 92463082 92362529 92323512 92327774 92356527 92438161 92601949
2620.9 92601949 92803264 92958093 93024254 93005770 92916322 92766273 92564315 92321306 92063737 91830802
2641.3 91830802 91649753 91528857 91467190 91466433 91522217 91598785 91640085 91604859 91476780 91265374 91001481
2663.7I1001481k86108k86204k59531j97708j02657J7041J42389K45935L08776L27015
2684.1I0910429L08627K57879J77437Q6045J0151m1675p4739q3470o1607j8949L4374
2706.6I1504502R6447J55019J90229J95801J84238J67364J45262J22887J05059Q6582
2727I2953390N8818K4831n370l8576p7612j03926j01984p9942o0308n4210o2144q5211
2751.4I2367756j14464j31715j38342j51712j70541j82491j82527j49280n8228O8343
2771.8I1156799J71452K14863K09654J75648J23001O8259K4682j2982m9931o7484n4961
2794.3I1959000l7492m1008n9926q0800j03194j19656j21117j13719r8062o5690k8152
2816.7I1090184n614R799L9357P1960P6950N3072J8239k5296p8184j29097j76061k11680
$$ plain form
2663.7 91001481 90715373 90429169 90169638 89971930 89869273 89886314 90028703 90274638 90583414 90910429
2684.1 90910429 91219056 91476935 91654372 91740417 91750568 91708893 91634154 91550684 91489077 91470128 91504502
2706.6 91504502 91600949 91755968 91946197 92141998 92326236 92493600 92638862 92761749 92866808 92953390
2727 92953390 93012208 93037039 93031669 92993093 92915481 92811555 92709571 92629629 92569321 92515111 92452967 92367756
2751.4 92367756 92253292 92121577 91983235 91831523 91660982 91478491 91295964 91146684 91088456 91156799
2771.8 91156799 91328251 91543114 91752768 91928416 92051417 92119676 92144358 92131376 92081445 92013961 91959000
2794.3 91959000 91921508 91880500 91820574 91739774 91636580 91516924 91395807 91282088 91184026 91118336 91090184
2816.7 91090184 91084570 91094369 91133726 91205686 91282636 91335708 91353947 91328651 91250467 91121370 90945309 90733629
2841.2I0733629k15095j94031j80256j77831j61558j30600j07354j04403j37073k14648
2861.6H9110780l18521m18532m74549m26066k39741N918J53315J40745L9869p8028
2882H7495190k04194l70019o09762r14979j226008j473355j545531j132381Q1671J661324
2902.4H1761956K510810K217692J417977P59661L50690O3467j74373l86095n91207
2920.7H7930578p65973q09908o55842m38392l51024l94499m82476n96398o60390m33087
2941.1H2342589R6357M14723J56552m07953q57955r98801p69055k50166K26098L53551
2961.5H0305940L20774N33384Q01605N77736j41823r57859j664245k244258k577066
2979.9G4954188k306986j147223P59370K789145L986913L834582K878308J952314J308322
$$ plain form
2841.2 90733629 90518534 90324503 90144247 89966416 89804858 89674258 89566904 89462501 89325428 89110780
2861.6 89110780 88792259 88373727 87899178 87473112 87233371 87239289 87392604 87533349 87573218 87495190
2882 87495190 87290996 86920977 86311215 85396236 84170228 82696873 81151342 80018961 80100632 81761956
2902.4 81761956 84272766 86490458 87908435 88668096 89018786 89082253 88907880 88521785 87930578
2920.7 87930578 87164605 86354697 85698855 85260463 84909439 84514940 84032464 83436066 82775676 82342589
2941.1 82342589 82438946 82853669 83010221 82602268 81744313 80745512 79976457 79726291 79952389 80305940
2961.5 80305940 80626714 81160098 81961703 82539439 82397616 81439757 79775512 77531254 74954188
2979.9 74954188 72647202 71499979 72259349 75048494 79035407 82869989 85748297 87700611 89008933
2998.2H9008933Q46851N09954K82180J52832J09720J13154R9492L8880m3684j18828
3018.6I0999484j76018j97179j49434m9359J9234j668r0808j99151l10540m39299n85174
3041.1H8820088o38282l55262K59972O91878N77605K13939k7442j34814k07698k77334
3061.5H8922650l47007l99863l85464k44349J4049K66170L82299L41534K12515R2512
3081.9H8855046K9457l094k6065m3333o5517q5735q9896o6066k1100O551q846m9698
3106.3H8431704r4157j40876j69486j69378j73581j94919k12997k13975j96707j69927
3126.7H6695701j40876j18321j24329j62351k10947k63548l31724l90506l42243j43111
3147.1H4467745N9694R8449K926j05351j73938k09481k34425k67338l06285l38983
$$ plain form
2998.2 89008933 89855784 90365738 90647918 90800750 90910470 91023624 91123116 91161996 91118312 90999484
3018.6 90999484 90823466 90626287 90476853 90427494 90446728 90445060 90354252 90155101 89844561 89405262 88820088
3041.1 88820088 88181806 87826544 88086516 88778394 89355999 89569938 89542496 89407682 89199984 88922650
3061.5 88922650 88575643 88175780 87790316 87545967 87560016 87826186 88208485 88550019 88762534 88855046
3081.9 88855046 88884503 88881409 88855344 88812011 88746494 88660759 88570863 88504797 88483697 88490248 88481402 88431704
3106.3 88431704 88337547 88196671 88027185 87857807 87684226 87489307 87276310 87062335 86865628 86695701
3126.7 86695701 86554825 86436504 86312175 86149824 85938877 85675329 85343605 84953099 84610856 84467745
3147.1 84467745 84527439 84625888 84628814 84523463 84349525 84140044 83905619 83638281 83331996 82993013
3167.5H2993013l65925l91144m06515m11541m23008m44233m74584n22924n88941o63591
3187.9G8300607p36862q12054q95190r77838j049113j108474j157898j194513j209598
3206.3F9159067j203072j187104j175601j168281j117640r59790o55645k07186L29298
3224.6F1814046Q59356J266628J455164J397562J155013Q48967N74589L75837K93404
3243G0040566L52514N28663P65049R77779J071489J013279Q46016O32316M17042K25639
3263.4G6870352O8647o0380j71572k57969l18747l71314m25314m75574n18471n60611
3283.8G3779047o02729o44481o87736p30485p82251q50523r21601r80514j019722j046527
3304.2F5512478j093119j160508j191736j153999j073730r94396r51827r57650j003277
$$ plain form
3167.5 82993013 82627088 82235944 81829429 81417888 80994880 80550647 80076063 79553139 78964198 78300607
3187.9 78300607 77563745 76751691 75856501 74878663 73829550 72721076 71563178 70368665 69159067
3206.3 69159067 67955995 66768891 65593290 64425009 63307369 62347579 61691934 61484748 61814046
3224.6 61814046 62673402 63940030 65395194 66792756 67947769 68796736 69371325 69747162 70040566
3243 70040566 70393080 70921743 71686792 72664571 73736060 74749339 75595355 76227671 76644713 76870352
3263.4 76870352 76938999 76878619 76707047 76449078 76130331 75759017 75333703 74858129 74339658 73779047
3283.8 73779047 73176318 72531837 71844101 71113616 70331365 69480842 68559241 67578727 66559005 65512478
3304.2 65512478 64419359 63258851 62067115 60913116 59839386 58844990 57893163 56935513 55932236
3322.5E5932236j083607j189017j279217j324487j339012j322034j249916j099032
3338.8D6045914q38083m37993P3204O07949J076067J446101J803297K226069K615226
3357.2E4617751K789670K718246K486712K171880J829630J508701J237148R87315P27540
3375.5G1074593M71735K42138L4666j62095l41481m97049o45488p94119r28545j057762
3395.9F7396593j196176j331979j467573j599390j705688j786363j834822j829123
3412.3E4645479j749414j570136j278764q84810m02859J32641O78191J189363J606435
3430.6E2366126J917100K117508K175510K113503K008540J876604J688952J475358
3446.9F7739201J222813R24486O79803O29437Q31723J114529J240623J202649J115781
$$ plain form
3322.5 55932236 54848629 53659612 52380395 51055908 49716896 48394862 47144946 46045914
3338.8 46045914 45207831 44769838 44843042 45450991 46527058 47973159 49776456 52002525 54617751
3357.2 54617751 57407421 60125667 62612379 64784259 66613889 68122590 69359738 70347053 71074593
3375.5 71074593 71546328 71788466 71823132 71661037 71319556 70822507 70177019 69382900 68454355 67396593
3395.9 67396593 66200417 64868438 63400865 61801475 60095787 58309424 56474602 54645479
3412.3 54645479 52896065 51325929 50047165 49162355 48759496 48892137 49570328 50759691 52366126
3430.6 52366126 54283226 56400734 58576244 60689747 62698287 64574891 66263843 67739201
3446.9 67739201 68962014 69886500 70566303 71195740 72027463 73141992 74382615 75585264 76701045
3465.3G6701045R94390Q20113O54524N59044N11056M83668M56119M14979L94130L92264
3485.7H2381332L76582L53921L38065L29727L24470L00264K68644K56974K45076K16764
3506.1H5391819K05678K29568K50893K36035K08169K00713K05242K09248J99378J82968
3526.5H7519711J97828K31910K46268K40219K14958J89030J96284K01983J73908J54275
3546.9H9566374J62762J61010J67871J97196K07591K07698K07275J71846J27399J88899
3567.3I1365921L05719K99388K38454K26146K45339K64734K67452K34574J82462J95598
3587.7I3825787K82830K89017K43956K51174K73872K63822K52252K32011J81956J74409
3608.1I6271086K12711K11716K01404J78647J63930K40356K72238J79655M7111J7929
$$ plain form
3465.3 76701045 77695435 78515548 79170072 79729116 80240172 80723840 81179959 81594938 81989068 82381332
3485.7 82381332 82757914 83111835 83449900 83779627 84104097 84404361 84673005 84929979 85175055 85391819
3506.1 85391819 85597497 85827065 86077958 86313993 86522162 86722875 86928117 87137365 87336743 87519711
3526.5 87519711 87717539 87949449 88195717 88435936 88650894 88839924 89036208 89238191 89412099 89566374
3546.9 89566374 89729136 89890146 90058017 90255213 90462804 90670502 90877777 91049623 91177022 91365921
3567.3 91365921 91671640 91971028 92209482 92435628 92680967 92945701 93213153 93447727 93630189 93825787
3587.7 93825787 94108617 94397634 94641590 94892764 95166636 95430458 95682710 95914721 96096677 96271086
3608.1 96271086 96483797 96695513 96896917 97075564 97239494 97479850 97752088 97931743 97978854 97996783
3628.5I7996783J84614K41887J79720J47301J22219R3866O7437N287p8309k4170J88649
3650.9I9125284K24841J16616R2858J25832P0345j001k5779p9632j29599m9358l9202
3673.3I9431205j08069J5300J08969Q0663O1870L7974q303n716Q4209J31065J06031
3695.8I9935198O4802J6296l982L8195L1173n2976j11974k7740J02508Q0884j0646
3718.2A00061738n5766n0091l4404L528L9632j5700j15049j08034K4307R8568K1130
3740.6I9869859j25944j34093J4621j7583o2204R0665J42980N7101J4257M9198L9106
3763.1I9937963r042j9925j2947L4309P3719L5799j6869k3007Q58m267j777K9660L4022
3789.6A00058496k480o3884j04272q7428q9306m5723O7717M4000J8061O4414L2348
$$ plain form
3628.5 97996783 98181397 98423284 98603004 98750305 98872524 98966390 99033827 99039114 98960805 98936635 99125284
3650.9 99125284 99350125 99466741 99559599 99685431 99755776 99754775 99728996 99649364 99519765 99470407 99431205
3673.3 99431205 99323136 99338436 99447405 99528068 99589938 99627912 99619609 99613893 99698102 99829167 99935198
3695.8 99935198 100000000 100016296 100012314 100050509 100081682 100028706 99916732 99888992 99991500 100072384 100061738
3718.2 100061738 100005972 99955881 99921477 99925005 99964637 99948937 99833888 99725854 99750161 99848729 99869859
3740.6 99869859 99743915 99609822 99624443 99606860 99544656 99635321 99778301 99835402 99849659 99898857 99937963
3763.1 99937963 99928921 99908996 99896049 99930358 100004077 100039876 100023007 100000000 100000858 99996591 99994814 100024474 100058496
3789.6 100058496 100056016 99992132 99887860 99800432 99711126 99665403 99733120 99777120 99795181 99859595 99891943
3812I9891943o0630q5294l2682n8895k0945P7802O0242K5630j800k1368k2274o6418
3836.5I9685311p9268J1253P0656P9888O9135N818j27578k27767k3002J66440J02818
3858.9I9733704m744n4336j3912J854m7397j2207O0391Q2040N1242l1251k7019J3632
3883.4I9751997p683R549m989l0071L5948M4262m7302j02157p0279P337R5969J12689
3907.9I9795270N5683L421l1203n2351k2572K4074K1249J3006L8558L0929o676J1939
3932.3I9881327O0803N6976K2077j0228j9353Q398J4031k062J1563L3879L2282J4103
3956.8A00103796Q94K944J8311K3496J3101Q607N865J705O461J0085K587K014J4818
3983.3A00214684J7130L207j0073r871k050L564Q059
$$ plain form
3812 99891943 99831313 99746019 99713337 99654442 99633497 99711299 99771541 99797171 99795371 99774003 99751729 99685311
3836.5 99685311 99606043 99617296 99687952 99767840 99836975 99842793 99715215 99487448 99464446 99630886 99733704
3858.9 99733704 99728960 99674624 99660712 99662566 99615169 99602962 99663353 99745393 99796635 99765384 99738365 99751997
3883.4 99751997 99744314 99753863 99748874 99718803 99754751 99799013 99751711 99649554 99579275 99586612 99682581 99795270
3907.9 99795270 99850953 99854374 99823171 99770820 99748248 99772322 99793571 99806577 99845135 99876064 99869388 99881327
3932.3 99881327 99942130 99999106 100021183 100010955 99991602 100000000 100014031 100011969 100023532 100057411 100089693 100103796
3956.8 100103796 100104690 100107634 100125945 100149441 100162542 100171149 100177014 100178719 100185180 100195265 100197852 100199866 100214684
3983.3 100214684 100231814 100235021 100224948 100215077 100213027 100216591 100224650
3997.6A00224650
$$ plain form
3997.6 100224650
##END=$$ End of the data block
