##TITLE=Benzocaina - Lucas Lucas e Marcos $$ Begin of the data block
##JCAMP-DX=5.00 $$ ACD/SpecManager v 10.08
##SPECTROMETER/DATA SYSTEM=Alpha
##DATE=24 Apr 2015 08:22:40
##DATA TYPE=INFRARED SPECTRUM
##DATA CLASS=XYDATA
##ORIGIN=
##OWNER=
##NPOINTS=1765
##FIRSTX=399.76428223
##LASTX=3997.64306641
##MAXX=3997.64306641
##MINX=399.76428223
##MAXY=1.00482309
##MINY=0.33085120
##XFACTOR=1.0000000000
##YFACTOR=0.000000010000000
##FIRSTY=1.00000000
##DELTAX=2.03961372
##XUNITS=1/CM
##YUNITS=ARBITRARY UNITS
##XYDATA=(X++(Y..Y))
$$ plain form
399.8 100000000 100086236 100198293 100143874 100246394 100482309 100366199 99971408 99843657 100000000 99908459
420.2 99908459 99471927 99256921 99227124 98968035 98524237 98341173 98399472 98203194 97763681 97600776
440.6 97600776 97725677 97602922 97184491 96983111 97062385 96934354 96525973 96300620 96322221 96107721
461 96107721 95625103 95341671 95360214 95234978 94792140 94441628 94358122 94104791 93536872 93094724 92945498
483.4 92945498 92625636 91912520 91205376 90681899 89891982 88484383 86629575 84423864 81821471
501.7 81821471 80026293 80809748 83554608 85576463 85818428 85720676 86392051 87270862 87608004 87628573
522.1 87628573 87772101 87913281 87736809 87434322 87349832 87355113 87113512 86744970 86607516 86634332 86472332
544.6 86472332 86154264 86021763 86057049 85933828 85652101 85540003 85619324 85568404 85333252 85224819
$$ packed form
399.8A00000000Q6236J12057n4419J02520K35915j16110l94791j27751J56343r1541
420.2I9908459m36532k15006k9797k59089m43798j83064N8299j96278m39513j62905
440.6I7600776J24901j22755m18431k01380P9274j28031m08381k25353K1601k14500
461I6107721m82618k83432J8543j25236m42838l50512q3506k53331n67919m42148j49226
483.4I2945498l19862p13116p07144n23477p89917j407599j854808k205711k602393
501.7H1821471j795178P83455K744860K021855K41965r7752O71375Q78811L37142K0569
522.1H7628573J43528J41180j76472l02487q4490N281k41601l68542j37454K6816j62000
544.6H6472332l18068j32501L5286j23221k81727j12098P9321n0920k35152j08433
$$ plain form
565 85224819 85324818 85335588 85140008 85021603 85109365 85139757 84980655 84867775 84952170 85017717 84902930
587.4 84902930 84798479 84877968 84957319 84840620 84682381 84678549 84676051 84424752 84028655 83698136 83322960
609.8 83322960 82664353 81889671 81657898 82935953 86219817 90376520 93438405 94614762 94483745
628.2 94483745 93864441 93302548 92775083 91601461 89788026 89331663 91183025 93176275 93882108
646.6 93882108 94058168 94330698 94558275 94591516 94640911 94880235 95119172 95150995 95080382 95102865 95275742
669 95275742 95366186 95377564 95504397 95679402 95666599 95539337 95533735 95565552 95346022 94828075 94098240
691.4 94098240 92876256 90396422 86175638 81902283 81245232 85329705 90915567 94843882 96870470
709.8 96870470 97817183 98189962 98405081 98688877 98906684 98927969 98925030 99067634 99208516 99164188 99068666
$$ packed form
565H5224819R9999J0770j95580j18405Q7762L0392j59102j12880Q4395O5547j14787
587.4H4902930j04451P9489P9351j16699j58239l832k498k51299l96097l30519l75176
609.8H3322960o58607p74682k31773J278055L283864M156703L061885J176357j31017
628.2I4483745o19304n61893n27465j173622j813435m56363J851362J993250P05833
646.6I3882108J76060K72530K27577L3241M9395K39324K38937L1823p0613K2483J72877
669I5275742R0444J1378J26833J75005j2803j27262n602L1817k19530n17947p29835
691.4I4098240j221984k479834m220784m273355o57051M084473N585862L928315K026588
709.8I6870470R46713L72779K15119K83796K17807K1285k939J42604J40882m4328r5522
$$ plain form
732.2 99068666 99115103 99186915 99086952 98913842 98868614 98874485 98722869 98453343 98251361 98055816 97614384
754.7 97614384 96849763 95848787 94613004 92811334 89586562 83907992 75730479 67564064 64103580
773 64103580 68220681 77531147 86712676 92699593 95901531 97675842 98708832 99218667 99475807
791.4 99475807 99729818 99944502 99984848 99934256 99957728 100000000 99901521 99686193 99506611 99348360 99155062
813.8 99155062 99087054 99281168 99508756 99453312 99125129 98714912 98215777 97499865 96689397 95915228
834.2 95915228 94764501 92349178 87847680 81604195 76020837 73646194 75429302 81094211 88160491
852.6 88160491 93324542 95881009 97049582 97828609 98453373 98750216 98715413 98557168 98356658 98015112
873 98015112 97476488 96791035 96072727 95601749 95743304 96555513 97647363 98478359 98841262 98938656
$$ packed form
732.2I9068666M6437P1812r9963j73110m5228N871j51616k69526k01982j95545m41432
754.7I7614384p64621j000976j235783j801670l224772n678570q177513q166415l460484
773F4103580M117101R310466R181529N986917L201938J774311J032990N09835K57140
791.4I9475807K54011K14684M0346n0592K3472M2272r8479k15328j79582j58251j93298
813.8I9155062o8008J94114K27588n5444l28183m10217m99135p15912q10468p74169
834.2I5915228j150727k415323m501498o243485n583358k374643J783108N664909P066280
852.6H8160491N164051K556467J168573P79027O24764K96843l4803j58245k00510l41546
873I8015112n38624o85453p18308m70978J41555Q12209J091850Q30996L62903R7394
$$ plain form
893.4 98938656 98976761 98964822 98878235 98786801 98742682 98689163 98571694 98444813 98370469 98300630 98174310
915.8 98174310 98033428 97942078 97868246 97748846 97610867 97523022 97465485 97367501 97242385 97156745 97097623
938.2 97097623 96996874 96857953 96738988 96637404 96483493 96248889 95978701 95736605 95577055 95476401
958.6 95476401 95310426 94996804 94711512 94745409 95006871 95169860 95142800 94993371 94806397 94638467
979 94638467 94462931 94237059 93988049 93762338 93532467 93248117 92924988 92603159 92260993 91849548
999.4 91849548 91377449 90887809 90347642 89596456 88515532 87255383 85999203 84606892 82842088
1017.8 82842088 80669910 78272367 76266915 75935948 78362584 82881492 87375724 90363103 91849142
1036.1 91849142 92445797 92591763 92487025 92258435 91988641 91675305 91291851 90860355 90413135 89929688
$$ packed form
893.4I8938656L8105j1939q6587r1434m4119n3519j17469j26881p4344o9839j26320
915.8I8174310j40882r1350p3832j19400j37979q7845n7537r7984j25116q5640n9122
938.2I7097623j00749j38921j18965j01584j53911k34604k70188k42096j59550j00654
958.6I5476401j65975l13622k85292L3897K61462J62989k7060j49429j86974j67930
979I4638467j75536k25872k49010k25711k29871k84350l23129l21829l42166m11445
999.4I1849548m72099m89640n40167p51186j080924j260149j256180j392311j764804
1017.8H2842088k172178k397543k005452l30967K426636M518908M494232K987379J486039
1036.1I1849142N96655J45966j04738k28590k69794l13336l83454m31496m47220m83447
$$ plain form
1056.5 89929688 89366186 88720804 88012254 87209910 86261028 85179758 84053785 82971662 81998563
1074.9 81998563 81226248 80761796 80628324 80733675 80950338 81172568 81287098 81165272 80731165 79963380
1095.3 79963380 78803974 77136695 74847233 71838826 68110299 64317918 62244022 63342553
1111.6 63342553 66570538 69161201 69255590 66866803 63252753 60203540 59477460 61803150 66135830
1129.9 66135830 70671147 74469441 77537000 80004770 81847912 83024323 83585608 83673459 83399576
1148.3 83399576 82753271 81673920 80208969 78598523 77090710 75510836 73161554 69267511 63498366
1166.7 63498366 56464267 50155908 47611985 51299065 60914546 72926068 83197141 89846694
1183 89846694 93311447 94759339 95135099 94987816 94551247 93938291 93287063 92730111 92308158 91993225
$$ packed form
1056.5H9929688n63502o45382p08550q02344r48882j081270j125973j082123r73099
1074.9H1998563p72315m64452j33472J05351K16663K22230J14530j21826m34107p67785
1095.3G9963380j159406j667279k289462l008407l728527l792381k073896J098531
1111.6F3342553L227985K590663R4389k388787l614050l049213p26080K325690M332680
1129.9F6135830M535317L798294L067559K467770J843142J176411N61285Q7851k73883
1148.3H3399576o46305j079351j464951j610446j507813j579874k349282l894043n769145
1166.7F3498366p034099o308359k543923L687080R615481J2011522J0271073O649553
1183H9846694L464753J447892L75760j47283m36569o12956o51228n56952m21953l14933
$$ plain form
1203.4 91993225 91751420 91518652 91191661 90733331 90238935 89804006 89375639 88818425 88079548 87188601
1223.8 87188601 86141270 84888113 83418089 81781924 80057204 78424203 77242291 76760393 76727021
1242.1 76727021 76591486 76001066 74905056 73353481 71386862 69061762 66482610 63771886 61029321
1260.5 61029321 58322161 55589765 52637124 49279425 45515224 41644844 38150910 35428289
1276.8 35428289 33696014 33085120 33640125 35214683 37802812 41934016 47983438 55193216 61872077
1295.2 61872077 66647857 69028848 69040781 67283702 64453393 59934968 53799868 50147069 52770609
1313.5 52770609 59690404 66892952 72755176 77292603 80972010 84145874 86866570 89039356
1329.8 89039356 90571570 91474628 91858220 91822755 91579527 91576749 92111629 93016428 93886405 94465172
$$ packed form
1203.4I1993225k41805k32768l26991m58330m94396m34929m28367n57214p38877q90947
1223.8H7188601j047331j253157j470024j636165j724720j633001j181912m81898l3372
1242.1G6727021j35535n90420j096010j551575j966619k325100k579152k710724k742565
1260.5F1029321k707160k732396k952641l357699l764201l870380l493934k722621
1276.8C5428289j732275o10894N55005J574558K588129M131204O049422P209778O678861
1295.2F1872077M775780K380991J1933j757079k830309m518425o135100l652799K623540
1313.5E2770609O919795P202548N862224M537427L679407L173864K720696K172786
1329.8H9039356J532214R03058L83592l5465k43228k778N34880R04799Q69977N78767
$$ plain form
1350.2 94465172 94684309 94436532 93423867 91202909 86993015 80039138 72280073 67477942 67237729
1368.6 67237729 70553094 75241715 79951513 83789802 86486375 88210326 89176095 89585149 89352101
1386.9 89352101 88444138 87556857 87692845 89291739 91364992 92876345 93702877 94132447 94420928
1405.3 94420928 94595444 94682258 94755942 94845110 94906288 94862127 94649112 94359571 93996358 93473750 92764229
1427.7 92764229 91730416 90319091 88491493 85319591 80556464 76628023 75361866 77337050
1444.1 77337050 80904222 83445346 84528607 85737264 87464690 89013785 89659619 89564312 89245367
1462.4 89245367 88633603 87651658 86380202 84263176 80668646 78583944 81135517 86001784 89731270
1480.8 89731270 91239327 91330045 90876627 90139830 89232838 88378727 87452734 86155826 84569108
$$ packed form
1350.2I4465172K19137k47777j012665k220958m209894o953877p759065m802131k40213
1368.6F7237729L315365M688621M709798L838289K696573J723951R65769M09054k33048
1386.9H9352101r07963q87281J35988J598894K073253J511353Q26532M29570K88481
1405.3I4420928J74516Q6814P3684Q9168O1178m4161k13015k89541l63213n22608p09521
1427.7I2764229j033813j411325j827598l171902m763127l928441j266157J975184
1444.1G7337050L567172K541124J083261J208657J727426J549095O45834r5307l18945
1462.4H9245367o11764r81945j271456k117026l594530k084702K551573M866267L729486
1480.8H9731270J508057R0718m53418p36797r06992q54111r25993j296908j586718
$$ plain form
1499.1 84569108 82934523 81281298 78927535 74735016 70350683 66230547 62514913 62102997 67212182
1517.5 67212182 75854176 85286242 91681439 94155747 94731712 94420546 93723810 92738944 91843390
1535.8 91843390 91138250 90194368 89043677 88092291 87299681 86702502 86211878 85717750 85151196 84509176
1556.2 84509176 83364737 81578970 80224419 78828239 77108300 74868459 71788013 69195032
1572.6 69195032 68924075 71372199 72668785 71154433 68352008 65175688 61831522 58362180 54912877
1590.9 54912877 51705194 48959500 47002009 46130151 46548343 48442015 51851052 56584269 62032753
1609.3 62032753 67009759 70540309 72392434 72334248 70988148 69158560 66877759 64506263 62035340
1627.6 62035340 59444058 57336915 55990487 55928189 57692379 60638624 64297551 68183726 72541112
$$ packed form
1499.1H4569108j634585j653225k353763m192519m384333m120136l715634m11916N109185
1517.5F7212182Q641994R432066O395197K474308N75965l11166o96736r84866q95554
1535.8I1843390p05140r43882j150691r51386p92610n97179m90624m94128n66554o42020
1556.2H4509176j144439j785767j354551j396180j719939k239841l080446k592981
1572.6F9195032k70957K448124J296586j514352k802425l176320l344166l469342l449303
1590.9E4912877l207683k745694j957491q71858M18192J893672L409037M733217N448484
1609.3F2032753M977006L530550J852125n8186j346100j829588k280801k371496k470923
1627.6F2035340k591282k107143j346428o2298J764190K946245L658927L886175M357386
$$ plain form
1646 72541112 76867485 79767931 82359862 84908783 85596424 85270882 84403980 82634574 80058593
1664.3 80058593 77230990 73542351 68589872 63600069 57881850 51541317 46859822 43939343
1680.7 43939343 42281798 41822070 42605686 44565350 47582307 50844616 54408294 58173287 61603802
1699 61603802 65212029 67987466 70289457 72689122 74791145 76655835 78422874 80203885 82099974
1717.4 82099974 83697939 84865016 85979486 87084895 88048428 88908345 89730436 90681303 91530490
1735.7 91530490 92054152 92487335 92872787 93176782 93489659 93893409 94402128 94889206 95240617 95527011
1756.1 95527011 95784187 95983839 96131599 96286571 96530205 96868271 97206467 97483170 97682142 97810024
1776.5 97810024 97862124 97820425 97750014 97749370 97865242 98082060 98381990 98699570 98907655 99026704 99131322
$$ packed form
1646G2541112M326373K900446K591931K548921O87641l25542q66902j769406k575981
1664.3H0058593k827603l688639m952479m989803n718219o340533m681495k920479
1680.7D3939343j657545m59728P83616J959664L016957L262309L563678L764993L430515
1699F1603802L608227K775437K301991K399665K102023J864690J767039J781011J896089
1717.4H2099974J597965J167077J114470J105409R63533Q59917Q22091R50867Q49187
1735.7I1530490N23662M33183L85452L03995L12877M03750N08719M87078L51411K86394
1756.1I5527011K57176J99652J47760J54972K43634L38066L38196K76703J98972J27882
1776.5I7810024N2100m1699p0411o44J15872K16818K99930L17580K08085J19049J04618
$$ plain form
1799 99131322 99239796 99320787 99369121 99423683 99506861 99572575 99577540 99563628 99577373 99594277 99570578 99529916
1823.4 99529916 99530667 99576139 99598211 99582589 99614257 99715960 99809110 99852437 99898809 99971008 100000000 99973083
1847.9 99973083 99955904 99987054 100020802 100006223 99975437 99980694 100000000 100007272 100003529 100025034 100041175 100014341
1872.4 100014341 99968290 99945116 99941111 99906492 99830067 99763083 99728513 99669427 99549657 99430490 99346256
1894.8 99346256 99250293 99115998 98982322 98883867 98781335 98610395 98362243 98029917 97515452 96847868
1915.2 96847868 96477789 96849853 97653514 98330748 98706669 98918456 99087673 99202073 99239069 99243575
1935.6 99243575 99261796 99274200 99249631 99215609 99215281 99224782 99204993 99177867 99184901 99207062 99192917 99147385
1960.1 99147385 99116898 99105179 99071187 99015623 98994136 99015200 99015790 98957801 98871994 98784387 98674893 98537570
$$ packed form
1799I9131322J08474Q0991M8334N4562Q3178O5714M965j3912J3745J6904k3699m0662
1823.4I9529916P51M5472K2072j5622L1668J01703R3150M3327M6372P2199K8992k6917
1847.9I9973083j7179L1150L3748j4579l0786N257J9306P272l743K1505J6141k6834
1872.4A00014341m6051k3174m005l4619p6425o6984l4570n9086j19770j19167q4234
1894.8I9346256r5963j34295j33676r8455j02532j70940k48152l32326n14465o67584
1915.2I6847868l70079L72064Q03661O77234L75921K11787J69217J14400L6996M506
1935.6I9243575J8221J2404k4569l4022l28R501j9789k7126P034K2161j4145m5532
1960.1I9147385l0487j1719l3992n5564k1487K1064N90n7989q5807q7607j09494j37323
$$ plain form
1984.6 98537570 98426974 98394179 98417723 98446941 98480535 98537374 98587692 98583555 98535585 98500609 98489702 98461330
2009 98461330 98403615 98350251 98307675 98247081 98184294 98183703 98238957 98276567 98286951 98295772 98315835 98358929 98414630
2035.6 98414630 98479235 98562181 98638296 98669070 98671496 98693192 98734719 98754537 98746413 98752648 98784643 98798656
2060 98798656 98777753 98762572 98773110 98775244 98745108 98712045 98708087 98711115 98682904 98640388 98625475 98630154 98614895
2086.6 98614895 98580986 98564613 98564535 98543656 98498201 98464823 98452032 98425895 98371840 98318487 98282450 98232156
2111 98232156 98144257 98047638 97976089 97918594 97854298 97799635 97778851 97765595 97706550 97602272 97511429 97476351
2135.5 97476351 97493011 97554630 97664475 97804064 97931463 98023963 98099566 98175800 98235148 98260820 98276716
2157.9 98276716 98310518 98346162 98354250 98344159 98347491 98372734 98401201 98422003 98445559 98471141 98474735 98449510
$$ packed form
1984.6I8537570j10596l2795K3544K9218L3594N6839N0318m137m7970l4976j0907k8372
2009I8461330n7715n3364m2576o0594o2787n91N5254L7610J0384Q821K0063M3094N5701
2035.6I8414630O4605Q2946P6115L0774K426K1696M1527J9818q124O235L1995J4013
2060I8798656k0903j5181J0538K134l0136l3063l958L028k8211m2516j4913M679j5259
2086.6I8614895l3909j6373p8k0879m5455l3378j2791k6137n4055n3353l6037n0294
2111I8232156q7899r6619p1549n7495o4296n4663k0784j3256n9045j04278r0843l5078
2135.5I7476351J6660O1619J09845J39589J27399R2500P5603P6234N9348K5672J5896
2157.9I8276716L3802L5644Q088j0091L332K5243K8467K0802K3556K5582L594k5225
$$ plain form
2182.4 98449510 98424536 98417693 98407364 98375309 98344284 98340589 98343885 98319405 98278499 98255301 98245513 98220515
2206.9 98220515 98185736 98171222 98179382 98190761 98203099 98231936 98271471 98286271 98268300 98256886 98272973 98286194
2231.4 98286194 98274088 98260951 98265868 98260361 98213917 98145038 98090363 98053867 98025817 98024231 98071039 98142779
2255.8 98142779 98191607 98208374 98225397 98252708 98261184 98243392 98231989 98240715 98244637 98230445 98219758 98228818
2280.3 98228818 98235548 98214221 98181432 98167235 98155808 98112476 98050773 98008138 97982591 97944438 97893089 97855496
2304.8 97855496 97834420 97803611 97759211 97727603 97708863 97665232 97587919 97529954 97531277 97553295 97543919 97518319
2329.3 97518319 97520751 97542697 97547269 97545034 97566456 97599608 97626191 97679949 97758430 97783691 97713012 97574914
2353.7 97574914 97430146 97306120 97200513 97120899 97092730 97125810 97183329 97231877 97288007 97355342 97402477
$$ packed form
2182.4I8449510k4974o843j0329l2055l1025l695L296k4480m0906k3198r788k4998
2206.9I8220515l4779j4514Q160J1379J2338K8837L9535J4800j7971j1414J6087J3221
2231.4I8286194j2106j3137M917n507m6444o8879n4675l6496k8050j586M6808P1740
2255.8I8142779M8828J6767J7023K7311Q476j7792j1403Q726L922j4192j0687R060
2280.3I8228818O730k1327l2789j4197j1427m3332o1703m2635k5547l8153n1349l7593
2304.8I7855496k1076l0809m4400l1608j8740m3631p7313n7965J323K2018r376k5600
2329.3I7518319K432K1946M572k235K1422L3152K6583N3758P8481K5261p0679j38098
2353.7I7574914j44768j24026j05607p9614k8169L3080N7519M8548N6130O7335M7135
$$ plain form
2376.2 97402477 97419208 97422969 97422612 97404647 97360331 97312868 97287679 97271478 97230840 97159272 97085381 97035950
2400.6 97035950 97011858 97008115 97029829 97075975 97132415 97188419 97248268 97317767 97389168 97453690 97513819 97571683
2425.1 97571683 97619200 97644651 97648627 97647440 97648335 97638834 97613651 97583872 97555900 97528285 97506905 97506219 97533286
2451.6 97533286 97575152 97610956 97636664 97663385 97692996 97715008 97726387 97736621 97749221 97750515 97728711 97694802
2476.1 97694802 97667319 97647697 97623098 97589952 97556633 97522795 97483701 97449678 97440153 97455347 97474176 97486746
2500.6 97486746 97500604 97515464 97515756 97492039 97458303 97431350 97403198 97360134 97310442 97264951 97213215 97155160
2525.1 97155160 97130030 97168255 97235012 97265190 97244006 97208822 97181064 97146356 97099006 97056621 97028428 97012079
2549.5 97012079 97016025 97057354 97134525 97215974 97271281 97306317 97343183 97372764 97370374 97346783 97327143 97300601
$$ packed form
2376.2I7402477J6731L761l57j7965m4316m7463k5189j6201m0638p1568p3891m9431
2400.6I7035950k4092l743K1714M6146N6440N6004N9849O9499P1401O4522O0129N7864
2425.1I7571683M7517K5451L976j187Q95r501k5183k9779k7972k7615k1380o86K7067
2451.6I7533286M1866L5804K5708K6721K9611K2012J1379J0234J2600J294k1804l3909
2476.1I7694802k7483j9622k4599l3146l3319l3838l9094l4023r525J5194J8829J2570
2500.6I7486746J3858J4860K92k3717l3736k6953k8152m3064m9692m5491n1736n8055
2525.1I7155160k5130L8225O6757L0178k1184l5184k7758l4708m7350m2385k8193j6349
2549.5I7012079L946M1329P7171Q1449N5307L5036L6866K9581k390k3591j9640k6542
$$ plain form
2574 97300601 97239906 97148401 97053415 96961695 96866947 96793181 96775359 96809536 96853346 96875948 96883267 96880680
2598.5 96880680 96849334 96782303 96704441 96635216 96569794 96511161 96483189 96495134 96527618 96574467 96658111 96774328
2623 96774328 96867591 96889699 96850359 96787745 96707594 96587497 96430397 96276557 96155638 96058840 95979774
2645.4 95979774 95939249 95947051 95978576 96003032 96008599 95990032 95925856 95800024 95636511 95472056 95315385
2667.8 95315385 95168763 95059216 95018941 95054853 95148474 95283467 95455909 95649236 95823574 95951903
2688.2 95951903 96042335 96100003 96108460 96067625 96012986 95972282 95941567 95922548 95940000 96007502 96100390 96189922
2712.7 96189922 96279585 96379751 96476120 96548826 96605766 96667641 96723759 96750098 96753746 96750140 96732491 96684927
2737.2 96684927 96612078 96544248 96499807 96467340 96432036 96392071 96342665 96271902 96184450 96098769 96018261 95927382
$$ packed form
2574I7300601o0695r1505r4986r1720r4748p3766j7822L4177M3810K2602P319k587
2598.5I6880680l1346o7031p7862o9225o5422n8633k7972J1945L2484M6849Q3644J16217
2623I6774328R3263K2108l9340o2614q0151j20097j57100j53840j20919r6798p9066
2645.4I5979774m0525P802L1525K4456N567j8567o4176j25832j63513j64455j56671
2667.8I5315385j46622j09547m0275L5912R3621J34993J72442J93327J74338J28329
2688.2I5951903R0432N7668Q457m0835n4639m0704l0715j9019J7452O7502R2888Q9532
2712.7I6189922Q9663J00166R6369P2706N6940O1875N6118K6339L648l606j7649m7564
2737.2I6684927p2849o7830m4441l2467l5304l9965m9406p0763q7452q5681q0508r0879
$$ plain form
2761.6 95927382 95818537 95709884 95632178 95607251 95643544 95735407 95854831 95966870 96052182 96108550 96143317
2784.1 96143317 96157491 96144933 96107674 96062255 96027464 96004856 95977426 95930672 95868194 95795530 95720273 95656782
2808.6 95656782 95601028 95546341 95505655 95484221 95474195 95473915 95491570 95528114 95567113 95590377 95588022 95560205
2833 95560205 95512569 95444930 95342594 95203561 95062417 94945621 94839501 94724482 94610864 94516814 94439083
2855.5 94439083 94368136 94283319 94149733 93953365 93702644 93418902 93165225 93031228 93036962 93107057 93163997
2877.9 93163997 93176496 93131644 93010145 92779231 92400044 91837531 91079003 90153253 89169610 88454723
2898.3 88454723 88546497 89658767 91263312 92618287 93448323 93880922 94080532 94111937 93989217 93728948
2918.7 93728948 93349826 92880279 92396051 92007464 91747415 91530377 91277009 90970474 90600479 90202373
$$ packed form
2761.6I5927382j08845j08653p7706k4927L6293R1863J19424J12039Q5312N6368L4767
2784.1I6143317J4174j2558l7259m5419l4791k2608k7430m6754o2478p2664p5257o3491
2808.6I5656782n5754n4687m0686k1434j0026k80J7655L6544L8999K3264k355k7817
2833I5560205m7636o7639j02336j39033j41144j16796j06120j15019j13618r4050p7731
2855.5I4439083p0947q4817j33586j96368k50721k83742k53677j33997N734P0095N6940
2877.9I3163997J2499m4852j21499k30914l79187n62513p58528r25750r83643p14887
2898.3H8454723R1774J112270J604545J354975Q30036M32599J99610L1405j22720k60269
2918.7I3728948l79122m69547m84228l88587k60049k17038k53368l06535l69995l98106
$$ plain form
2939.1 90202373 89962888 90057480 90328938 90414238 90136969 89571863 88901228 88362575 88162631 88281876
2959.5 88281876 88491285 88697201 89065927 89612752 89999074 89916271 89314330 88249737 86789018 85083491
2979.9 85083491 83524913 82733339 83265513 85217154 87956512 90493274 92285925 93425691 94161445
2998.2 94161445 94624162 94887453 95019603 95091820 95162642 95243394 95305181 95318818 95277077 95189953 95073801
3020.7 95073801 94953805 94867855 94835728 94834185 94819069 94755852 94625008 94417399 94137889 93795979 93440485
3043.1 93440485 93246174 93400496 93808573 94148409 94258451 94211888 94102222 93958533 93780690 93572348
3063.5 93572348 93352121 93143672 92992634 92973202 93109590 93331027 93532652 93647933 93682837 93678951
3083.9 93678951 93655264 93618757 93575245 93516904 93444687 93375778 93329668 93311173 93296331 93260562 93204290 93130684
$$ packed form
2939.1I0202373k39485R4592K71458Q5300k77269n65106o70635n38653j99944J19245
2959.5H8281876K09409K05916L68726N46825L86322q2803o01941j064593j460719j705527
2979.9H5083491j558578p91574N32174J951641K739358K536762J792651J139766P35754
2998.2I4161445M62717K63291J32150P2217P0822Q0752O1787J3637m1741q7124j16152
3020.7I5073801j19996q5950l2127j543j5116o3217j30844k07609k79510l41910l55494
3043.1I3440485j94311J54322M08077L39836J10042m6563j09666j43689j77843k08342
3063.5I3572348k20227k08449j51038j9432J36388K21437K01625J15281L4904l886
3083.9I3678951k3687l6507m3512n8341p2217o8909m6110j8495j4842l5769n6272p3606
$$ plain form
3108.4 93130684 93033856 92925376 92825109 92728257 92613733 92465496 92294788 92141336 92030340 91946769
3128.8 91946769 91860330 91757661 91636604 91491634 91313154 91089261 90840501 90638304 90552717 90575945
3149.2 90575945 90615767 90589643 90486228 90337217 90172249 89996040 89798403 89578903 89346278 89102405
3169.6 89102405 88841486 88562113 88276213 87989479 87687600 87355727 86988938 86584359 86135489 85634655
3189.9 85634655 85083151 84482920 83823293 83101535 82330376 81523675 80686504 79825354 78962922 78113014
3210.3 78113014 77261919 76402599 75577426 74869663 74379909 74212581 74436069 75044459 75941348 76963717
3230.7 76963717 77937758 78726602 79280359 79634678 79856378 80029035 80246580 80585355 81082755 81720608
3251.1 81720608 82420093 83076978 83615988 84010428 84259713 84377462 84390122 84322643 84188336 83990347
$$ packed form
3108.4I3130684r6828j08480j00267r6852j14524j48237j70708j53452j10996q3571
3128.8I1946769q6439j02669j21057j44970j78480k23893k48760k02197q5587K3228
3149.2I0575945L9822k6124j03415j49011j64968j76209j97637k19500k32625k43873
3169.6H9102405k60919k79373k85900k86734l01879l31873l66789m04579m48870n00834
3189.9H5634655n51504o00231o59627p21758p71159q06701q37171q61150q62432q49908
3210.3G8113014q51095q59320q25173p07763m89754j67328K23488O08390Q96889J022369
3230.7G6963717R74041P88844N53757L54319K21700J72657K17545L38775M97400O37853
3251.1H1720608O99485O56885N39010L94440K49285J17749J2660o7479j34307j97989
$$ plain form
3271.5 83990347 83740437 83456945 83143330 82798010 82419503 82008016 81569278 81104004 80611974 80084234
3291.9 80084234 79505360 78871942 78185451 77457803 76710284 75945359 75135940 74260753 73347306 72452724
3312.3 72452724 71615207 70835853 70088464 69336331 68548501 67696357 66753364 65734118 64682198
3330.7 64682198 63622332 62579155 61590320 60703844 59999251 59583247 59539688 59889656 60586286 61547178
3351.1 61547178 62754506 64270669 66081405 68019706 69887024 71551311 72960120 74112004
3367.4 74112004 75026256 75738937 76279491 76654458 76869410 76944351 76900500 76744276 76475555 76109856
3387.8 76109856 75660765 75114989 74461740 73715603 72888929 71971279 70933127 69764918 68498898
3406.1 68498898 67164844 65781581 64381552 63016087 61770689 60747665 60026056 59673584 59745950
$$ packed form
3271.5H3990347k49910k83492l13615l45320l78507m11487m38738m65274m92030n27740
3291.9H0084234n78874o33418o86491p27648p47519p64925q09419q75187r13447q94582
3312.3G2452724q37517p79354p47389p52133p87830q52144r42993j019246j051920
3330.7F4682198j059866j043177r88835q86476p04593m16004m3559L49968O96630R60892
3351.1F1547178J207328J516163J810736J938301J867318J664287J408809J151884
3367.4G4112004R14252P12681N40554L74967K14952P4941m3851j56224k68721l65699
3387.8G6109856m49091n45776o53249p46137q26674r17650j038152j168209j266020
3406.1F8498898j334054j383263j400029j365465j245398j023024p21609l52472P2366
$$ plain form
3424.5 59745950 60257304 61168611 62389660 63829982 65400958 66983640 68481809 69872397 71154499
3442.9 71154499 72306859 73304534 74108082 74710852 75164545 75578177 76114303 76841712 77650857 78414530
3463.2 78414530 79102033 79706186 80198073 80576593 80896908 81213611 81544966 81868893 82151264 82410765
3483.6 82410765 82681191 82947707 83194101 83438212 83696735 83965337 84214711 84435797 84653401 84855086
3504 84855086 85024160 85194468 85392439 85609627 85812384 85982776 86150205 86346585 86568427 86768818
3524.4 86768818 86933678 87110460 87305272 87495053 87695158 87902927 88090444 88284379 88509464 88725179
3544.8 88725179 88888627 89024919 89178902 89350700 89529872 89726424 89943588 90163732 90370417 90575957
3565.2 90575957 90805966 91036367 91241539 91449970 91681278 91925418 92188811 92472088 92747653 93005168
$$ packed form
3424.5E9745950N11354R11307J221049J440322J570976J582682J498169J390588J282102
3442.9G1154499J152360R97675Q03548O02770M53693M13632N36126P27409Q09145P63673
3463.2G8414530O87503O04153M91887L78520L20315L16703L31355L23927K82371K59501
3483.6H2410765K70426K66516K46394K44111K58523K68602K49374K21086K17604K01685
3504H4855086J69074J70308J97971K17188K02757J70392J67429J96380K21842K00391
3524.4H6768818J64860J76782J94812J89781K00105K07769J87517J93935K25085K15715
3544.8H8725179J63448J36292J53983J71798J79172J96552K17164K20144K06685K05540
3565.2I0575957K30009K30401K05172K08431K31308K44140K63393K83277K75565K57515
$$ plain form
3585.6 93005168 93254888 93501025 93738693 93974245 94225383 94499356 94769979 95014763 95247746 95482397
3606 95482397 95721889 95961952 96199924 96434796 96646720 96849293 97058940 97239500 97390741 97534990
3626.4 97534990 97702771 97888702 98036867 98161489 98279941 98397177 98520792 98640424 98753399 98883313
3646.8 98883313 99040806 99149573 99175960 99205291 99293333 99380308 99409837 99416846 99444932 99478984 99497378
3669.2 99497378 99516052 99533194 99533170 99507588 99474615 99468940 99506617 99585855 99695146 99769217 99770039 99765444 99780369
3695.8 99780369 99807847 99848545 99882853 99893576 99902940 99930054 99953902 99953556 99946165 99944693 99940568 99924594 99904138
3722.3 99904138 99890524 99890131 99899411 99914050 99944043 99981129 100000000 100003660 99977416 99919981 99897563 99935848
3746.7 99935848 99955404 99948502 99944180 99942094 99940842 99943852 99944651 99939507 99946469 99962527 99962169 99946052 99934787 99945062
$$ packed form
3585.6I3005168K49720K46137K37668K35552K51138K73973K70623K44784K32983K34651
3606I5482397K39492K40063K37972K34872K11924K02573K09647J80560J51241J44249
3626.4I7534990J67781J85931J48165J24622J18452J17236J23615J19632J12975J29914
3646.8I8883313J57493J08767K6387K9331Q8042Q6975K9529P009K8086L4052J8394
3669.2I9497378J8674J7142k4k5582l2973n675L7677P9238J09291P4071Q22m595J4925
3695.8I9780369K7478M0698L4308J0723R364K7114K3848l46p391j472m125j5974k0456
3722.3I9904138j3614l93R280J4639K9993L7086J8871L660k6244n7435k2418L8285
3746.7I9935848J9556o902m322k086j252L010P99n144O962J6058l58j6117j1265J0275
$$ plain form
3775.3 99945062 99976385 100000000 99987262 99961460 99950165 99944425 99937207 99934334 99935400 99940914 99944997 99934989 99932873
3801.8 99932873 99939305 99924570 99905133 99902749 99913192 99929082 99954784 99971771 99953568 99920762 99897420 99894089
3826.3 99894089 99906915 99916178 99936432 99978912 100000000 99976104 99942631 99921805 99915272 99918020 99918646 99900556 99865150
3852.8 99865150 99864703 99880105 99879766 99880755 99888384 99895430 99887526 99873096 99882132 99895620 99896443 99891156 99889231 99903947
3881.4 99903947 99918854 99923134 99917471 99899220 99884069 99885452 99894035 99897945 99890983 99877906 99876916 99886686 99884385 99872333
3909.9 99872333 99866700 99866539 99871212 99885678 99903870 99915254 99919754 99926734 99937654 99950719 99968469 99981034 99981135
3936.4 99981135 99983650 99992085 99997175 100000000 100005078 100015795 100026226 100029409 100027776 100026679 100029027 100033224 100041068 100054097
3965 100054097 100066257 100073290 100079596 100090051 100100672 100106120 100107968 100111377 100118101 100117338 100105488 100098050 100101542 100108910
$$ packed form
3775.3I9945062L1323K3615j2738k5802j1295n740p218k873J066N514M083j0008k116
3801.8I9932873O432j4735j9437k384J0443J5890K5702J6987j8203l2806k3342l331
3826.3I9894089J2826R263K0254M2480K1088k3896l3473k0826o533K748O26j8090l5406
3852.8I9865150m47J5402l39R89P629P046p904j4430R036J3488Q23n287j925J4716
3881.4I9903947J4907M280n663j8251j5151J383Q583L910o962j3077r90R770k301j2052
3909.9I9872333n633j61M673J4466J8192J1384M500O980J0920J3065J7750J2565J01
3936.4I9981135K515Q435N090K825N078J0717J0431L183j633j097K348M197P844J3029
3965A00054097J2160P033O306J0455J0621N448J848L409O724p63j1850p438L492P368
$$ plain form
3993.5 100108910 100117695 100125813
3997.6 100125813
$$ packed form
3993.5A00108910Q785Q118
3997.6A00125813
##END=$$ End of the data block
