##TITLE=$$ Begin of the data block
##JCAMP-DX=5.00 $$ ACD/SpecManager v 10.08
##SPECTROMETER/DATA SYSTEM=Varian
##DATE=15 Jan 2013 15:51:32
##DATA TYPE=INFRARED SPECTRUM
##DATA CLASS=XYDATA
##ORIGIN=
##OWNER=
##NPOINTS=3735
##FIRSTX=399.26403809
##LASTX=4000.35498047
##MAXX=4000.35498047
##MINX=399.26403809
##MAXY=76.31568909
##MINY=41.06795883
##XFACTOR=1.0000000000
##YFACTOR=0.000000100000000
##FIRSTY=61.88669968
##DELTAX=0.96440572
##XUNITS=1/CM
##YUNITS=TRANSMITTANCE
##XYDATA=(X++(Y..Y))
399.3F18866997Q338775N946007J375885o155662l225212q98972Q25844P327957J2861977
407.9F45263596Q551483o154404l097153n587158n946960m065628l897705P591972
415.7F32658043M302711o361847k2108268k724610J2368203M325180K566986n046273
423.4F19980125k760009k093506R705086Q363800n086823j789322J0643j98517o517677
432.1F19613800m792213o14777o84433J0123329Q225517m00047j501884o03752k294808
440.7F27070732p664604n473290J397896Q032074M401665J921997J730385p52525k888947
449.4F27775383o373291j016350L032494j764412k372170L987122K746162n474014
457.1F20540924p034607K0790J97182n445633j137314O622048N863494J526185m494477
$$ plain form
399.3 618866997 627205772 633151779 634527664 628372002 625146790 624247818 625073662 632401619 645263596
407.9 645263596 653815079 647660675 644563522 638976364 633029404 628963776 625066071 632658043
415.7 632658043 636960754 630598907 608490639 605766029 618134232 622459412 625026398 619980125
423.4 619980125 617220116 615126610 624831696 633195496 628108673 626319351 626329994 626131477 619613800
432.1 619613800 614821587 614206810 613522377 623645706 631871223 631471176 629969292 629365540 627070732
440.7 627070732 619406128 613932838 615330734 623362808 627764473 629686470 631416855 630664330 627775383
449.4 627775383 621402092 620385742 623418236 621653824 619281654 623268776 626014938 620540924
457.1 620540924 613506317 613527107 613724289 608278656 607141342 613763390 619626884 621153069 616658592
465.8F16658592J237641J125145o237755o675377j589775K178879j563721J448479
473.5F06582108m99268J902962O417198L79143k309571l750572m68483R81827P13081
482.2F09948425J415825l078613m530220L3073N896683j836395o664925L437996O223373
490.9F10845222n22422k845764L659286K327347m476357n982818k381707J360817N24216
499.6F02507820R85756J770973L769226P31392k450866o1684l099823n267983P08237
508.2E99593048K267380J703796J418991Q20160j177292l818855l138008L27530J065445
516.9E99062195q72841q11462J586265K839241R81827m47426k964897m432983l459359
525.6E91480560j989975J530419K567329K345886L251305P73621k405663k393799k778625
$$ plain form
465.8 616658592 617896233 619021378 612783623 606108246 604518471 606697350 605133629 606582108
473.5 606582108 606082840 607985802 614403000 614782143 612472572 608722000 608253517 609235344 609948425
482.2 609948425 611364250 608285637 603755417 603788490 609685173 607848778 601183853 604621849 610845222
490.9 610845222 610322800 607477036 611136322 613463669 608987312 603004494 600622787 601983604 602507820
499.6 602507820 603493576 605264549 609033775 609765167 607314301 607252617 604152794 598884811 599593048
508.2 599593048 601860428 603564224 604983215 605803375 604626083 600807228 597669220 597996750 599062195
516.9 599062195 598189354 597377892 598964157 601803398 602785225 602337799 599372902 594939919 591480560
525.6 591480560 589490585 591021004 593588333 595934219 599185524 599959145 597553482 595159683 592381058
534.3E92381058l650551l758583m68598L046074M378701M686050J855125j237945k570343
543E94660988l604660l003769o21185J854515K708549L855934L932839O02188j625443
551.6E98759956j464004j369057k638893k771683j231575J404076L031349J164093
559.4E94884262J555786K257767p25784l270989j650123R80491o87828j178627K152367
568E94317322L279800K982102L39965k910118k374725j554031j069718q88176N57518
576.7E92679939L154221J827621J70327k37008j296653k504654k648163q95233l06206
585.4E89944191J641426J406517L9978J065521j444168j406593r17282k723770q66967
594.1E86738853n35583j258125j88485J242676J932144O19812j205062j154938j524086
$$ plain form
534.3 592381058 588730507 584971924 584503326 587549400 591928101 596614151 598469276 597231331 594660988
543 594660988 591056328 588052559 587431374 589285889 591994438 595850372 599783211 600385399 598759956
551.6 598759956 597295952 595926895 593288002 590516319 589284744 590688820 593720169 594884262
559.4 594884262 596440048 598697815 597972031 594701042 593050919 594031410 593343582 592164955 594317322
568 594317322 597597122 600579224 600919189 598009071 595634346 594080315 593010597 592122421 592679939
576.7 592679939 595834160 597661781 597832108 597595100 596298447 593793793 591145630 590250397 589944191
585.4 589944191 591585617 592992134 593032112 594097633 592653465 591246872 590329590 587605820 586738853
594.1 586738853 586203270 584945145 584756660 585999336 587931480 588551292 587346230 586191292 584667206
602.8E84667206k980042j896591P65381J630859J496697K837791K544251k88811q47588
611.4E87929153j069793m57497L56636n23338m07334m10575N9585J050644J681366
620.1E88208847J517105o12030j329536P0495O64330K12364J2932J27296M96445P03773
629.8E90072021O24428J20011k05689J46980O77758J303482Q7852n02205k04048k07138
639.4E91913452R2735o57806J88637L31497O99158K280655Q41827l34854j628685j510239
649E92216377J072235K492295J411590L6278J398354R37538k20185o70509j036758
657.7E97637215o92482r70002m21867j99432L58505J575623N87081n25245l92304n790443
667.4E91166649j7319183R295997O386833L123818J500702j79024O14319P94983P65724
$$ plain form
602.8 584667206 581687164 579790573 580555954 582186813 583683510 586521301 589065552 588776741 587929153
611.4 587929153 586859360 586401863 586758499 586235161 585827827 585417252 585476837 586527481 588208847
620.1 588208847 589725952 589113922 587784386 587854881 588519211 588731575 588744507 588871803 589368248 590072021
629.8 590072021 590696449 590816460 590610771 590757751 591435509 592738991 592826843 592324638 592120590 591913452
639.4 591913452 592006187 591348381 591537018 591868515 592567673 594848328 595690155 595355301 593726616 592216377
649 592216377 593288612 595780907 597192497 597228775 598627129 599564667 599344482 598673973 597637215
657.7 597637215 596944733 595974731 595552864 595353432 595711937 597287560 597874641 597349396 596957092 591166649
667.4 591166649 573847466 583143463 589530296 592654114 594154816 593975792 594590111 595385094 596150818
676.1E96150818J46942j205750j259384o45103K85110J422387K518234J920967J919060
684.7F01253281K049713N58471k83660o32134l73039J43852R88998K260437K461472
693.4F08427391J591301K138214K042275r16977j080208k73209m42581J545219K379265
702.1F15410690K252426K601395K075539J272926k36092j203041o12526M2267J070977
710.8F22674561R06524J542549K988549J758842J436997J047020m81377j598587j389694
719.5F28885384M17213J445961K376976K060509J686897K302208J376076k3728r42764
728.1F39584732p84340J21536J107140J111298J799621K000580J338654R54208r09958
736.8F46323471m85153m62341m18473J217041J143112J167069R65805J463623N30624
$$ plain form
676.1 596150818 596297760 595092010 593832626 593187523 593472633 594895020 597413254 599334221 601253281
684.7 601253281 603302994 603861465 603577805 602945671 602572632 602716484 603705482 605965919 608427391
693.4 608427391 610018692 612156906 614199181 613282204 612201996 611928787 611486206 613031425 615410690
702.1 615410690 617663116 620264511 622340050 623612976 623376884 622173843 621561317 621603584 622674561
710.8 622674561 623581085 625123634 628112183 629871025 631308022 632355042 631873665 630275078 628885384
719.5 628885384 629302597 630748558 633125534 635186043 636872940 639175148 640551224 640527496 639584732
728.1 639584732 638800392 638921928 640029068 641140366 642939987 644940567 646279221 647233429 646323471
736.8 646323471 645838318 645375977 644957504 646174545 647317657 648484726 649450531 650914154 651444778
745.5F51444778l79104m68903j138458n74799j157302n2414J089859N40924j47782
754.2F49156799r30175m41132j047363j515580j173172q12530r32846n72434J86386
762.8F41917953j23062j02768p53173m36478j58310q59489m41285J4115J081810J680984
772.5F41820297L67203Q545J649399N33218m13360J172943J474762J403732N99518
781.2F48616257J194839J236954P07474P20520J39312Q83942O9046J101151J579437
789.9F56248932L94897J64109q37632k6474p96814j465683j549606l38516M40903j820069
799.5F50414047o18057k57950r97314j584168k519989j546097r00802m44946j21079
808.2F41423645J854324K124405K94495J066284J963501K278214K581405L115769L278122
$$ plain form
745.5 651444778 651065674 650596771 649458313 648883514 647726212 647673798 648763657 649304581 649156799
754.2 649156799 648226624 647785492 646738129 645222549 644049377 643236847 642304001 641731567 641917953
762.8 641917953 641794891 641692123 640938950 640502472 640344162 639484673 639043388 639057503 640139313 641820297
772.5 641820297 642187500 642196045 643845444 644378662 643965302 645138245 646613007 648016739 648616257
781.2 648616257 649811096 651048050 651755524 652476044 652615356 653499298 653568344 654669495 656248932
789.9 656248932 656643829 656807938 655970306 655943832 655147018 653681335 652131729 651793213 652234116 650414047
799.5 650414047 649795990 649538040 648540726 646956558 644436569 642890472 641989670 641544724 641423645
808.2 641423645 643277969 645402374 645696869 646763153 648726654 651004868 653586273 656702042 659980164
816.9F59980164L584518L933182M342270L836822K209625J556549Q86765J346893m0741
825.5F81636047n13763Q98971P47529O76422K02713J20468j470184j502533j04981
834.2F80690689J021195K259140J431579K536545K919083K167511K460479K049332
841.9F97535553M60892p56760k68707l97492L05710O81229J881332J849060p9040n29404
851.6G00682373j194916p94143j388627k59170N27878j013794o29120J11771l97873
860.3F95644379j801682j117248k546158l076782k686387l818893k015381j457138
868F77124710n39932j192856j891251j465606k663422j819763k047272j416321q23898
876.7F63264389m05121P16782J94015K46888n32990k94952o93436j396332p68280m75464
$$ plain form
816.9 659980164 663564682 667497864 671840134 675676956 677886581 679443130 680329895 681676788 681636047
825.5 681636047 681122284 682021255 682768784 683445206 683647919 683768387 682298203 680795670 680690689
834.2 680690689 681711884 683971024 685402603 687939148 690858231 693025742 695486221 697535553
841.9 697535553 697996445 697239685 696970978 696573486 696879196 697560425 699441757 701290817 701211777 700682373
851.6 700682373 699487457 698693314 697304687 697045517 697573395 696559601 695930481 696042252 695644379
860.3 695644379 693842697 692725449 690179291 687102509 684416122 680597229 678581848 677124710
868 677124710 676584778 675391922 673500671 672035065 669371643 667551880 665504608 664088287 663264389
876.7 663264389 662859268 663576050 663770065 664016953 663483963 663189011 662495575 661099243 660330963 659855499
886.3F59855499M22821K48108l90396j047897m62418k63290n97229J12152m46930r70459
895.9F56459961n30014P72781L08609l58658J39847N0812M31595o2790r079L07999
905.6F57511063Q41064Q80890j08566K06299j07575m19235O01883K151260K077026
914.3F63634109J685334J768799J473999J714325O04553N74264L97797K1591O01502
922.9F72476273K59628P45315N58167j0147j28708l58429j545944j630936o30951j136703
932.6F68597565j134568q77761n50919j071777j181565j584472k234421j706543k780685
941.3F55474854k494736j745300j411973j959304k688599k143784k997894k650757
949F37382507l185844l933716l177566k376862j718102j994628o89965j261749k112389
$$ plain form
886.3 659855499 660278320 660526428 660136032 659088135 658625717 658362427 657765198 657877350 657430420 656459961
895.9 656459961 655929947 656702728 657011337 656652679 656792526 656843338 657274933 657212143 657203064 657511063
905.6 657511063 658352127 659233017 659124451 659330750 659223175 658803940 659405823 661557083 663634109
914.3 663634109 665319443 667088242 668562241 670276566 670881119 671455383 671853180 671874771 672476273
922.9 672476273 672735901 673481216 674039383 674029236 673900528 673542099 671996155 670365219 669734268 668597565
932.6 668597565 667462997 666585236 666034317 664962540 663780975 662196503 659962082 658255539 655474854
941.3 655474854 652980118 651234818 649822845 647863541 645174942 643031158 640033264 637382507
949 637382507 634196663 630262947 627085381 624708519 622990417 620995789 620305824 619044075 616931686
957.7F16931686j471328k279587j419869q22258q24852l05099O36902J476135J566277
966.3F13488007J624527l81012q19741j13640n90057o1149L83033P10526R64050N72701
976F15777245q30956j662865j728286k353669l217125l099365k100754k346382k446785
984.7E95991058j938476k068825k909279l869400l622932l321572k914810k549286
992.4E72796478k354278j543160j557464j933594l045426l739700l221359l539963
1000.1E51861534l698768l345757k619553k089538j563225j818466k321129k023163
1007.8E32381935l451614l400612k539177k157707k068177k208747k60926m45518r03626
1016.5E14945831j144523j564637j753158k261276q15163j266327j390495o57349j89018
$$ plain form
957.7 616931686 615460358 613180771 611760902 610938644 610113792 609808693 610445595 611921730 613488007
966.3 613488007 615112534 614731522 613911781 613798141 613208084 613146935 613529968 614240494 615204544 615777245
976 615777245 614946289 613283424 611555138 609201469 605984344 602884979 600784225 598437843 595991058
984.7 595991058 594052582 591983757 589074478 585205078 581582146 578260574 575345764 572796478
992.4 572796478 570442200 568899040 567341576 565407982 562362556 558622856 555401497 551861534
1000.1 551861534 548162766 544817009 542197456 540107918 538544693 536726227 534405098 532381935
1007.8 532381935 528930321 525529709 522990532 520832825 518764648 516555901 516294975 515849457 514945831
1016.5 514945831 513801308 512236671 510483513 508222237 507407074 506140747 504750252 504092903 503903885
1025.2E03903885J3122m20074K09541j007805j708030j342964m11644l26386k55127
1033.8D98654518J115074K90375q3199l75061N99366P35397k11563K48604J17149M61350
1043.5E01552010k67983J21880j80893k47574K89955p47566l75252r79767j60141k18124
1053.1D98786545Q3542J440162J34621m31175r28841j87683m32701l22456o9809M4975
1062.8D98117180J003418m86489N57023J107025J46980r52606q98628N9318j298141
1071.5D97355080j49956P53250J187744J102753M30641J53999j73492P18651j90048
1080.1E01188622Q9225K60849O40526J269074K32315N30014o1684n93491j019859r73434
1089.8E01562157j012993m50745O11763l67546q46138j823196j454430j310463j100731
$$ plain form
1025.2 503903885 503917007 503496933 503706474 502698669 500990639 499647675 499236031 498909645 498654518
1033.8 498654518 499769592 500059967 499976768 499601707 500201073 500936470 500724907 500973511 501090660 501552010
1043.5 501552010 501284027 501405907 501225014 500977440 501267395 500519829 500144577 499164810 499004669 498786545
1053.1 498786545 498870087 500310249 500444870 500013695 499084854 498897171 498464470 498142014 498072205 498117180
1062.8 498117180 499120598 498634109 499191132 500298157 500445137 499492531 498593903 498653221 497355080
1071.5 497355080 497205124 497958374 499146118 500248871 500679512 500833511 500660019 501378670 501188622
1080.1 501188622 501277847 501538696 502179222 503448296 503680611 504210625 504148941 503555450 502535591 501562157
1089.8 501562157 500549164 500098419 500710182 500342636 499496498 497673302 496218872 494908409 493807678
1098.5D93807678m50897q70895P73086J363678K274819K218246J298599J352921J532936
1107.1E03300171J452141J337433K459449J177864J319428K383613K352219J788330
1114.9E17570648M22402J357116J633759K181625K200623K317657K609406J819153
1122.6E32112389K223358J429825J402893J173744J584167K333260Q48885J002655
1130.3E44111176J745986K067032J531411O24542J00288J2322J87301K06528P35207
1139E51321793L57132P42187Q31146J50185k36969j170158o37932n91622n73539L06968
1148.6E50499191N37567P93839N28374M30832Q34884M86260n75562n43518k09770O14738
1158.3E53396835J895523J348687R21096J605149J485328N01366Q32100J015816J015854
$$ plain form
1098.5 493807678 493356781 492485886 493258972 494622650 496897469 499115715 500414314 501767235 503300171
1107.1 503300171 504752312 506089745 508549194 509727058 511046486 513430099 515782318 517570648
1114.9 517570648 517993050 519350166 520983925 523165550 525366173 527683830 530293236 532112389
1122.6 532112389 534335747 535765572 537168465 538342209 539926376 542259636 543108521 544111176
1130.3 544111176 545857162 547924194 549455605 550080147 550180435 550192757 550380058 550586586 551321793
1139 551321793 551678925 552421112 553252258 553402443 553165474 551995316 551357384 550765762 550192223 550499191
1148.6 550499191 551036758 551830597 552358971 552789803 553624687 554110947 553535385 552991867 552782097 553396835
1158.3 553396835 555292358 556641045 557562141 559167290 560652618 561153984 561986084 563001900 564017754
1166.9E64017754J777000J995735K553063K856826L072281K851830K776680K020225
1174.6E83921394J127854J936912J931877K537384L159523K380410K230720K708626
1182.4F01934700K013779J286316J649780J764374K005729J646386K005920K570000
1190.1F16876984J992683J193466O52809O91986J57929J63231j62163n89371l83262
1198.8F20594292q16841j122551j004448r58672j702309k176971k282448k780838k900314
1207.4F04848900k410660j973648j917191k353859k709274k957573l499984l334504
1215.1E83692207k738876k665977k886887k763634k769699k189598j515160j972541
1222.9E64189835k469292k517471j966019j750527j341438j376266j889153j672439
$$ plain form
1166.9 564017754 565794754 567790489 570343552 573200378 576272659 579124489 581901169 583921394
1174.6 583921394 585049248 586986160 588918037 591455421 594614944 596995354 599226074 601934700
1182.4 601934700 603948479 605234795 606884575 608648949 610654678 612301064 614306984 616876984
1190.1 616876984 618869667 620063133 620715942 621407928 621565857 621729088 621566925 620977554 620594292
1198.8 620594292 619777451 618654900 617650452 616691780 614989471 612812500 610530052 607749214 604848900
1207.4 604848900 602438240 600464592 598547401 596193542 593484268 590526695 587026711 583692207
1215.1 583692207 580953331 578287354 575400467 572636833 569867134 567677536 566162376 564189835
1222.9 564189835 561720543 559203072 557237053 555486526 554145088 552768822 550879669 549207230
1230.6E49207230j439209j349907j730461j164742o52237n62515o85425r31854m88167
1239.3E40202713q10394q49381p54013l41530n8708K35481M40102k48680J53465J79825
1248.9E38148880L395m88815k18125O33469M13666J049347J066894O45104K87895O58798
1258.5E42200508L61519n7755J024476N89790N07278Q28781J630326J878471J172295
1267.2E50135689J293449R62181Q45413Q12417J278915J065826J265564K308884J965828
1275.9E61934166J958733J846504J529541J039238P13501R86747J489106J853637J765099
1284.6E75116272K058449K042122J717796J225357J147537N76630j80969K56996O78062
1293.3E84638252J117287J354561J151848M87861L8834j90506o17943q20465p84950
$$ plain form
1230.6 549207230 547768021 546418114 544687653 543522911 542870674 542308159 541622734 540690880 540202713
1239.3 540202713 539392319 538542938 537788925 537447395 537388687 537624168 538064270 537815590 537969055 538148880
1248.9 538148880 538152275 537663460 537445335 538078804 538492470 539541817 540608711 541253815 541541710 542200508
1258.5 542200508 542562027 542504272 543528748 544118538 544625816 545454597 547084923 548963394 550135689
1267.2 550135689 551429138 552391319 553236732 554049149 555328064 556393890 557659454 559968338 561934166
1275.9 561934166 563892899 565739403 567268944 568308182 569021683 570008430 571497536 573351173 575116272
1284.6 575116272 577174721 579216843 580934639 582159996 583307533 583884163 583703194 583960190 584638252
1293.3 584638252 585755539 587110100 588261948 588749809 588788643 588598137 587980194 587159729 586374779
1301.9E86374779j23024L85170L93066J44577O4202k98462j382447j689377j991081
1310.6E81877403j957626j524201j386642n38368m35181j385002j674538j022491j035233
1319.3E70918121l02696J676788K057610K130280K198410K608604K314415J113625
1327E84715157Q32481r9182r56230r01032m13971M82941J295318K141114K315292K081604
1336.7E91493492J502419J066932P98989J173858J341057J130638J331063J766548
1344.4F01604996J521644J139908R61075j54991q76770j222611q28895j143608j277390
1353.1E99723358o65016j195602j159554j541939k307205l079452l342324l984222
1360.8E82448044l935661l188019l600731j737786j614265k289200k205620l134842
$$ plain form
1301.9 586374779 586251755 586636925 587029991 587174568 587238770 586940308 585557861 583868484 581877403
1310.6 581877403 579919777 578395576 577008934 576470566 576035385 574650383 572975845 571953354 570918121
1319.3 570918121 570615425 572292213 574349823 576480103 578678513 581287117 583601532 584715157
1327 584715157 585547638 585448456 584492226 583591194 583177223 583660164 584955482 587096596 589411888 591493492
1336.7 591493492 592995911 594062843 594861832 596035690 597376747 598507385 599838448 601604996
1344.4 601604996 603126640 604266548 605227623 605072632 604195862 602973251 602144356 601000748 599723358
1353.1 599723358 599058342 597862740 596703186 595161247 592854042 589774590 586432266 582448044
1360.8 582448044 578512383 575324364 571723633 569985847 568371582 566082382 563876762 560741920
1368.5E60741920k988662j662407j578217r51042l92876l74832m5356L12843N38864
1377.2E53600235J42441Q4572l5401J58959N73654K11601L94020J001587J172447P82776
1386.8E58086891M43421J395797J911011J277084J362725J463699R17511k34566l08532
1395.5E66315041J211471k24838k62985o81191p4386R74083j92605J34316k79350j678543
1405.1E65241013r93042k34833p78275j196747k33497l30925j97640J58768P0343o99882
1414.8E60805283j063958p78961j130981j31607l587113o9656J561203M6196l5515
1423.4E55614891j162796O8779o01082j303634n43938j207237r63059k21290J140174
1432.1E50820808j08261j42135P42645p20367l373948r18808K108460N58891Q72421
$$ plain form
1368.5 560741920 557753258 556090851 554512634 553561592 553168716 552793884 552748528 553061371 553600235
1377.2 553600235 553742676 553827248 553791847 553950806 554524460 554736061 555130081 556131668 557304115 558086891
1386.8 558086891 558530312 559926109 561837120 563114204 564476929 565940628 566858139 566623573 566315041
1395.5 566315041 567526512 567301674 567038689 566357498 566283112 567257195 567064590 567198906 566919556 565241013
1405.1 565241013 564247971 564013138 563234863 562038116 561804619 561473694 561276054 561434822 561505165 560805283
1414.8 560805283 559741325 558962364 557831383 557699776 554112663 554043007 555604210 555650406 555614891
1423.4 555614891 554452095 554520874 553919792 552616158 552072220 550864983 549901924 549680634 550820808
1432.1 550820808 550712547 550570412 551313057 550592690 547218742 546299934 548408394 548967285 549839706
1440.8E49839706J359024R10950K027817L93562Q00057M77562M79202P94525J735611
1449.5E58818016K518349J281624K627983J378517J837005J186448j60752p81059l287468
1458.2E65418663M810753K337685M010047K926865K135964L131332m03977L095437
1465.9E87462769K614936L789635L652001L518142M713936K815476L605537L453484
1473.6F15625916N964698L564644J334953L373337L513680L528557K601852L117561
1481.3F42625198K805939L215408K701722J234359J470414o0807J257324K303849Q58078
1490F58411484J256256J948776K193909P88727M18930q27103l993835K050399k4490
1498.7F62223053m30374K260284J093216k4109n25284J89896j056442q389588n187759
$$ plain form
1440.8 549839706 551198730 552109680 554137497 554531059 555331116 555808678 556287880 557082405 558818016
1449.5 558818016 561336365 562617989 565245972 566624489 568461494 569647942 569487190 568706131 565418663
1458.2 565418663 570229416 572567101 576577148 579504013 581639977 584771309 584367332 587462769
1465.9 587462769 590077705 593867340 597519341 601037483 605751419 608566895 612172432 615625916
1473.6 615625916 621590614 625155258 626490211 629863548 633377228 636905785 639507637 642625198
1481.3 642625198 645431137 648646545 651348267 652582626 654053040 653992233 655249557 657553406 658411484
1490 658411484 659667740 661616516 663810425 664599152 665018082 664190979 660197144 662247543 662223053
1498.7 662223053 661792679 664052963 665146179 665122070 664596786 664786682 663730240 655340652 650152893
1507.3F50152893K621231K164688K90375J509476r59320j961213m57687j908035j403809
1516F50048599l032150l357315R65652J558915l151780m086380O22101N14221L38211
1524.7F40420074m521255j005249j389504j927757L15323k92053r30710k249527k441673
1533.4F25977669o624298L07121q08411j987076K39792p777748n098572k764282j445808
1542.1F00018387k940102p30667l318596o958504M3221k714882j483002m367485o204605
1550.7E71343765j620903l188591j747055p990608k551651n29213j834145q045005
1558.5E43836594j4131966R379044M58450K230682k85797n29861j612206m46434J562996
1567.1E40461502k79121J040878m295311J189194R25560q25997j81045j007462M30489
$$ plain form
1507.3 650152893 652774124 654938812 655229187 656738663 655779343 653818130 653360443 651452408 650048599
1516 650048599 647016449 643659134 644624786 646183701 643031921 638945541 639567642 640081863 640420074
1524.7 640420074 635898819 634893570 633504066 631576309 631891632 631599579 630668869 628419342 625977669
1533.4 625977669 619353371 619660492 618852081 616865005 617104797 609327049 604228477 601464195 600018387
1542.1 600018387 597078285 596347618 593029022 586070518 586113739 583398857 581915855 577548370 571343765
1550.7 571343765 569722862 566534271 564787216 556796608 554244957 553715744 551881599 543836594
1558.5 543836594 529704628 539083672 539542122 541772804 541487007 540957146 539344940 538898506 540461502
1567.1 540461502 540182381 541223259 536927948 538117142 539042702 538216705 538035660 537028198 537458687
1575.8E37458687o419716K126121J505738k05536l54767j650314o20308j689720k06490
1584.5E29943695q34770m26827j18332j120872L9787j222801j28174j121216n97267
1593.2E24413223j044731j563835J87798q37098N17273n02128m4098q71353q97675
1601.9E19357376K32849j146431L47023l78380L01362n09186J67160L30429r50203
1610.5E17751999Q72078p47757j67732n37911J056366J465225m855957J878090R00345
1619.2E17614746R10950l19863L59650m82483k081260J898040P80373J925583l0327
1627.9E20575409l33748P23114L77770P73086l11432J043816P65190k164269J722641
1636.6E23171577L081475J742439J406479J641006P18880J646118Q46977K102433K809143
$$ plain form
1575.8 537458687 531038971 533165092 534670830 534465294 534110527 532460213 531839905 530150185 529943695
1584.5 529943695 529108925 528682098 528563766 527442894 527482681 526259880 526131706 525010490 524413223
1593.2 524413223 523368492 521804657 521992455 521155357 521672630 521170502 521126404 520255051 519357376
1601.9 519357376 519590225 518443794 518790817 518412437 518713799 518204613 518371773 518702202 517751999
1610.5 517751999 518624077 517876320 517708588 517170677 518227043 519692268 514836311 516714401 517614746
1619.2 517614746 518525696 518205833 518565483 518083000 516001740 517899780 518680153 520605736 520575409
1627.9 520575409 520241661 520964775 521342545 522115631 521804199 522848015 523613205 521448936 523171577
1636.6 523171577 526253052 527995491 529401970 531042976 531761856 533407974 534254951 536357384 539166527
1645.3E39166527p4158p1754K78511L551635K684746K468720K726211k277756m773101
1653.9E43679581M977417N315704L228073K163658K025605J676673J419106J716156
1661.6E66201973J339226P76558K906608K894898K279243K580910K264786P9574J365700
1670.3E82689476K036591J549720K939530L758812K157478L07236L270912L117638
1678F01827393K316627J021156O47126K735862L254586K44751n151215N522614M758758
1686.7F17177658K982369K77786J060562L38821M65470J148643k6245J666069K87056
1695.4F25378189m408226J426659K425842L754082k518540q812179K365875J468010
1703.1F21079712j366043k562599j620827l974800j922417j305313l035965m871445
$$ plain form
1645.3 539166527 539092369 539020615 539299126 542850761 545535507 548004227 550730438 548452682 543679581
1653.9 543679581 548656998 553972702 557200775 559364433 561390038 563066711 564485817 566201973
1661.6 566201973 567541199 568317757 571224365 574119263 576398506 578979416 581244202 581323776 582689476
1670.3 582689476 584726067 586275787 589215317 592974129 595131607 595438843 598709755 601827393
1678 601827393 604144020 605165176 605812302 608548164 611802750 612047501 606896286 612418900 617177658
1686.7 617177658 620160027 620437813 621498375 621837196 622302666 623451309 623425064 625091133 625378189
1695.4 625378189 620969963 622396622 624822464 628576546 626058006 617245827 619611702 621079712
1703.1 621079712 619713669 617151070 615530243 611555443 609633026 608327713 605291748 600420303
1710.8F00420303l155365k485962k565612m400177n596848o38618k690888r467621
1718.5E69419212j057052p11518k123756k504387k932434k933693j573296j153526
1726.3E54429550j697769k096786j339150l323173k466736M32777J66588m866181o103172
1734.9E33135948L399544J327705K59629L79638j715011k252617J531105J372795r21822
1743.6E36516914R42002J667137J851349L50570J95160J359940K420730K572403N14336
1752.3E48390541M974213L868561L887443M565086K789307N325928M902305O442032
1760E85145416N700836N434838O842346O918678P500534O476899P218551O221733N970497
1768.7F43430328N941849O085281N588303L816910M645538N636826N876694K720184
$$ plain form
1710.8 600420303 597264938 594778976 592213364 587813187 582216339 581577721 578886833 569419212
1718.5 569419212 568362160 567650642 565526886 563022499 560090065 557156372 555583076 554429550
1726.3 554429550 552731781 550634995 549295845 545972672 543505936 543938713 544105301 539239120 533135948
1734.9 533135948 536535492 537863197 538122826 538502464 536787453 534534836 536065941 537438736 536516914
1743.6 536516914 537458916 539126053 540977402 541327972 541523132 542883072 545303802 547876205 548390541
1752.3 548390541 553364754 557233315 561120758 565685844 568475151 573801079 578703384 585145416
1760 585145416 590846252 596281090 603123436 610042114 617542648 624019547 631238098 637459831 643430328
1768.7 643430328 649372177 655457458 661045761 664862671 669508209 675145035 681021729 683741913
1776.4F83741913L945541L425064K782669K607956J227188L768158K976990K456131
1784.1G06931610J007691J340560K486420J117325J649933J646576R89456J216965
1791.8G18386536p57523P08618L867340J463623j115188J352157J861267N81208n03617
1800.5G25844421K084275P41348K64740K102432O89621Q50754K50397r8343J233749
1809.2G33963394O47583p61032J000748J865692P80792J129456J74026p9422m76456
1817.9G38244781P0344J192932M07333J297455L56979J090164J472855k315369M88587
1826.5G42306061J763992J176148p16935k929763J954422K736358J287842N03540o0730
1835.2G48020935K8000k71835p06101J051865P92236M35333P41196J509781L61633
$$ plain form
1776.4 683741913 687687454 691112518 693895187 696503143 697730331 701498489 704475479 706931610
1784.1 706931610 707939301 709279861 711766281 712883606 714533539 716180115 717169571 718386536
1791.8 718386536 717629013 718337631 722204971 723668594 722553406 723905563 725766830 726348038 725844421
1800.5 725844421 727928696 728670044 728934784 731037216 731726837 732577591 732827988 732729645 733963394
1809.2 733963394 734610977 733849945 734850693 736716385 737497177 738626633 738800659 738721237 738244781
1817.9 738244781 738315125 739508057 739915390 741212845 741569824 742659988 744132843 741817474 742306061
1826.5 742306061 744070053 745246201 744529266 741599503 743553925 746290283 747578125 748081665 748020935
1835.2 748020935 748048935 747777100 747070999 748122864 748915100 749350433 750091629 751601410 751963043
1843.9G51963043n008774K253113K854080l36074p58515L69415J132584N08652J065979
1852.6G54043503N93567J95999J11160l62167j60675p18537N48249N54351N35279P41195
1862.2G56081924J83335O68258L14484N0888r53750m82636n45044n70602J436004J244583
1871.9G57427444Q85544J18256J82648J25961k99606l10440j41373K38418J80893P84912
1881.5G59192657L57514L42255q3085p22503j10321k75345P11441l53546j466217R72061
1891.2G58564911J122284M03747K50855k36817p16247L67279Q3237K9983M80347L20282
1900.8G60669861K91748j90354K66800k21862k87323K517n71289K2278K80228J34430
1910.4G60397034L55835P06939j20926j70898j49536o2790P13348j649322k99835J409759
$$ plain form
1843.9 751963043 746954269 749207382 752061462 751725388 750966873 751336288 752468872 752977524 754043503
1852.6 754043503 754637070 754833069 754944229 754582062 754421387 753702850 754251099 754805450 755340729 756081924
1862.2 756081924 756265259 756933517 757248001 757298889 756345139 755862503 755317459 754746857 756182861 757427444
1871.9 757427444 758312988 758431244 758613892 758739853 758440247 758129807 757988434 758226852 758407745 759192657
1881.5 759192657 759550171 759892426 759809341 759086838 758976517 758701172 759412613 759059067 757592850 758564911
1891.2 758564911 759687195 760090942 760341797 760104980 759388733 759756012 759839249 759869232 760349579 760669861
1900.8 760669861 760961609 760771255 761038055 760816193 760528870 760531387 759960098 759982376 760262604 760397034
1910.4 760397034 760752869 761459808 761338882 761167984 761018448 760955658 761669006 760019684 759719849 761129608
1920.1G61129608P73163L33023j498566o54678P95593N91660k31018k53754M84772
1928.8G61469803N33295L37905L5019N6687j58310j66931o76194n70678L3340J93405
1938.4G61087341N79529L82309J107712o33850k193070O41632L99247l23639m26636
1947.1G60620575P7515Q10546Q51593K05155l27149l00292l99323j91727l90854q7661
1956.7G60868378k48185P1640Q05512R1019L23410l06397p59659k58636M4556Q7127
1966.4G60718765p34100j59912N39093R21173O31027J19629l03268r33381o04553m91104
1976G59703369l8071L50571O65665M66766P019M06189j07879l73002p05795p51724
1985.7G59623108o6910k6398m5394M62570J365204L27148j380157n79453j43204o28814
$$ plain form
1920.1 761129608 761902771 762235794 760737228 760082550 760878143 761469803 761238785 760985031 761469803
1928.8 761469803 762003098 762341003 762376022 762432709 762274399 762107468 761431274 760860596 760893936 761087341
1938.4 761087341 761666870 762049179 763156891 762523041 760329971 760971603 761370850 761047211 760620575
1947.1 760620575 760698090 761508636 762360229 762565384 762238235 761937943 761538620 761346893 760956039 760868378
1956.7 760868378 760620193 760691833 761497345 761588364 761911774 761605377 760845718 760587082 760631638 760718765
1966.4 760718765 759984665 759824753 760363846 761285019 761916046 762035675 761732407 760799026 760194473 759703369
1976 759703369 759665298 760015869 760681534 761148300 761155319 761561508 761453629 761080627 760374832 759623108
1985.7 759623108 759556198 759529800 759484406 759946976 761312180 761639328 760259171 759679718 759536514 758907700
1995.3G58907700n04075Q8273N17959Q37555M40292L59116J45340p34634q39692n20095
2005G58697739j91040j17188J36032L73306M75007L99017j7700j16349l20663n04608
2014.6G58813553o30036n49011j71127J15051L36991O12258L96119k23923l60565o28968
2024.2G57710342k57492j28326j42822K49481K3041O80236L88794l85055m79508m67453
2033.9G57191238q6670m16488l7079K95792J58233K06528M6081m68444o19889R4986
2043.5G56364288k07061j20469J36872J05514K49939m1198P1792k56729m89655n37490
2053.2G55275803q9722J25275K9068M75006L01284N75486k02027o67419j08795m14276
2062.8G55299683l14637m53949J40305P30286M92096J59530m5395k10571o29120n69916
$$ plain form
1995.3 758907700 758403625 758491898 759009857 759847412 760287704 760646820 760792160 760057526 759217834 758697739
2005 758697739 758506699 758389511 758525543 758898849 759373856 759772873 759755173 759638824 759318161 758813553
2014.6 758813553 758183517 757634506 757463379 757578430 757915421 758527679 758923798 758699875 758339310 757710342
2024.2 757710342 757452850 757324524 757181702 757431183 757454224 758134460 758523254 758138199 757658691 757191238
2033.9 757191238 757104568 756688080 756651001 756946793 757105026 757311554 757357635 756889191 756269302 756364288
2043.5 756364288 756157227 756036758 756173630 756279144 756529083 756487885 756559677 756302948 755813293 755275803
2053.2 755275803 755186081 755311356 755340424 755815430 756116714 756692200 756490173 755822754 755713959 755299683
2062.8 755299683 754985046 754531097 754671402 755401688 755893784 756053314 756007919 755797348 755168228 754598312
2072.5G54598312n18341J30310L21732L75671O87943K34070L0746l88183l83759o67343
2082.1G54421158o71311n1956R3003M32510M53415M70352J43890o2713n09491q70896
2091.7G53847961n52978j92261M01917K09121M53263K95791j19095j82266n19790l25470
2101.4G53316193p87430m28696m501L10592O50177K26136J99814m37851l31574l14255
2111G52398605p74078o76193j94397L10440M42352J077042L92914k14615l63465o17523
2120.7G51781082n33371r15603n98679j77460P49817N22461L14407P47528l42102o96563
2130.3G50851517r51157m79126j75018q2245J85928J9303Q57925L94974O5079l13187
2140G50373993j040268o14319j78604K37808O8741M08936N43899O09589K43377n93566
$$ plain form
2072.5 754598312 754079971 754210281 754532013 754907684 755595627 755829697 755860443 755472260 755088501 754421158
2082.1 754421158 753749847 753697891 753790894 754223404 754676819 755147171 755291061 755228348 754718857 753847961
2091.7 753847961 753294983 753102722 753504639 753713760 754167023 754462814 754343719 754161453 753641663 753316193
2101.4 753316193 752528763 752100067 752095566 752406158 753056335 753282471 753482285 753044434 752712860 752398605
2111 752398605 751624527 750948334 750753937 751064377 751506729 752583771 752976685 752762070 752398605 751781082
2120.7 751781082 751247711 750332108 749733429 749555969 750305786 750828247 751142654 751890182 751548080 750851517
2130.3 750851517 749900360 749421234 749246216 749163971 749349899 749369202 750227127 750622101 750687180 750373993
2140 750373993 749333725 748719406 748540802 748778610 748847351 749256287 749800186 750409775 750653152 750059586
2149.6G50059586n31540q80967k19268J44500j47628J34277M58832O92672J45875j89209
2159.3G49667130m87061n10330o26450l56293L94364L61175M85611M07029L20968j8921
2168.9G49637222k27508m62189o80389K0828J95618K34680K78549M98199K11563k40325
2178.5G49466248K2659J06201J71814m68826k27661M17785L38440J46637J66702O75965
2188.2G50815964o9886n59082n34362j71967L72315J79367N46188K70767j83716k32696
2197.8G50432892P6370K41547k54364l8758P6676L04489N81818K79464r9182k19421
2207.5G51381531j72882k54517k66418j34201L01666L75137N42832O47888K21481k95181
2217.1G52347336n97687l08533k61688J55335M00772N56945O01731k1439m8523k09732
$$ plain form
2149.6 750059586 749528046 748647079 748427811 748572311 748424683 748558960 749017792 749710464 749856339 749667130
2159.3 749667130 749180069 748669739 748043289 747686996 748081360 748442535 748928146 749335175 749656143 749637222
2168.9 749637222 749409714 748947525 748267136 748287964 748483582 748718262 748996811 749495010 749706573 749466248
2178.5 749466248 749488907 749595108 749766922 749298096 749070435 749488220 749826660 749973297 750139999 750815964
2188.2 750815964 750746078 750186996 749652634 749480667 749852982 750032349 750578537 750849304 750665588 750432892
2197.8 750432892 750509262 750750809 750496445 750457687 750534363 750838852 751420670 751700134 751600952 751381531
2207.5 751381531 751208649 750954132 750687714 750553513 750855179 751230316 751773148 752421036 752642517 752347336
2217.1 752347336 751749649 751441116 751179428 751334763 751735535 752292480 752894211 752872772 752824249 752614517
2226.8G52614517K1973l25699p37457r995K40021M70123M38309M13055J98746M3717
2236.4G53367310k49176p16248k74277k03705J50376N79376N08881K03018k4719j83716
2246G53157120n92804j39008m4937k33230l9444K89154M31823K31247K41318O0501
2255.7G53361740J36490l24707p63245n19943p8888L58048K38647L82538K49405J64108
2265.3G53204193L6011k98462n65872o76270k93197J21460R47952P03735L75366N3482
2275G53608398l19747l62854r93882r6283Q1940R8496N05294O10581N27878n86701
2284.6G53073120k71301n06516k70919j85776o12030K53448j25122K77558M1046j88828
2294.3G51484680l03039o09894n87998j279296j12916l97262q545M42123r3002K68250
$$ plain form
2226.8 752614517 752636490 752310791 751573334 751563339 751803360 752273483 752711792 753124847 753323593 753367310
2236.4 753367310 753118134 752401886 752127609 751923904 752074280 752653656 753162537 753365555 753340836 753157120
2246 753157120 752564316 752425308 752380371 752147141 752107697 752396851 752828674 753059921 753301239 753361740
2255.7 753361740 753498230 753173523 752410278 751890335 751811447 752169495 752408142 752790680 753040085 753204193
2265.3 753204193 753240204 752941742 752375870 751699600 751406403 751527863 752475815 753179550 753554916 753608398
2275 753608398 753288651 752925797 751931915 751835632 751917572 752016068 752521362 753131943 753659821 753073120
2284.6 753073120 752801819 752295303 752024384 751838608 751226578 751480026 751354904 751632462 751673508 751484680
2294.3 751484680 751181641 750571747 749983749 748704453 748591537 748194275 748185730 748627853 748534851 748803101
2303.9G48803101p87430o12564j494294j243743n91431p85523L01362L8757M98199
2312.6G44126434q52966n99518m98123j593094n63278j410370n48019p39975q10395
2321.3G36510696l79715o15921n41915j666031n36270q89817l11203p93533p38525
2329.9G30037766K47726p56378J346054M44183k73514j933975k097626J146927Q70591
2338.6G29031754k24457j807633j38626L47748Q13751K15836q55866J618882K467727
2347.3G31469116L770828J892167j022797k631378l163681k371140k585525k805481
2355G22552109l460541j738129l78952R6817K86560j94244R07669j574020J136703
2363.7G17633972J866455l59192O55442Q73718K709274K474747K512588K159348J879654
$$ plain form
2303.9 748803101 748015671 747403107 745908813 744665070 744073639 743288116 743589478 743628235 744126434
2312.6 744126434 743273468 742673950 742175827 740582733 740019455 738609085 738061066 737321091 736510696
2321.3 736510696 736130981 735515060 734973145 733307114 732770844 731881027 731569824 730776291 730037766
2329.9 730037766 730285492 729529114 730875168 731319351 731045837 729111862 727014236 728161163 729031754
2338.6 729031754 728807297 726999664 726861038 727208786 728022537 728238373 727382507 729001389 731469116
2347.3 731469116 735239944 737132111 736109314 733477936 730314255 727943115 725357590 722552109
2355 722552109 719091568 717353439 716974487 717071304 717357864 717163620 718071289 716497269 717633972
2363.7 717633972 719500427 719141235 719796677 720670395 723379669 725854416 728367004 730526352 732406006
2372.4G32406006J411209J81885P50198Q57010J443100J855698J655502J182251J577606
2381.1G43320465K034226R30175K15149l42560p0800K59170J74484O76346P38602L34701
2390.7G48269958j40533p4463m19311p45926n22461l00751J06735O8894K61917M80652
2400.3G46984711J58004l08609n27420o53610m00085m77600r28116J26953O00815N01632
2410G45076675M31672j25885l71170p07322m02679k68784j4724q9798k84806M23584
2419.6G43666763k4261j89438k44217o26297l08227k32239k57263j85624Q0033K77023
2429.3G41956253K01416j70135k83661m14353m02679p1259l04870k73514k24915J55487
2438.9G40167770L05634j56174k39410l09296j08414k36434k48566l59268k60849K30179
$$ plain form
2372.4 732406006 733817215 733999100 734749298 735606308 737049408 738905106 740560608 741742859 743320465
2381.1 743320465 745354691 746284866 746500015 746157455 746086655 746345825 746520309 747196655 747935257 748269958
2390.7 748269958 748129425 748054962 747635651 746889725 746367264 746066513 746173248 746242142 746504059 746984711
2400.3 746984711 747142715 746834106 746306686 745653076 745252991 744775391 743847275 743974228 744575043 745076675
2410 745076675 745508347 745382462 745011292 744303970 743901291 743632507 743617783 743527985 743243179 743666763
2419.6 743666763 743642502 743453064 743208847 742582550 742274323 742042084 741784821 741599197 741679230 741956253
2429.3 741956253 742157669 741987534 741703873 741289520 740886841 740815582 740510712 740237198 740012283 740167770
2438.9 740167770 740473404 740317230 740077820 739768524 739660110 739423676 739175110 738815842 738554993 738785172
2448.6G38785172k8306o9809m27322m49600k74429k02713L09753j54038n93490l80249
2458.2G36514969J64642L80554k36358n53055l54767n52215m99955O2638j38474R4605
2467.8G34882584K60162q3160j04218n49087p50657n36499j36871P6904M36173K12173
2477.5G33707504n12314k55813n11475n65185j92185q5983L433m10003l00446K14767
2487.1G31092300J56479j33590k67182p25326n85862j3732j77231k93274n0507K14081
2496.8G29216156k02408o4773J69754l33023n10254n46799k04773m01230O6223N61905
2506.4G27750778j63574k47116k56729l40348p84606n98526j44577j14670L37524M64325
2516.1G25902481O54678j67770n61523j83869q72574j082534n55268K06986L32946
$$ plain form
2448.6 738785172 738756866 738687057 738259735 737810135 737535706 737332993 737642746 737488708 736895218 736514969
2458.2 736514969 736679611 737060165 736823807 736270752 735915985 735363770 734863815 734926453 734787979 734882584
2467.8 734882584 735142746 735059586 734955368 734406281 733655624 733119125 732982254 733059158 733495331 733707504
2477.5 733707504 733195190 732939377 732427902 731862717 731670532 731584549 731587982 731177979 730877533 731092300
2487.1 731092300 731248779 731115189 730848007 730122681 729536819 729523087 729345856 729052582 729002075 729216156
2496.8 729216156 729013748 728948975 729118729 728785706 728275452 727728653 727523880 727122650 727188873 727750778
2506.4 727750778 727587204 727340088 727083359 726743011 725958405 725359879 725215302 725100632 725438156 725902481
2516.1 725902481 726557159 726389389 725827866 725643997 724771423 723688889 723133621 723340607 723673553
2524.7G23673553K39029K85569J80359j08796m29153m94080q21457l05786n7602Q774
2534.4G22170410M98276K7313n5389R4070k01568q55561r71603j73264K89841J25351
2544G20947876j01318J36489K34070P4234m72564l94135j50299p11212n57938j19018
2553.7G18886185L12652K04926M1809k41089n73654m425m86908n80216j15966q1025
2563.3G17362289R4376p6828K03857k9373n48019l94592l48435n62744j81503L88565
2573G15907593P5989k72294l89328J27793O4544n87768m72641m47540l7918q0948m62113
2583.6G13425369M3106M55857N3482n25818n13001l92990m14810o30264k63520K26975
2593.2G11464386J86539J82647j43280m02298p15866o28586k21862j49536j04752k17896
$$ plain form
2524.7 723673553 723912582 724198151 724378510 724269714 723840561 723346481 722525024 722219238 722161636 722170410
2534.4 722170410 722668686 722695999 722640610 722734680 722533112 721677551 720705948 720532684 720822525 720947876
2544 720947876 720846558 720983047 721217117 721291351 720818787 720424652 720274353 719563141 719005203 718886185
2553.7 718886185 719198837 719403763 719445572 719204483 718630829 718626404 718139496 717559280 717443314 717362289
2563.3 717362289 717456665 717379837 717583694 717554321 717006302 716611710 716263275 715700531 715519028 715907593
2573 715907593 715983582 715711288 715321960 715449753 715514297 714926529 714453888 714006348 713968430 713887482 713425369
2583.6 713425369 713468475 713924332 713977814 713451996 712938995 712546005 712131195 711500931 711237411 711464386
2593.2 711464386 711650925 711833572 711690292 711287994 710572128 709943542 709721680 709572144 709467392 709249496
2602.9G09249496p9116J34124J09864n64423r53598m87976k25906j34201k30484q1254
2612.5G06736526k2125j02157j63041k99606l72848p80487n20707j40762k81372l08533
2622.1G03744888r8877Q9798k90069m71649n39170n78537k42691l51410o57348j27869
2631.8G00477066P0419l15780o9504l41568n20401o36139j173172o86417j63879j5564
2641.4F96625061J3962J6556J10702n6305o92215j111374m72641L434j16959m85840
2651.1F93834381l61633m0741k08130k28806l76739l55988n27877o91224o33850m61349
2660.7F89948044M1504R15p1411l23486l10974k51465o79245m62341j76239p3166k67258
2671.3F87374878q9569j51138p89261l93753j65177n18722p63932n19256j93711m27780
$$ plain form
2602.9 709249496 709170380 709304504 709414368 708849945 707896347 707408371 707182465 707048264 706817780 706736526
2612.5 706736526 706714401 706612244 706449203 706149597 705776749 704996262 704475555 704334793 704053421 703744888
2622.1 703744888 703646011 703735809 703445740 702974091 702434921 701856384 701613693 701262283 700604935 700477066
2631.8 700477066 700547485 700231705 700162201 699820633 699300232 698664093 697490921 696804504 696640625 696625061
2641.4 696625061 696639023 696655579 696766281 696709976 696017761 694906387 694433746 694437180 694320221 693834381
2651.1 693834381 693472748 693432007 693223877 692995071 692618332 692262344 691734467 691043243 690409393 689948044
2660.7 689948044 689989548 689990463 689919052 689595566 689284592 689033127 688353882 687891541 687715302 687642136 687374878
2671.3 687374878 687285309 687134171 686344910 685951157 685785980 685267258 684503326 683984070 683790359 683362579
2681F83362579l63693j3962k17590n21088q0871j48545j030731j200714j11770N18646
2690.6F80192261J35116o714k96783j00327l16925q41217m95147o04325m81262k07672
2700.3F76977005R8343J57547j44119k11411o29578o34079l73535j19171k56653l96423
2709.9F74467926m9286j37787k79541l92303j89820m35333o64062k02942k93503k37808
2719.5F71585541r9335n2414j28937k10189k54822n29404l02124m88205r37881n19638
2729.2F68062592o867L9597N4168j15280k72827k13699m77143l06854k1438q3161q1100
2739.8F66577988J74484K53906k14996q1558k22016p49969o04248l66211n16281l81775
2749.4F63869324L15780j02462l70179j18713m24881j67694j20468j81122o9580k63825
$$ plain form
2681 683362579 682998886 682984924 682767334 682246246 682165375 682016830 680986099 679785385 679673615 680192261
2690.6 680192261 680327377 680320663 680023880 679923553 679606628 678765411 678270264 677665939 677184677 676977005
2700.3 676977005 677075348 677232895 677088776 676877365 676247787 675613708 675240173 675121002 674864349 674467926
2709.9 674467926 674418640 674280853 674001312 673609009 673419189 672983856 672319794 672116852 671823349 671585541
2719.5 671585541 671486206 671433792 671304855 671094666 670839844 670310440 670008316 669520111 668582230 668062592
2729.2 668062592 668055725 668095322 668149490 668034210 667761383 667547684 667070541 666763687 666742249 666659088 666577988
2739.8 666577988 666752472 667006378 666791382 666709824 666487808 665737839 665133591 664767380 664251099 663869324
2749.4 663869324 664185104 664082642 663712463 663593750 663168869 663001175 662880707 662699585 662630005 662366180
2759.1F62366180j94778J06888K1896l66821o81763q74481l52020J16043k37885l51257
2768.7F59552002L43628K96707m15726j56021j28860m60053o92825n53055k62527l25775
2778.4F57197495l0594j93253j89819k65198o88705n44968l73306j95313n47409k35748
2788F53933182K07748k20947l18832n10407m51279m14352o17600n06439q8501j60827
2797.7F50851746p68052q27789o33163k94113m47770m63714l32337q90655q72345q08563
2807.3F44513245l55530J87683n41611r03091n58396o62307p10450o08749p74536m69780
2816.9F39116478k93884m68064o07452r90295r16558o63337o79627q91724j211776
2825.6F32393761j230469n83420k97623q98284o86417m17786j123695j357002q36258
$$ plain form
2759.1 662366180 662171402 662278290 662300186 661933365 661251602 660377121 660025101 660141144 659903259 659552002
2768.7 659552002 659895630 660192337 659776611 659620590 659491730 659031677 658338852 657785797 657523270 657197495
2778.4 657197495 657166901 656973648 656783829 656518631 655829926 655284958 654911652 654716339 654168930 653933182
2788 653933182 654140930 653919983 653601151 653090744 652639465 652225113 651607513 651101074 651012573 650851746
2797.7 650851746 650083694 649255905 648622742 648328629 647880859 647417145 647084808 646194153 645321808 644513245
2807.3 644513245 644157715 644345398 643803787 642900696 642342300 641679993 640969543 640360794 639586258 639116478
2816.9 639116478 638822594 638354530 637747078 636756783 635840225 635176888 634497261 633605537 632393761
2825.6 632393761 631163292 630579872 630282249 629383965 628697548 628279762 627156067 625799065 624962807
2834.3F24962807r16596j089210n39131q60177j797103k035523j397362j037178j377372
2843F13913155j597252k217255k421036k026443j927681k011223k062149j774979j290779
2851.7E96584358j029243r74999m73633k77137l4828q9455r60350n11475k56462m99344
2861.3E91477432m49333o25343p69959r48639m68025n36156q37898j050682j196670
2870E84594727o70319p62634o21758o57577q95386r72786p82585p6065n86128n70755
2879.6E77998734j35842n23338n17693l00522l28636q08906p82013m03252j29890l87497
2889.3E73681145p64847l86772n90134o99654j88179L08495l7422o97556l36418n05905
2898.9E69782753m70772j08299o00815l59115j3352m57153k87552Q2741k22741l73077
$$ plain form
2834.3 624962807 624046211 622957001 622417870 621557693 619760590 617725067 616327705 615290527 613913155
2843 613913155 612315903 610098648 607677612 605651169 603723488 601712265 599650116 597875137 596584358
2851.7 596584358 595555115 594580116 594106483 593829346 593794518 593705063 592744713 592233238 591976776 591477432
2861.3 591477432 591028099 590402756 589632797 588684158 588216133 587679977 586842079 585791397 584594727
2870 584594727 583924408 583161774 582540016 581882439 580987053 580014267 579231682 579155617 578569489 577998734
2879.6 577998734 577862892 577339554 576821861 576521339 576192703 575383797 574601784 574198532 574068642 573681145
2889.3 573681145 572916298 572529526 571939392 571239738 571051559 571360054 571322632 570625076 570288658 569782753
2898.9 569782753 569311981 569203682 568602867 568243752 568230400 567773247 567485695 567568436 567345695 566972618
2908.6E66972618o34117q83408p68852r92126j121331j001091q81004r24568q48999
2917.2E58917122n14259m98391n79834n18112l45383n26962l38135L24555K42348K88391
2926.9E56451340K58369L29819N24902m10347k55775P72323N21851K20070K72217K29454
2936.5E58914223K80304Q78448J044731K50321K26974O67076O55022M30794P72476
2945.2E64120369R11560R7313J70135M67835M78325M37965j30348M3259P74841P28302
2954.8E68099556M2801j80893o6795L38668P54815P92045Q11310L88260K96173K73552
2964.5E71549492L11699O70433J048851J511459Q79669N68695Q20847J033745J403236
2973.2E79798126P16057L30200J183625J465835N99403O34079Q13179O03142R53675
$$ plain form
2908.6 566972618 566338501 565455093 564686241 563694115 562572784 561571693 560690689 559766121 558917122
2917.2 558917122 558402863 557904472 557324638 556806526 556461143 555934181 555596046 555920601 556162949 556451340
2926.9 556451340 556709709 557039528 557564430 557154083 556898308 557670631 558192482 558412552 558684769 558914223
2936.5 558914223 559194527 560072975 561117706 561368027 561595001 562262077 562917099 563347893 564120369
2945.2 564120369 565031929 565129242 565299377 565767212 566245537 566683502 566553154 566596413 567371254 568099556
2954.8 568099556 568142357 567961464 567894669 568233337 568988152 569780197 570591507 570979767 571275940 571549492
2964.5 571549492 571861191 572531624 573580475 575091934 575971603 576540298 577361145 578394890 579798126
2973.2 579798126 580514183 580844383 582028008 583493843 584093246 584727325 585540504 586143646 587097321
2981.8E87097321N42182L36533L27988M14810M90799K23312N28984N78156O88438L91312
2991.5E91619835K14424L49770J15928L84064J24969m4860j24359j53161K72980K02713
3001.1E92962303J80855j95618l71170K823l69873l72925J06545o31752o86608L23220
3010.8E90947800J28593k42958n60150n73120l82157k94876j20468o33545m43916j62392
3020.4E87662811l27301l56407m96178o86l3951o42548q54225o28967j98288n9395
3030.1E84064865k25258m83436l53852l60641m36592j82572j59721o57539p75299l30506
3039.7E80099449m96559o05469k57263k57759p17888n62134j32522n41001p61680p92580
3049.4E74974594o15616l95431l32680l12233o36482m79546m66003p84531o43768m22898
$$ plain form
2981.8 587097321 587639503 587976036 588304024 588718834 589209633 589432945 589961929 590540085 591228523 591619835
2991.5 591619835 591834259 592184029 592299957 592684021 592808990 592764130 592639771 592486610 592759590 592962303
3001.1 592962303 593143158 592947540 592576370 592579193 592209320 591836395 591942940 591311188 590624580 590947800
3010.8 590947800 591076393 590833435 590273285 589700165 589318008 589023132 588902664 588269119 587825203 587662811
3020.4 587662811 587335510 586979103 586482925 586482239 586448288 585805740 584951515 584322548 584124260 584064865
3030.1 584064865 583839607 583356171 583002319 582641678 582205086 582022514 581862793 581205254 580429955 580099449
3039.7 580099449 579602890 578997421 578740158 578482399 577764511 577202377 577069855 576528854 575767174 574974594
3049.4 574974594 574358978 573963547 573630867 573318634 572682152 572202606 571736603 570952072 570308304 569885406
3059E69885406n41915n84793n06020p63130p93534n72013M0054l46336q48465M5623
3068.6E65014877k43301n81360o85158r48257m51470n37147o54984n86013m05617k12288
3078.3E59709282o49605q05015l10593j92528n38864p09267o21032j87188m70314p51342
3087.9E54473534n09987o39420o12526p87735o75239p79190p25174k72827o13747k24114
3097.6E48633575k25181n10368k49749o79702p75261o32019m52843l82881p16362p12090
3107.2E43297119o86302o13747j37443k79923q57849p80296m97399l27873o68907p86705
3116.9E37660675l25279m76189o35414o23627m91028n21163r38569n79910l83987j121941
3126.5E31563568j273575m43039L8567n02129q22029l79677n77240o77261o57921j139641
$$ plain form
3059 569885406 569343491 568758698 568252678 567489548 566696014 566124001 566164055 565817719 564969254 565014877
3068.6 565014877 564771576 564190216 563505058 562556801 562105331 561568184 560913200 560327187 559921570 559709282
3078.3 559709282 559059677 558254662 557944069 557751541 557212677 556503410 555882378 555695190 555224876 554473534
3087.9 554473534 553963547 553324127 552711601 551923866 551248627 550469437 549744263 549471436 548857689 548633575
3097.6 548633575 548408394 547898026 547648277 546968575 546193314 545561295 545108452 544725571 544009209 543297119
3107.2 543297119 542610817 541997070 541859627 541579704 540721855 539941559 539444160 539116287 538447380 537660675
3116.9 537660675 537335396 536859207 536223793 535600166 535109138 534587975 533649406 533069496 532685509 531563568
3126.5 531563568 530289993 529846954 529885521 529383392 528561363 528181686 527604446 526927185 526269264 525129623
3136.1E25129623o87027l06968k91481o21491j210174q37937n47218l79677k38075
3144.8E20009575m04091p76329o87637l72391p67441n29098l25776m59899n92614p55386
3154.5E14338913o26984j172867r80224k92969n22385o10923l49312m97322p22351
3163.1E08563576m96407n83038p10526q33625p46384n59845p65686l56674M5662n25666
3172.8E03031387j037864n31388o00738n06630j2779r94263r95598m19846m41169m24690
3182.4D97066422l62130m22516r33075p13768n53817l79296l86505m19578k57492j021309
3192.1D91616936o13900m62493j000863o03256k87819o9465n64270j051941n18303
3200.8D86444626J30195o62841j245613l05901r92m77409q01277m58565p18498j088982
$$ plain form
3136.1 525129623 524442596 524135628 523844147 523222656 522012482 521174545 520627327 520247650 520009575
3144.8 520009575 519605484 518829155 518141518 517769127 517001686 516472588 516146812 515686913 515094299 514338913
3154.5 514338913 513711929 512539062 511558838 511265869 510743484 510132561 509783249 509285927 508563576
3163.1 508563576 508067169 507484131 506773605 505939980 505193596 504633751 503868065 503511391 503557053 503031387
3172.8 503031387 501993523 501462135 500861397 500354767 500341988 499347725 498352127 497932281 497491112 497066422
3182.4 497066422 496704292 496281776 495348701 494634933 494081116 493701820 493315315 492895737 492638245 491616936
3192.1 491616936 491003036 490540543 489539680 488936424 488648605 488579140 488014870 486962929 486444626
3200.8 486444626 486574821 485911980 484666367 484360466 484359474 483882065 483080788 482622223 481903725 480814743
3210.4D80814743k80609K02484m67606j326942o62804r2697L4790k76832j075096q26226
3220D76043205n97992m11720n54428n66826k89116m59175j81045j92795l28141o03599
3229.7D71858368p46002l64914j3962n5351q97141q31833m16450p32842n57632m70009
3239.3D66772232o05583q0185m25148q41560j22185m52271n40657n15709n95665J37787
3249D62731056J2665l82271q55903m06800k99453j098748o30569l55187M4022l2616
3258.6D58726196l13034l97300r84574o35795k94648k31285l47900n73959m99421l88069
3268.3D54060211o1531l12080q42095j60408K18239j051445o98166J31417m35105k61612
3277.9D50587425j11923j02386k44866k74963J0109l70255p12433l52440j57470n71556
$$ plain form
3210.4 480814743 480534134 480736618 480269012 478942070 478279266 478186569 478221359 477944527 476869431 476043205
3220 476043205 475445213 475033493 474479065 473912239 473623123 473163948 472982903 472790108 472461967 471858368
3229.7 471858368 471112366 470747452 470733490 470678139 469780998 468949165 468532715 467799873 467242241 466772232
3239.3 466772232 466166649 466086464 465661316 464819756 464697571 464245300 463704643 463188934 462593269 462731056
3249 462731056 462743721 462361450 461505547 461098747 460799294 459700546 459069977 458714790 458758812 458726196
3258.6 458726196 458413162 458015862 457031288 456395493 456100845 455869560 455521660 454947701 454448280 454060211
3268.3 454060211 453998680 453686600 452844505 452684097 452902336 451850891 451152725 451284142 450849037 450587425
3277.9 450587425 450475502 450373116 450128250 449853287 449863396 449493141 448780708 448428268 448270798 447699242
3287.5D47699242k00577Q7433p8965m04853q27599j88408K41585L05252n50461j306457
3297.2D44776192n13878K07519K69738n16739p63092l61977L78914M43420q20808p13387
3306.8D42385902j04980l77922o05202l89976k27738m0397m8256n93987o20689n99976
3316.5D38776779l17726m2305j81160k92396m35639o57463q98895j66779J35956n7564
3326.1D35862808l90892p12433j32789j42746l03078r61189j056977k8610M06075J48201
3335.8D32688370p13883m54559k04392l89785n42450m89693j30196n51338l9558l62396
3345.4D28810120m25682N61981l44391p53098k93197J35040m30641j030693l22991
3354.1D25906448r1095m29573r74846l78723K52343j74447j29470j4000k63977l65563
$$ plain form
3287.5 447699242 447498665 447586098 447507133 447102280 446274681 446086273 446327858 446633110 446082649 444776192
3297.2 444776192 444262314 444469833 444739571 444222832 443459740 443097763 443476677 443920097 443099289 442385902
3306.8 442385902 442280922 441903000 441297798 440907822 440680084 440639687 440591431 439997444 439376755 438776779
3316.5 438776779 438459053 438416748 438235588 437943192 437507553 436850090 435951195 435784416 435920372 435862808
3326.1 435862808 435471916 434759483 434626694 434483948 434180870 433219681 432162704 432134094 432540169 432688370
3335.8 432688370 431974487 431519928 431315536 430925751 430383301 429893608 429763412 429212074 429172516 428810120
3345.4 428810120 428384438 428946419 428602028 427848930 427555733 427690773 427260132 426229439 425906448
3354.1 425906448 425815353 425385780 424410934 424032211 424284554 424110107 423980637 423966637 423702660 423337097
3363.7D23337097j65825j79443k61002l80859k92244k45132n22156o07834n20134J46332
3373.4D20308800o1493m47540J27449J33438q6823l47709l41836m32510m70238l85055
3383D17996483o75850j67389o8626j66321L68843L1280o56051o59867j0528J43089
3392.7D16135063k85644K0408k67067r19609k38876J45645o3820j90430k26936K34795
3402.3D14343529k8420l09105j90l75557m23012M88624L34931q19512o61659P9727
3412D12629356k3880n65757m31786K29378J45225j91993m1123J94168j20125m17404
3421.6D11406059l41873l33023n1575M64554O13480J08795j07079J35498M59137M6845
3431.2D12400818o57768j6938J21613l1357M57726L81813K70347R0790n85594k64702
$$ plain form
3363.7 423337097 423171272 422991829 422730827 422349968 422057724 421812592 421290436 420682602 420162468 420308800
3373.4 420308800 420247307 419799767 419927216 420060654 419973831 419626122 419284286 418851776 418381538 417996483
3383 417996483 417320633 417153244 417084618 416918297 417287140 417318420 416662369 416002502 415991974 416135063
3392.7 416135063 415849419 415869827 415602760 414683151 414444275 414589920 414526100 414335670 414108734 414343529
3402.3 414343529 414315109 414006004 414005814 413630257 413207245 413695869 414030800 413211288 412549629 412629356
3412 412629356 412605476 412039719 411607933 411837311 411982536 411790543 411749420 411943588 411823463 411406059
3421.6 411406059 411064186 410731163 410679588 411144142 411757622 411866417 411759338 411894836 412353973 412400818
3431.2 412400818 411743050 411726112 411847725 411816368 412274094 412655907 412926254 413017044 412431450 412166748
3440.9D12166748N96275k21214l14293M92516O77986N67093p63169o35185K70615O53343
3450.5D13490715Q70400K01263n94215k92778Q96682O07338L91808K87094l37105K17552
3460.2D15738754M10614O18630K3536l02124N77813N87501K95677N4131L87726j7433
3469.8D18374825j24779P65838N23835J4000j21232M21029P39021M96979K79922L91503
3479.5D21760941K73056K5100L98217J26113L88871N00564N98641O67724l62816K08397
3489.1D24584808N70412j47018o1951P48062J028214N69152M10691K04696N13115M49677
3498.7D28869858M32892N45463K18849L52364j04561K47460Q86726P41730O88858M84657
3508.4D33364296l43285l24783P72896R44328J450157N30396j76048O53076L5209M48037
$$ plain form
3440.9 412166748 412763023 412541809 412227516 412720032 413398018 413965111 413201942 412566757 412837372 413490715
3450.5 413490715 414361115 414562378 413968163 413675385 414572067 415179405 415571213 415858307 415521202 415738754
3460.2 415738754 416149368 416767998 416791534 416489410 417067223 417654724 417950401 418004532 418392258 418374825
3469.8 418374825 418250046 419015884 419539719 419553719 419432487 419853516 420592537 421089516 421369438 421760941
3479.5 421760941 422033997 422059097 422457314 422583427 422972298 423472862 424071503 424739227 424376411 424584808
3489.1 424584808 425155220 425008202 424946251 425694313 426722527 427291679 427702370 427907066 428420181 428869858
3498.7 428869858 429302750 429848213 430067062 430419426 430314865 430562325 431449051 432190781 432879639 433364296
3508.4 433364296 433021011 432696228 433469124 434413452 435863609 436394005 436217957 436871033 436906242 437354279
3518D37354279M26597k41852J050263J718445K38990r30938O68106J213951O77757
3526.7D42175598P18880J083259M81606l66287J49307P74307R48715P01142J177215
3535.4D47843742O37894k98157O02532M96940N72815N93376N87082P90367J095009
3544.1D52921600M42086k37809Q41256l54386J220055J788063O99997J463661k24609
3552.7D58559914P26509J018486O24923J224328J58348J031417J090622O95038M65660
3561.4D65595245J233063Q70552O4163K598610j24778j107J040879j163178K111244
3570.1D72224693R12743P43523J820755J283035P03125O75163J460114M30374J182937
3578.8D81436462J283417L65715R06105J406212J392098M15649K550125J438637j172943
$$ plain form
3518 437354279 437780876 437539024 438589287 440307732 440546722 439615784 440283890 441497841 442175598
3526.7 442175598 442894478 443977737 444459343 444093056 444242363 445016670 445965385 446666527 447843742
3535.4 447843742 448481636 448183479 448786011 449282951 449855766 450449142 451036224 451826591 452921600
3544.1 452921600 453363686 453125877 453967133 453612747 454832802 456620865 457320862 458784523 458559914
3552.7 458559914 459286423 460304909 460929832 462154160 462312508 463343925 464434547 465129585 465595245
3561.4 465595245 466828308 467698860 467763023 470361633 470236855 470235748 471276627 470113449 472224693
3570.1 472224693 473137436 473880959 475701714 476984749 477687874 478363037 479823151 480253525 481436462
3578.8 481436462 482719879 483085594 483991699 485397911 486790009 487205658 489755783 491194420 490021477
3587.5D90021477J221428q69713J499557K272225K679138J469765l67661K358894n66749
3596.1D99718361R02595K610245O43959K522507J312218K93579J163330J762085K021255
3604.8E12950134K202454K034225r63440K283974k26822J24550O573181J181030j734733
3613.5E24424553L085136L81966L650322L294220n90668J454354P95478J370316K918358
3622.2E40784035K406807K120361K029610Q86154K044029O746712J060562j0179405
3629.9E47898865L671798M951973N304985K573319r49822K007523K757454K287407
3637.6E70503502J752128K028733J936264J726150R87435Q98590K551193L035049M959984
3646.3E90379028M62075k268715N040168k71644k784386Q03299O372757M916458L321724
$$ plain form
3587.5 490021477 491242905 490373192 491872749 494144974 496824112 498293877 497926216 500285110 499718361
3596.1 499718361 500620956 503231201 503875160 506397667 507709885 508003464 509166794 510928879 512950134
3604.8 512950134 515152588 517186813 516223373 518507347 518280525 518405075 524978256 526159286 524424553
3613.5 524424553 527509689 527891655 531541977 534836197 534245529 535699883 536495361 537865677 540784035
3622.2 540784035 543190842 545311203 547340813 548226967 550270996 557017708 558078270 547898865
3629.9 547898865 551570663 556522636 561827621 564400940 563451118 565458641 568216095 570503502
3637.6 570503502 572255630 574284363 576220627 577946777 578934212 579832802 582383995 585419044 590379028
3646.3 590379028 590841103 588572388 593612556 593340912 590556526 591359825 597732582 602649040 605970764
3655F05970764M424896o129570J469574M705964J281547J886025J761055K589645R47761
3663.6F18907661J104699J520881J084099L963394J692810j118660K39907l256417
3671.4F24138374K506790O604996P061119j010856j2598114K875290O121444L675995
3679.1F39375038j395149L19519K858429K128906J017533o333L07694M124221N722504
3687.8F54452362p934036l263016O602631m189682J6937M815369Q70361J226654P6599
3696.4F52674179o21033O50864k62146K168045K809601m333420k097549L844757J169662
3705.1F56002960p66067o7902K102203L111802n532990L471527L520127j0722886M150773
3713.8F55269547L237762J42212Q50906J805802Q16345k933731J611786M171981m711914
$$ plain form
3655 605970764 610395660 604266090 605735664 610441628 611723175 613609200 615370255 617959900 618907661
3663.6 618907661 620012360 621533241 622617340 626580734 628273544 627154884 627394791 624138374
3671.4 624138374 626645164 633250160 640311279 639300423 626702309 629577599 635699043 639375038
3679.1 639375038 637979889 638299408 641157837 643286743 644304276 644297943 644605637 648729858 654452362
3687.8 654452362 646518326 643255310 649857941 645668259 645685196 650500565 651370926 652597580 652674179
3696.4 652674179 652053146 652704010 652441864 654609909 657419510 653086090 650988541 654833298 656002960
3705.1 656002960 655236893 655168991 657271194 660382996 654850006 658321533 661841660 651118774 655269547
3713.8 655269547 658507309 658649521 659500427 661306229 662122574 659188843 660800629 664972610 660260696
3722.5F60260696l782043M113617L81851m79813j560134k27204L075867J380463M711761
3731.2F67875061k384949p223663P164917K53830q654099J517334K299652J33286K470169
3739.8F63451538L189163l064193K042083J0305558o700745j5827560P697448L573761
3747.5F64667053M178848j710891q809281Q372498n253525n319977N821152M567642
3755.3F66513519K541886m847489K246475N031662p085113k318802L759232J685409
3763F67526779K76108K465668l067627l941880K693177M049606P51038p678376J152039
3771.7F64226532K626266K09656P60956Q4305J025390q926J723023j65787n968399
3780.3F64513016J802826J154174J170350K161483l367691p33261J676865P64618M73785
$$ plain form
3722.5 660260696 656478653 660592270 660974121 660494308 658934174 658706970 661782837 663163300 667875061
3731.2 667875061 665490112 658266449 665431366 665685196 657031097 658548431 660848083 660981369 663451538
3739.8 663451538 666640701 663576508 665618591 675924149 669223404 653395844 661093292 664667053
3747.5 664667053 668845901 667135010 658325729 666698227 661444702 656124725 661945877 666513519
3755.3 666513519 669055405 664207916 666454391 671486053 664400940 662082138 665841370 667526779
3763 667526779 667802887 670268555 667200928 663259048 665952225 670001831 670752869 663074493 664226532
3771.7 664226532 666852798 667062454 667823410 667907715 668933105 668924179 670647202 670481415 664513016
3780.3 664513016 666315842 667470016 668640366 670801849 667434158 666700897 668377762 669142380 669616165
3789F69616165l59802j00556r13543J72348J10779N39932L316193k687531m638290
3797.7F65055695J231231L254853L882980o592560n817871L159943J882705M393006
3805.4F70449982M557571p511215k565079L579025J037445J32676k28806k12326J365051
3814.1F70604324M085160k830963j1885148M527131M556198M158706J101380j5939560
3821.8F58377228L358078N127563J677017K246476P2555l556976Q087J189652J716690
3830.5F70216370J169891n880432K823486N812912n906982n55649N930481q623505
3838.2F64986572k832107P574768m463349q40225O117325j950912l481827K541733
3845.9F67651978P51419o38352J533737o79626J265182L339081p379379J939087j0851288
$$ plain form
3789 669616165 669256363 669155807 668242264 668414612 668525391 669065323 672381516 669693985 665055695
3797.7 665055695 666286926 669541779 673424759 666832199 661014328 664174271 666056976 670449982
3805.4 670449982 675007553 667496338 664931259 668510284 669547729 669680405 669451599 669239273 670604324
3814.1 670604324 674689484 671858521 659973373 664500504 669056702 673215408 674316788 658377228
3821.8 658377228 661735306 666862869 668539886 670786362 670858917 667301941 667310028 668499680 670216370
3830.5 670216370 671386261 665505829 668329315 674142227 668235245 667679596 673610077 664986572
3838.2 664986572 662154465 669729233 665265884 664425659 670542984 668592072 665110245 667651978
3845.9 667651978 668403397 667765045 669298782 668619156 669884338 673223419 665844040 667783127 656931839
3854.6F56931839R74045Q419113j136856q87833K487717K454986J730423n229873R25522
3863.3F66669083N518951o220627l823776L630066M443893N318222q992385q174363
3871F58369064M526368N599441L316269q598709r003L449021L07235J721573K653961
3879.7F71335220n147934n114746M857559K90757Q27026M255676j0034866Q79593L660583
3888.3F65808868J448594L868179j924286p784729J448517K830963l62701J529922
3896.1F66863327P72171J068878K73895p274398M419250J200485n324554K340012k847443
3904.7F61491623L0975R51615N07126K109298o5689L0747L45077L35007n1346r02176
3914.4F64782257O49719J304322l645859k681656M326706M90265l380661J578445J207962
$$ plain form
3854.6 656931839 657905884 666324997 665188141 664300308 666788025 669243011 670973434 665743561 666669083
3863.3 666669083 672188034 665967407 662143631 665773697 670217590 675535812 666543427 658369064
3871 658369064 662895432 668494873 671811142 663212433 663203430 666652451 666959686 668681259 671335220
3879.7 671335220 666187286 661072540 665930099 666220856 667047882 671303558 661268692 662148285 665808868
3888.3 665808868 667257462 671125641 669201355 661416626 662865143 665696106 665333405 666863327
3896.1 666863327 667635498 668704376 668978271 661703873 666123123 667323608 661999054 664339066 661491623
3904.7 661491623 661522598 662474213 662981339 665090637 665024948 665055695 665400772 665735779 665684433 664782257
3914.4 664782257 665431976 666736298 663090439 660408783 664735489 665225754 661845093 663423538 664631500
3923.1F64631500N98679j752701k228088J399841Q05588P90939q44879o86569J587524
3931.7F64301834k044220j210937J180496L815l17307R8877M37164j51519q7891K108459
3941.4F64318771J529084l956604j355439J410294L94897K53067j347503N58014l71094
3950.1F61433487j912842J457062M94003l30658k26745M2419J40762j003799j08414
3958.7F59985275j31149O98242L59955j997833K0218J630401J02463p80182k74734
3967.4F59612656K21862M96064L20129J00632n45731m76150L7994m69437m89044k99454
3977.1F58509521O15082P9041q30612R8724K24075L08914m41894l67355L42331l55149
3986.7F58182678m48608R5978Q09631J30691m07943l77655m32511M15650J97067k90985
$$ plain form
3923.1 664631500 665230179 663477478 661249390 662649231 663454819 664245758 663400879 662714310 664301834
3931.7 664301834 662257614 661046677 662227173 662230988 661913681 662012558 662449722 662298203 662210312 664318771
3941.4 664318771 665847855 661891251 660535812 661946106 662341003 662594070 661246567 661804581 661433487
3950.1 661433487 659520645 660977707 661471710 661141052 660914307 660956726 661097488 660093689 659985275
3958.7 659985275 659854126 660552368 660912323 658914490 658934708 660565109 660667572 659887390 659612656
3967.4 659612656 659834518 660330582 660650711 660751343 660205612 659729462 659767456 659298019 658808975 658509521
3977.1 658509521 659124603 659203644 658373032 658471756 658695831 659004745 658562851 658195496 658537827 658182678
3986.7 658182678 657734070 657830048 658639679 658770370 658362427 657984772 657552261 657967911 658164978 657873993
3996.3F57873993J3428M05960O16531M35867
4000.2F59345779
$$ plain form
3996.3 657873993 657887421 658293381 658909912 659345779
4000.2 659345779
##END=$$ End of the data block
