##TITLE=$$ Begin of the data block
##JCAMP-DX=5.00 $$ ACD/SpecManager v 10.08
##SPECTROMETER/DATA SYSTEM=Varian
##DATE=15 Jan 2013 15:51:26
##DATA TYPE=INFRARED SPECTRUM
##DATA CLASS=XYDATA
##ORIGIN=
##OWNER=
##NPOINTS=3735
##FIRSTX=399.26403809
##LASTX=4000.35498047
##MAXX=4000.35498047
##MINX=399.26403809
##MAXY=76.37790680
##MINY=41.02391434
##XFACTOR=1.0000000000
##YFACTOR=0.000000100000000
##FIRSTY=63.52097702
##DELTAX=0.96440572
##XUNITS=1/CM
##YUNITS=TRANSMITTANCE
##XYDATA=(X++(Y..Y))
$$ plain form
399.3 635209770 640184708 645285645 640813980 628140030 616947861 615688286 625184059 640055313
407 640055313 639247017 633794327 629988060 626150970 627766914 631335526 626665802 614086494 615498734
415.7 615498734 623936882 626744308 621196823 614943771 623142624 619731331 614938240 615267906 618063087
424.3 618063087 623945389 627098732 623606682 622182083 627662201 627823715 622071724 614617996 608460808
433 608460808 608292007 609449081 611609116 622954483 632866058 626437988 617700157 617039871 614667854
441.7 614667854 610016632 610448227 622386436 627141647 622691269 624594460 626374283 622382431
449.4 622382431 615176048 613820267 613675804 608363533 610308723 618756027 625234261 619970741 610401115
458.1 610401115 613326263 612429619 609512444 609013748 608001251 609032059 613379135 616701469 617248726
$$ packed form
399.3F35209770M974938N100937m471665j2673950j1192169j259575R495773J4871254
407F40055313q08296n452690l806267l837090J615944L568612m669724j2579308J412240
415.7F15498734Q438148K807426n547485o253052Q198853l411293m793091L29666K795181
424.3F18063087N882302L153343l492050j424599N480118J61514n751991p453728o157188
433F08460808j68801J157074K160035J1345367R911575o428070q737831o60286k372017
441.7F14667854m651222M31595J1938209M755211m450378J903191J779823l991852
449.4F22382431p206383j355781j44463n312271J945190Q447304O478234n263520r569626
458.1F10401115K925148q96644k917175m98696j012497J030808M347076L322334N47257
$$ plain form
466.8 617248726 615227051 615147858 614013100 608304405 605262451 608586349 612331963 610481834 608202705
475.5 608202705 612151985 615132790 607568474 601814461 604888763 603576698 602170715 607314186
483.2 607314186 610635300 607248802 604207993 604655533 601855965 599471092 600840950 604236526 609482803
491.8 609482803 611834335 613007736 611437263 611038208 607817039 600060577 599106903 599925308 604724693
500.5 604724693 612208290 609900360 604006081 601281395 602310410 602960930 600518799 600027657 599315872
509.2 599315872 599662971 602003937 603923264 604797401 603025017 599299278 596461105 594876213 594874496
517.9 594874496 596205559 598407936 600165138 600310593 600612259 600256386 597088013 591403236 587611580
526.6 587611580 589370995 591937904 595162811 597879562 597307358 595985336 592819862 588337479 585472183
$$ packed form
466.8F17248726k021675p9193j134758n708695l041954L323898L745614j850129k279129
475.5F08202705L949280K980805p564316n754013L074302j312065j405983N143471
483.2F07314186L321114l386498l040809M47540k799568k384873J369858L395576N246277
491.8F09482803K351532J173401j570473l99055l221169p756462r53674Q18405M799385
500.5F04724693P483597k307930n894279k724686J029015O50520k442131m91142p11785
509.2E99315872L47099K340966J919327Q74137j772384l725739k838173j584892j717
517.9E94874496J331063K202377J757202J45455L01666l55873l168373n684777l791656
526.6E87611580J759415K566909L224907K716751n72204j322022l165474m482383k865296
$$ plain form
535.2 585472183 583310318 583867035 586970901 590935402 594490204 596687927 597317200 595676880 592175713
543.9 592175713 588701897 588088455 589671478 590935860 591369553 593406029 597347221 597954445 596089401
552.6 596089401 593585243 590804749 589139137 587996483 589828491 593285904 594831429 595321541 596380005
561.3 596380005 596930122 594001083 592163010 591601753 589966278 591930237 596072464 598430138 600209885
570 600209885 601536865 600802574 598474350 594323845 591441994 591906662 592845688 594467392 594686165
578.6 594686165 595027924 596600418 595455627 593914833 591555328 589296684 589537010 591307564 592919312
587.3 592919312 593254700 593568611 592916908 591698914 590404625 588551140 586316681 584618874 584179420
596 584179420 584227638 586517448 588272095 587362442 585921898 583821640 582450180 580694199 579167595
$$ packed form
535.2E85472183k161865N56717L103866L964501L554802K197723O29273j640320l501167
543.9E92175713l473816o13442J583023J264382M33693K036476L941192O07224j865044
552.6E96089401k504158k780494j665612j142654J832008L457413J545525M90112J058464
561.3E96380005N50117k929039j838073n61257j635475J963959M142227K357674J779747
570F00209885J326980p34291k328224m150505k881851M64668R39026J621704K18773
578.6E94686165L41759J572494j144791j540794k359505k258644K40326J770554J611748
587.3E92919312L35388L13911o51703j217994j294289j853485k234459j697807m39454
596E84179420M8218K289810J754647r09653j440544k100258j371460j755981j526604
$$ plain form
604.7 579167595 580623207 581683464 582296791 584553833 586169357 586931572 587593269 586967316 586496887
613.4 586496887 586805840 587242737 587057533 586247864 586971931 588123016 588688774 588200836 587374077 587544899
623 587544899 587060585 586756096 587532883 588625183 589363289 589430504 589898109 589754982 588856506 589050560
632.7 589050560 589870567 590035324 589811554 589894867 590446968 590466347 590661469 591701622 591605530 591571045
642.3 591571045 592104187 592655754 593872490 594484253 594757271 594887733 594123726 593505363 594249344 595272751
651.9 595272751 596592407 598563576 599267693 598709335 597960701 597557564 595895996 594202881 594131088
660.6 594131088 593851471 593847351 594875069 596306419 596479378 596088219 590396194 570811119 581819954
669.3 581819954 589719963 592452736 593197784 593794861 595366516 595931358 595681953 594245720 592921677
$$ packed form
604.7E79167595J455612J060257O13327K257042J615524P62215O61697o25953m70429
613.4E86496887L08953M36897j85204q09669P24067J151085N65758m87938q26759J70822
623E87544899m84314l04489P76787J092300P38106O7215M67605j43127q98476J94054
632.7E89050560Q20007J64757k23770Q3313N52101J9379J95122J040153r6092l4485
642.3E91571045N33142N51567J216736O11763K73018J30462p64007o18363P43981J023407
651.9E95272751J319656J971169P04117n58358p48634m03137j661568j693115p1793
660.6E94131088k79617m120J027718J431350J72959l91159n692025j9585075J1008835
669.3E81819954P900009K732773P45048N97077J571655N64842k49405j436233j324043
$$ plain form
678 592921677 592685432 592806358 593261147 593911057 596703606 600051842 602508392 603662453 604406967
686.7 604406967 605071487 602900772 600709648 600654335 602263756 605448380 608793030 611336632 612775192
695.3 612775192 613616867 613438950 612413406 611267433 611119957 612846603 614828873 616233215 619102783
704 619102783 622645035 623715401 623134193 621875534 621240005 621764908 623321457 625346222 626339722
712.7 626339722 628351059 630050316 630647507 631731148 631870537 630756111 628420753 627104912 628903160
721.4 628903160 632138672 635325127 637647781 638856316 639194489 639255066 638791161 638001900 637911568
730.1 637911568 639295197 641132736 643350372 645757523 647118225 647282486 646234589 646214676 645834351
738.7 645834351 644830627 645638733 647107773 648461914 649167328 650310898 650835648 650631409 650035934
$$ packed form
678E92921677k36245J20926M54789O49910K792549L348236K456550J154061P44514
686.7F04406967O64520k170715k191124n5313J609421L184624L344650K543602J438560
695.3F12775192Q41675j77917j025544j145973j47476J726646J982270J404342K869568
704F19102783L542252J070366n81208j258659o35529N24903J556549K024765R93500
712.7F26339722K011337J699257N97191J083641J39389j114426k335358j315841J798248
721.4F28903160L235512L186455K322654J208535L38173O0577m63905p89261r0332
730.1F37911568J383629J837539K217636K407151J360702J64261j047897j9913l80325
738.7F45834351j003724Q08106J469040J354141P05414J143570N24750k04239n95475
$$ plain form
747.4 650035934 647884064 647101517 648035812 648981476 648125763 647335129 648125076 648202286 647870789 646069107
757.1 646069107 644309616 644257202 644178009 643102646 641722794 641219406 640598526 640491638 640998688 641131363
766.7 641131363 640542908 639722214 640011215 640168457 640734940 641769714 641561432 642052841 643928757
775.4 643928757 644657822 644806519 646458969 648004532 648580704 649649887 650922775 650896378 650265121
784.1 650265121 650711136 652441635 653185349 653103485 654831696 656070328 656179581 655905762 655821152 656130295
793.7 656130295 655311050 654044189 651840820 651052704 651062851 650358353 650158157 648852692 647361603
802.4 647361603 645229034 643612213 642822876 642045822 641977081 642017899 643620529 644948654 645927200
811.1 645927200 647549667 649490662 651437073 652840652 656354752 660511017 664527512 667838669
$$ packed form
747.4F50035934k151870p82547R34295R45664q55713p90634P89947P7210l31497j801682
757.1F46069107j759491n2414p9193j075363j379852n03388o20880j06888N07050J32675
766.7F41131363n88455q20694K89001J57242N66483J034774k08282M91409J875916
775.4F43928757P29065J48697J652450J545563N76172J069183J272888k6397o31257
784.1F50265121M46015J730499P43714q1864J728211J238632J09253k73819q4610L09143
793.7F56130295q19245j266861k203369p88116J0147p04498k00196j305465j491089
802.4F47361603k132569j616821p89337p77054o8741M0818J602630J328125R78546
811.1F45927200J622467J940995J946411J403579L514100M156265M016495L311157
$$ plain form
818.8 667838669 671177902 675440598 677795486 679427338 680547333 681682968 681242447 681233215 683141403
827.5 683141403 683443222 683955917 683820038 682770081 681506577 680925064 681167603 681511765 683340225
836.1 683340225 685380249 688388138 691708832 693945007 695507431 696574783 696613235 696226044 697025528
844.8 697025528 697102814 697353897 697729416 698975525 700715561 701189651 701388474 699984207 699354248
853.5 699354248 698914032 698375549 698308792 697434235 696929550 695736389 694910507 693872299 691813126
862.2 691813126 688858032 685934067 683563309 680028763 677472992 676197281 675358887 674512558 673198395
870.9 673198395 671036453 668719711 667684860 666203690 665291748 664588776 663447800 662960205 662956924
879.5 662956924 664190216 664489746 663431168 662409439 661499252 660682526 660302048 660272217 659346085
$$ packed form
818.8F67838669L339233M262696K354888J631852J119995J135635m40521r232J908188
827.5F83141403L01819N12695j35879j049957j263504n81513K42539L44162J828460
836.1F83340225K040024L007889L320694K236175J562424J067352L8452l87191P99484
844.8F97025528P7286K51083L75519J246109J740036M74090J98823j404267o29959
853.5F99354248m40216n38483o6757q74557n04685j193161q25882j038208k059173
862.2F91813126k955094k923965k370758l534546k555771j275711q38394q46329j314163
870.9F73198395k161942k316742j034851j481170r11942p02972j140976m87595l281
879.5F62956924J233292K99530j058578j021729r10187q16726l80478k9831r26132
$$ plain form
888.2 659346085 658377991 658479156 658865433 657843704 657034683 657411804 657114944 656569977 656085968 656381302
897.9 656381302 657038193 657118225 657126770 656770248 656077042 656496124 657367325 657400818 658676529 659733810
907.5 659733810 659606628 659409714 658693314 658292999 658940125 661570740 663770599 665599365 668001328
916.2 668001328 669298935 670591431 671336441 671853104 672107544 672645187 673058090 672814255 673256149
924.9 673256149 673469696 673914871 673398361 672830582 671966248 670070801 669303818 668365860 667884216 667446060
934.5 667446060 666409073 665451279 664667511 662828751 659862747 657975464 655492554 653272781 651752396
943.2 651752396 649724045 647318497 644494247 642035904 639444504 637225876 634242210 630794373
950.9 630794373 627905998 625147743 623251877 621324463 620099602 618879547 617238503 615582428
$$ packed form
888.2F59346085r68094J01165L86277j021729q09021L77121k96860n44967m84009K95334
897.9F56381302O56891Q0032Q545l56522o93206M19082Q71201L3493J275711J057281
907.5F59733810j27182j96914p16400m00315O47126K630615K199859J828766K401963
916.2F68001328J297607J292496P45010N16663K54440N37643M12903k43835M41894
924.9F73256149K13547M45175n16510n67779q64334j895447p66983r37958m81644m38156
934.5F67446060j036987r57794p83768j838760k966004j887283k482910k219773j520385
943.2F51752396k028351k405548k824250k458343k591400k218628k983666l447837
950.9F30794373k888375k758255j895866j927414j224861j220055j641044j656075
$$ plain form
958.6 615582428 613011284 611803055 611403503 610518379 610484314 611305847 611847267 612660141 614281235
967.3 614281235 614492836 614158211 613852081 613254051 613169098 613084030 613404503 614151230 614872246 614353867
976.9 614353867 612529678 610778275 608942375 605787163 602222862 600348587 598288536 595592537
984.7 595592537 593690872 591429749 588773994 585953827 582746468 578811340 574972992 572409668
992.4 572409668 569815826 567876129 566769905 565039673 562529755 559102974 555592422 551987343
1000.1 551987343 548398590 545041428 541660423 539183540 537706642 536223984 534236565 531949005
1007.8 531949005 528860931 525865326 522975235 520283775 518780708 517608719 517206383 516303444 514738731
1016.5 514738731 513519592 511960564 510323639 509026642 507345123 505106468 504460793 504537354 504537621
$$ packed form
958.6F15582428k571144j208229l99552q85124l4065Q21533N41420Q12874J621094
967.3F14281235K11601l34625l06130n98030q4953q5068L20473P46727P21016n18379
976.9F14353867j824189j751403j835900l155212l564301j874275k060051k695999
984.7E95592537j901665k261123k655755k820167l207359l935128l838348k563324
992.4E72409668k593842j939697j106224j730232k509918l426781l510552l605079
1000.1E51987343l588753l357162l381005k476883j476898j482658j987419k287560
1007.8E31949005l088074k995605k890091k691460j503067j171989m02336r02939j564713
1016.5E14738731j219139j559028j636925j296997j681519k238655o45675P6561K67
$$ plain form
1025.2 504537621 503907738 502862053 502969742 501809921 500036545 499416695 499444084 498768539 498260918
1033.8 498260918 498878937 499126587 499785156 500107765 500217018 500081024 500326080 500816269 500429726 501135063
1043.5 501135063 501991005 502041473 500711594 500126762 500735855 500395813 499444199 498329353 498702774
1052.2 498702774 498553696 498998680 499873390 499529266 499527855 499224815 499728050 499201012 498679733 498439522
1061.8 498439522 498411827 499508553 499036446 499088402 499350471 499807243 499300652 498269386 498700981 498522987
1071.5 498522987 498526268 498101959 498993034 500222816 500356407 500052185 499798737 501201172 501830177 502283936
1081.1 502283936 501779861 501546860 502598648 502991219 503660164 503675575 503500366 502303123 501427345
1089.8 501427345 500805740 500183334 500745125 499918594 499335480 498282738 496602974 495319214 494285355
$$ packed form
1025.2E04537621o29883j045685J07689j159821j773376o19850K7389o75545n07621
1033.8D98260918O18019K47650O58569L22609J09253j35994K45056M90189l86543P05337
1043.5E01135063Q55942N0468j329879n84832O09093l40042r51614j114846L73421
1052.2D98702774j49078M44984Q74710l44124j411l03040N03235n27038n21279k40211
1061.8D98439522k7695J096726m72107N1956K62069M56772n06591j031266M31595j77994
1071.5D98522987L281m24309Q91075J229782J33591l04222k53448J402435O29005M53759
1081.1E02283936n04075k33001J051788L92571O68945J5411j75209j197243q75778
1089.8E01427345o21605o22406N61791q26531n83114j052742j679764j283760j033859
$$ plain form
1098.5 494285355 493622551 493071899 494346657 495963058 497921333 499569664 500667915 501796570 502789345
1107.1 502789345 503929443 505304413 507700653 508953285 510851021 513429756 514989700 516497459
1114.9 516497459 517942276 519914665 521541328 523974304 526158409 528222008 530742073 532546883
1122.6 532546883 534842491 536474915 537651024 538516808 539850960 541302872 542010956 543499184 545667992
1131.2 545667992 548243980 549624176 550579262 550857773 550181122 550235329 550700798 551863632 552167587
1139.9 552167587 552382812 552937431 553062019 553284645 552588768 551986465 551444931 551247177 551349754 550779953
1149.6 550779953 550867729 551560669 552160530 552866554 553504066 553041077 552740631 553213882 553860130 555187454
1159.2 555187454 556444664 557351532 558307037 559787254 561037064 562004166 563025246 564233551 566063805
$$ packed form
1098.5D94285355o62804n50652J274758J616401J958275J648331J098251J128655R92775
1107.1E02789345J140098J374970K396240J252632J897736K578735J559944J507759
1114.9E16497459J444817J972389J626663K432976K184105K063599K520065J804810
1122.6E32546883K295608J632424J176109Q65784J334152J451912P08084J488228K168808
1131.2E45667992K575988J380196R55086K78511o76651N4207M65469J162834L03955
1139.9E52167587K15225N54619J24588K22626o95877o02303n41534j97754J02577n69801
1149.6E50779953Q7776O92940N99861P06024O37512m62989l00446M73251O46248J327324
1159.2E55187454J257210R06868R55505J480217J249810R67102J021080J208305J830254
$$ plain form
1167.9 566063805 567876244 570188713 573193321 576451645 578738785 580414543 582416611 584582481
1175.6 584582481 587075691 589462242 592676010 595874329 598092155 599906998 601671104 603656235
1183.3 603656235 605148468 606403427 608320198 610438118 612137909 614695282 617582817 619311562
1191 619311562 619801369 620044594 620955353 621328392 621412010 621075745 620198288 619667053 619371758 618794060
1200.7 618794060 617536812 616500359 615601234 613536568 610474472 607666588 605246582 603084679
1208.4 603084679 600890923 598472481 596095734 593493118 590534134 587243996 584075623 581021690
1216.1 581021690 578002701 575412292 572815208 569993896 567587051 565430145 563667603 561906738
1223.8 561906738 559626770 557522621 555526428 554411240 553000336 550729103 548804550 547122955
$$ packed form
1167.9E66063805J812439K312469L004608L258324K287140J675758K002068K165870
1175.6E84582481K493210K386551L213768L198319K217826J814843J764106J985131
1183.3F03656235J492233J254959J916771K117920J699791K557373K887535J728745
1191F19311562M89807K43225R10759L73039Q3618l36265q77457n31235k95295n77698
1200.7F18794060j257248j036453q99125k064666l062096k807884k420006k161903
1208.4F03084679k193756k418442k376747k602616k958984l290138l168373l053933
1216.1E81021690l018989k590409k597084k821312k406845k156906j762542j760865
1223.8E61906738k279968k104149j996193j115188j410904k271233j924553j681595
$$ plain form
1231.5 547122955 545927277 544661179 544085999 543500404 542671623 541869659 540540314 540077171 539494171
1240.2 539494171 538590355 537820091 537576714 537696915 537567863 537926979 538116608 538022346 537754059 537868195
1249.9 537868195 537834969 537733421 538270721 538907585 540036049 540677528 541090126 541708565 542223396 542322426
1259.5 542322426 542423630 543102608 543514557 544476471 545605202 546981888 548571243 550151520 551603813
1268.2 551603813 552107887 553080101 554387207 555487061 556220512 557616005 559903755 561789589 563802681
1276.9 563802681 565627823 567186699 568245735 569092789 569939919 571219482 573404961 575223198 577066231
1285.5 577066231 579182320 581183205 582369614 582941856 583377304 583523674 584112968 584970245 585811501
1294.2 585811501 586924248 588398666 589294701 589361496 589317131 588616753 587261429 586251678 585937233
$$ packed form
1231.5E47122955j195678j266098n75180n85595q28781q01964j329345m63143n83000
1240.2E39494171r03816p70264k43377J20201j29052L59116J89629r4262k68287J14136
1249.9E37868195l3226j01548N37300O36864J128464O41479M12598O18439N14831R9030
1259.5E42322426J01204O78978M11949R61914J128731J376686J589355J580277J452293
1268.2E51603813N04074R72214J307106J099854P33451J395493K287750J885834K013092
1276.9E63802681J825142J558876J059036Q47054Q47130J279563K185479J818237J843033
1285.5E77066231K116089K000885J186409N72242M35448J46370N89294Q57277Q41256
1294.2E85811501J112747J474418Q96035O6795m4365p00378j355324j009751l14445
$$ plain form
1302.9 585937233 586250496 586769257 586946907 586922035 586403389 585200119 583813553 581796951 579646339
1311.6 579646339 578281250 577151718 576000252 575251884 574445610 573294792 572261620 571140175 571161003
1320.3 571161003 572688370 574397125 576594200 578795242 581286354 583396873 584250221 584994011 585261154
1328.9 585261154 584610825 583556290 583188171 583724556 584996071 587303009 589537811 591210251 592541885
1337.6 592541885 593933792 595026627 595936203 597011986 598093185 599538078 601398926 602509422
1345.3 602509422 603355255 604719124 604920387 604191818 603018723 602027397 600768929 599550667 598867836
1354 598867836 597348595 596238098 595049248 592534447 589308891 586554146 583253441 579404335 576092720
1362.7 576092720 572363968 570468826 568778343 566185188 563486252 560392075 557728157 555904121
$$ packed form
1302.9E85937233L13263N18761J77650k4872n18646j203270j386566k016602k150612
1311.6E79646339j365089j129532j151466p48368q06274j150818j033172j121445K0828
1320.3E71161003J527367J708755K197075K201042K491112K110519Q53348P43790K67143
1328.9E85261154o50329j054535l68119N36385J271515K306938K234802J672440J331634
1337.6E92541885J391907J092835R09576J075783J081199J444893J860848J110496
1345.3F02509422Q45833J363869K01263p28569j173095r91326j258468j218262o82831
1354E98867836j519241j110497j188850k514801l225556k754745l300705l849106l311615
1362.7E76092720l728752j895142j690483k593155k698936l094177k663918j824036
$$ plain form
1370.4 555904121 554526443 554140663 553858910 552937546 552643852 553148499 553365288 553153267 553184013 553457947
1380.1 553457947 554305992 554817390 555037842 555821457 556806984 557815018 558115082 558430710 559842758
1388.7 559842758 561482582 562977676 564614296 565940590 566730690 567135544 567175179 567933388 567541389
1397.4 567541389 566918678 565829468 565920677 567263832 567255630 567184258 566772156 564987488 563815498 563413925
1407.1 563413925 562808189 561821289 561272850 560960464 560997887 561092110 561347046 561050797 560219841 559354630
1416.7 559354630 557869186 557978516 554901085 554208450 555930252 556247482 555570259 553628731 553921623
1425.4 553921623 553641014 552403870 552149849 551284943 550001411 549714661 551168823 551187859 550748024
1434.1 550748024 551386490 551157379 548065834 546579018 548481750 549031105 549861679 551359863 552324905
$$ packed form
1370.4E55904121j377678l85780k81753r21364k93694N04647K16789k12021L0746K73934
1380.1E53457947Q48045N11398K20452P83615R85527J008034L00064L15628J412048
1388.7E59842758J639824J495094J636620J326294P90100M04854L9635P58209l91999
1397.4E67541389o22711j089210R1209J343155q202p1372m12102j784668j171990m01573
1407.1E63413925o05736r86900n48439l12386L7423R4223K54936k96249q30956q65211
1416.7E59354630j485444J09330l077431o92635J721802L17230o77223j941528K92892
1425.4E53921623k80609j237144k54021q64906j283532k86750J454162J9036m39835
1434.1E50748024O38466k29111l091545j486816J902732N49355Q30574J498184R65042
$$ plain form
1442.7 552324905 553994064 554545212 555851326 556335831 556403465 556920090 558808899 561427612 562472839
1451.4 562472839 564890404 566520653 568448296 569803963 569901848 568729744 565226974 569833374 572785950
1460.1 572785950 576860199 579300232 581537285 584914742 584722748 588163300 590960464 594397583
1467.8 594397583 597614555 601086464 605509491 608094559 612140236 615273666 620904922 624743500
1475.5 624743500 626603203 629937325 633637199 637223129 639624672 642899933 646033936 649144135
1483.2 649144135 651642075 652827225 653801422 653378220 654574356 656363525 656951294 658790359 661615829
1491.9 661615829 664096909 664752731 665329208 664559174 659917221 661914902 662420502 662370377 664636688
1500.6 664636688 665569153 665189590 664882126 665890579 665575638 654345627 647900238 652312698 655197678
$$ packed form
1442.7E52324905J669159N51148J306114M84505O7634N16625J888809K618713J045227
1451.4E62472839K417565J630249J927643J355667R7885j172104l502770M606400K952576
1460.1E72785950M074249K440033K237053L377457j91994L440552K797164L437119
1467.8E94397583L216972L471909M423027K585068M045677L133430N631256L838578
1475.5F24743500J859703L334122L699874L585930K401543L275261L134003L110199
1483.2F49144135K497940J185150R74197m23202J196136J789169N87769J839065K825470
1491.9F61615829K481080O55822N76477p70034m641953J997681N05600n0125K266311
1500.6F64636688R32465l79563l07464J008453l14941j1230011o445389M412460K884980
$$ plain form
1509.3 655197678 655349274 656529541 655844421 654047470 653581161 651436081 649440918 646413803 644084320
1518 644084320 645392456 646676788 642867508 638812866 639660530 640235748 640101624 635301514 634820061
1526.6 634820061 634300919 632610283 632303886 631824532 630485649 627638664 625480423 619787521 619858284
1535.3 619858284 618849487 616893654 617137985 610071564 604602776 600940475 598567238 595438538
1543 595438538 595032349 592070999 586257858 586431656 583521233 581884499 577745094 571706276 569736252
1551.7 569736252 566678772 565046349 556702156 553674889 553463326 554608307 552705803 534208031
1559.4 534208031 538295441 539275169 542120705 541759453 541209335 539713707 539254913 540617790 540178413
1568.1 540178413 541196060 536462059 538152962 539481964 538497353 538037415 536973076 536950989 530538330
$$ packed form
1509.3F55197678J51596J180267o85120j796951m66309k145080j995163l027115k329483
1518F44084320J308136J284332l809280m054642Q47664N75218j34124m800110m81453
1526.6F34820061n19142j690636l06397m79354j338883k846985k158241n692902P0763
1535.3F19858284j008797j955833K44331p066421n468788l662301k373237l128700
1543E95438538m06189k961350n813141J73798k910423j636734m139405o038818j970024
1551.7E69736252l057480j632423q344193l027267k11563J144981j902504j8497772
1559.4E34208031M087410R79728K845536l61252n50118j495628m58794J362877m39377
1568.1E40178413J017647m734001J690903J329002r84611m59938j064339k2087o412659
$$ plain form
1576.8 530538330 533166275 534587975 534628487 534255486 532307358 531974182 530361900 529852867 529109001
1585.5 529109001 528895569 528654785 527575760 527591782 526091728 526027069 525163651 524809189 523680840
1594.1 523680840 521937752 522011871 520945892 521512451 521058273 521175690 520819168 520236855 520130959
1602.8 520130959 518490486 518799744 518472023 518892136 518628006 518895988 518929367 517553291 518309479
1611.5 518309479 517628098 517683792 517245522 518234253 519387093 514608002 516608467 517520447 518504791
1620.2 518504791 517884026 518421898 517943192 514849014 517352180 518516197 520131493 519687805 519895096
1628.9 519895096 520954704 521065979 521664581 521741562 523588982 524629669 521588211 523095741 525896149
1637.5 525896149 527809372 529263496 530869102 531398773 532863350 534043961 536044426 538340912
$$ packed form
1576.8E30538330K627945J421700M0512l73001j948128l33176j612282n09033p43866
1585.5E29109001k13432k40784j079025J6022j500054o4659q63418l54462j128349
1594.1E23680840j743088P4119j065979N66559m54178J17417l56522n82313j05896
1602.8E20130959j640473L09258l27721M20113k64130K67982L3379j376076P56188
1611.5E18309479o81381N5694m38270R88731J152840m779091K000465R11980R84344
1620.2E18504791o20765N37872m78706l094178K503166J164017J615296m43688K07291
1628.9E19895096J059608J11275N98602P6981J847420J040687l041458J507530K800408
1637.5E25896149J913223J454124J605606N29671J464577J180611K000465K296486
$$ plain form
1645.3 538340912 538286781 539189911 540015259 543045120 545644264 548366508 550637207 543047104 541038094
1653.9 541038094 548766479 553994522 556736069 558852577 561028366 562775536 564271545 565963249
1661.6 565963249 567065773 567829628 571213264 574325867 576558380 579301300 581821442 581999550 583429413
1670.3 583429413 585645370 587018204 589719658 593279266 594510765 594889450 598571129 601599579
1678 601599579 603841324 605004578 605863724 608329506 610791054 610486984 608274078 613215408 617188644
1686.7 617188644 619800301 620332336 621515961 621783600 622727051 624326935 624478188 626242638 626688347
1695.4 626688347 622448959 623586159 625561905 628642921 625444603 617557602 619884338 621332779
1703.1 621332779 619753532 616915245 615571136 612000580 609918747 608173103 604879074 600345154
$$ packed form
1645.3E38340912n4131R03130Q25348L029861K599144K722244K270699p590103k009010
1653.9E41038094P728385N228043K741547K116508K175789J747170J496009J691704
1661.6E65963249J102524P63855L383636L112603K232513K742920K520142J78108J429863
1670.3E83429413K215957J372834K701454L559608J231499L78685L681679L028450
1678F01599579K241745J163254Q59146K465782K461548l04070k212906M941330L973236
1686.7F17188644K611657N32035J183625K67639R43451J599884J51253J764450M45709
1695.4F26688347m239388J137200J975746L081016l198318p887001K326736J448441
1703.1F21332779j579247k838287j344109l570556k081833j745644l294029m533920
$$ plain form
1710.8 600345154 597353401 594803772 592317734 588004608 582519722 581509018 578101692 569196167
1718.5 569196167 568408318 567980614 565988197 563276443 560444489 557800941 556151276 554531059 552554512
1727.2 552554512 550723000 549595184 546081200 543499451 543752861 543714256 539882278 533957062 537064247
1735.9 537064247 538597717 538843613 538957977 536843452 534382324 536236229 537702332 536029739 536930313
1744.6 536930313 538607483 540318375 541085281 541059990 542388115 544794884 547406502 548851891 554023933
1753.3 554023933 557777328 561143837 565250969 568094559 573856621 579105263 585405807 591071663
1761 591071663 596262016 603049736 610150948 617407188 623846207 631070480 637153053 643257599 649467850
1769.7 649467850 655644760 660848541 664577332 669481583 675170517 680862808 683617630 687928848
$$ packed form
1710.8F00345154k991753k549629k486038m313126n484886j010704l407326q905525
1718.5E69196167p87849m27704j992417k711754k831954k643548j649665j620217j976547
1727.2E52554512j831512j127816l513984k581749K53410l8605l831978n925216L107185
1735.9E37064247J533470K45896J14364k114525k461128J853905J466103j672593R00574
1744.6E36930313J677170J710892P66906k5291J328125K406769K611618J445389N172042
1753.3E54023933L753395L366509M107132K843590N762062N248642O300544N665856
1761E91071663N190353O787720P101212P256240O439019P224273O082573O104546O210251
1769.7F49467850O176910N203781L728791M904251N688934N692291K754822M311218
$$ plain form
1777.4 687928848 691480331 694484406 697229614 698134613 701653519 704699326 707530136 708430481 709301758
1786 709301758 711668930 712895813 714569244 716273422 717818375 718718491 717130356 718342819 722419662
1794.7 722419662 724208984 723364105 724397125 725904999 726352234 725990601 728051376 728977432 729723892
1803.4 729723892 731865234 732315063 733080902 732961121 732252274 733488159 734563217 734435654 735636215
1812.1 735636215 737379913 738129272 738984070 739043884 739310608 738933411 738757935 739771652 740113220
1820.8 740113220 741453629 742196121 743721466 745153427 742061081 742021866 743779678 745202026 744763184
1829.4 744763184 741558380 743511887 746545486 747907944 748535995 748673630 748527756 748137894 747676315
1838.1 747676315 748638306 749338837 750167084 750878296 752096939 753193436 748716049 750091324 752328568
$$ packed form
1777.4F87928848L551483L004075K745208R04999L518906L045807K830810R00345Q71277
1786G09301758K367172J226883J673431J704178J544953R00116j588135J212463M076843
1794.7G22419662J789322q44879J033020J507874M47235l61633K060775R26056P46460
1803.4G29723892K141342M49829P65839j19781p08847J235885J075058j27563J200561
1812.1G35636215J743698P49359Q54798N9814K66724l77197j75476J013717L41568
1820.8G40113220J340409P42492J525345J431961l092346l9215J757812J422348m38842
1829.4G44763184l204804J953507L033599J362458O28051J37635j45874l89862m61579
1838.1G47676315R61991P00531Q28247P11212J218643J096497m477387J375275K237244
$$ plain form
1846.8 752328568 751711807 751046677 751757584 752919312 753150406 754190521 755024338 755612106 755769501
1855.5 755769501 754958420 754849319 754247284 754228516 754755020 755651398 756478271 756840286 757346191 757282181
1865.1 757282181 757243423 756633835 756313477 755061188 754655075 756734467 758081894 758856888 758998871
1873.8 758998871 759016800 758664932 758526688 758503189 758284149 758681030 758891449 759510422 759711456 760149841
1883.4 760149841 760307999 759545517 759332123 759079208 760064011 759777298 758079910 759311905 760429153
1892.1 760429153 760468903 760845337 760720062 759479065 759677887 760048523 760285950 760637589 760672150 761226883
1901.8 761226883 761424637 761620941 761178589 760662155 760576019 759844131 759661331 760031433 760424881 761073761
1911.4 761073761 762080078 762178802 761793900 761287384 761339417 762270966 760410767 759952469 761551819
$$ packed form
1846.8G52328568o16761o65130P10907J161728K31094J040115Q33817N87768J57395
1855.5G55769501q11081j09101o02035j8768N26504Q96378Q26873L62015N05905o4010
1865.1G57282181l8758o09588l20358j252289m06113K079392J347427P74994J41983
1873.8G58998871J7929l51868j38244k3499k19040L96881K10419O18973K01034M38385
1883.4G60149841J58158p62482k13394k52915R84803k86713j697388J231995J117248
1892.1G60429153L9750L76434j25275j240997J98822L70636K37427L51639L4561N54733
1901.8G61226883J97754J96304m42352n16434q6136p31888j82800L70102L93448O48880
1911.4G61073761J006317R8724l84902n06516N2033R31549j860199m58298J599350
$$ plain form
1920.1 761551819 762554092 763086472 761833115 761310577 761666183 761606598 761562881 761458588 761504135 762193146
1929.7 762193146 762933044 762890930 762737045 762473221 762292328 761680832 761282883 761373520 761470032 762268829
1939.4 762268829 762869949 763779068 763274841 761223907 761349182 761530380 761343842 761143875 761562119
1948.1 761562119 762090073 762315598 762567749 762588196 762579880 762344666 761894302 761136169 761155396 761357727
1957.7 761357727 761532669 762262878 762202301 762122574 762096710 761920853 761534500 761148300 760947800 760086060
1967.3 760086060 759992599 760905609 761988449 762302704 762395477 762424545 761546326 760630112 760051880 760269699
1977 760269699 760671616 761119843 761644516 761958008 762369308 762185364 761756058 760968704 760247498 760131836
1986.6 760131836 760063553 760102692 760742950 761804276 761586685 760518112 760189743 760100098 759594879 758874969
$$ packed form
1920.1G61551819J002273N32380j253357n22538L55606n9585m3717j04293M5547O89011
1929.7G62193146P39898m2114j53885k63824j80893o11496l97949R0637R6512P98797
1939.4G62268829O01120R09119n04227k050934J25275J81198j86538j99967M18244
1948.1G61562119N27954K25525K52151K0447q316k35214m50364p58133J9227K02331
1957.7G61357727J74942P30209o0577p9727k5864j75857l86353l86200k00500q61740
1967.3G60086060r3461R13010J082840L14255R2773K9068q78219r16214n78232K17819
1977G60269699M01917M48227N24673L13492M11300j83944m29306p87354p21206j15662
1986.6G60131836o8283L9139O40258J061326k17591j068573l28369q9645n05219p19910
$$ plain form
1996.3 758874969 759119720 759830627 760563126 761002731 761011429 760986710 760723267 760228119 759660645 759213486
2005.9 759213486 758950806 759081650 759164047 759304199 759966812 760504303 760360641 759673615 759244156 758922348
2015.6 758922348 758301315 757795639 758149033 758720322 758983459 759437866 759393234 758826828 758124161 757820053
2025.2 757820053 757867737 758140335 758394089 758132706 758754196 759034195 758360291 757898636 757563629 757461624
2034.9 757461624 757051315 757003784 757203522 757545853 758141632 758191757 757603836 756738510 756573944 756452255
2044.5 756452255 756337891 756467438 756618042 756997681 757249451 757395248 756936722 756557465 756441956 756239777
2054.1 756239777 756313629 756428909 756483231 756466827 756934662 756914902 756490021 756437378 756076279 755727997
2063.8 755727997 755233841 754951782 755469513 756392670 756763535 756630173 756335907 755640564 755217056 755020447
$$ packed form
1996.3G58874969K44751P10907P32499M39605Q698k4719k63443m95148n67474m47159
2005.9G59213486k62680J30844Q2397J40152O62613N37491j43662o87026m29459l21808
2015.6G58922348o21033n05676L53394N71289K63137M54407m4632n66406p02667l04108
2025.2G57820053M7684K72598K53754k61383O21490K79999o73904m61655l35007j02005
2034.9G57461624m10309m7531J99738L42331N95779N0125n87921q65326j64566j21689
2044.5G56452255j14364J29547J50604L79639K51770J45797m58526l79257j15509k02179
2054.1G56239777P3852J15280N4322j6404M67835j9760m24881n2643l61099l48282
2063.8G55727997m94156k82059N17731R23157L70865j33362k94266o95343m23508j96609
$$ plain form
2073.4 755020447 755204773 755590744 755862427 756007996 756318893 756743851 756376495 755988312 755241547 754479065
2083.1 754479065 754570007 754754639 754873886 755202789 755964584 756219406 756170425 755565567 754698792 754415894
2092.7 754415894 753911896 753987885 754373398 754684830 754944458 754894180 754799118 754638138 754335709 753445663
2102.4 753445663 752954712 752950058 753288956 753914490 754334717 754473495 753949051 753777161 753285980 752232361
2112 752232361 751610260 751414032 751353683 751457214 752481461 753250961 753541565 753139496 752055206 751296921
2121.6 751296921 750598450 750357971 750477600 751196823 751604385 751650162 752123108 752282562 751803284 750447693
2131.3 750447693 749881363 749724731 749650650 749943008 750068283 750812073 750921860 750991669 750910645 750240860
2140.9 750240860 750096359 749639664 749315338 749498825 750173950 750768967 750835495 750800858 750656204 750155640
$$ packed form
2073.4G55020447J84326L85971K71683J45569L10897M24958l67356l88183p46765p62482
2083.1G54479065R0942J84632J19247L28903P61795K54822m8981o04858q66775k82898
2092.7G54415894n03998P5989L85513L11432K59628n0278r5062j60980l02429q90046
2102.4G53445663m90951m654L38898O25534M20227J38778n24444j71890m91181j053619
2112G52232361o22101j96228o0349J03531J024247P69500K90604m02069j084290p58285
2121.6G51296921o98471k40479J19629P19223M07562M5777M72946J59454m79278j355591
2131.3G50447693n66330j56632p4081K92358J25275P43790J09787O9809q1024o69785
2140.9G50240860j44501m56695l24326J83487O75125N95017O6528l4637j44654n00564
$$ plain form
2150.6 750155640 749252930 748893738 748790894 748930511 749450073 749927292 750251846 750377350 750499344 750033188
2160.2 750033188 749474716 748947906 748687439 749058609 749444504 750052109 750341034 750206757 750066223 749957733
2169.9 749957733 749431610 748868256 748891220 748931808 749259491 749619217 750128021 750612259 750570526 750274734
2179.5 750274734 749880219 749989471 749829559 749627304 750095367 750490036 750581818 750779266 751234741 751058655
2189.1 751058655 750592270 750613480 750743790 750631027 750522842 750785065 751404266 751706696 751423569 751484070
2198.8 751484070 751328964 751005859 751100082 751224899 751512146 751887741 752471008 752476654 752061996 751912155
2208.4 751912155 751857605 751944046 751871262 751976929 752160721 752555542 753132858 753453217 753113937 752402954
2218.1 752402954 752226410 751839066 751749496 752176590 752591705 752888412 753151398 753537750 753059464 752719269
$$ packed form
2150.6G50155640r02710l59192j02844J39617N19562M77219L24554J25504J21994m66156
2160.2G50033188n58472n26810k60467L71170L85895O07605K88925j34277j40534j08490
2169.9G49957733n26123n63354K2964M0588L27683L59726N08804M84238m1733k95792
2179.5G50274734l94515J09252j59912k02255M68063L94669R1782J97448M55475j76086
2189.1G51058655m66385K1210J30310j12763j08185K62223O19201L02430k83127O0501
2198.8G51484070j55106l23105R4223J24817K87247L75595N83267N646m14658j49841
2208.4G51912155n4550Q6441p2784J05667J83792L94821N77316L20359l39280p10983
2218.1G52402954j76544l87344q9570M27094M15115K96707K62986L86352m78286l40195
$$ plain form
2227.7 752719269 752421036 751863480 752095795 752535629 753046494 753537521 754052734 754295578 754185104 753693466
2237.4 753693466 753006363 752847519 752698135 752737503 753131714 753653259 753999176 753989410 753621140 753138428
2247 753138428 752966309 752831268 753062057 753228912 753278275 753483734 753830185 754154968 753933487 753851700
2256.7 753851700 753525314 753004303 752637711 752408905 752629242 753221893 753761139 753852310 754243546 754083557
2266.3 754083557 753739166 753267975 752318115 752298431 752443619 753170013 753922806 754226074 754130707 753628082
2275.9 753628082 753536682 752988358 752932739 752857666 752628250 753061523 753942337 754394455 753586655 753346100
2285.6 753346100 752962341 752903061 752944031 752093506 751824112 751938782 752504578 752130661 751901474 751865692
2295.2 751865692 751345978 750754929 749470520 749585419 749516678 749601517 749932632 749466019 749168930 748195419
$$ packed form
2227.7G52719269k98233n57556K32315M39834N10865M91027N15213K42844j10474m91638
2237.4G53693466o87103j58844j49384L9368L94211N21545L45917r766l68270m82712
2247G53138428j72119j35041K30789J66855M9363K05459L46451L24783k21481q1787
2256.7G53851700l26386n21011l66592k28806K20337N92651N39246R1171L91236j59989
2266.3G54083557l44391m71191r49860j9684J45188P26394P52793L03268r5367n02625
2275.9G53628082r1400n48324n5619p5073k29416M33273Q80814M52118q07800k40555
2285.6G53346100l83759n9280M0970q50525k69394J14670N65796l73917k29187l5782
2295.2G51865692n19714n91049j284409J14899o8741Q4839L31115m66613k97089r73511
$$ plain form
2304.9 748195419 747512894 746157455 745359573 744593048 743615494 744184341 744238968 744630280 743758469 742751923
2314.5 742751923 742354889 741584473 741097870 739432068 738351517 737335358 736826096 736236725 735708084
2323.2 735708084 735447083 734488144 734444885 732511368 731148376 730391235 730575562 730867386 729046555
2331.9 729046555 730084763 730594025 730416107 729197617 727498322 727719193 727859039 728255234 727622528
2340.6 727622528 727718124 727602997 728136978 728195343 728068848 730086517 731618195 735133591 737369537
2349.2 737369537 736621780 734590149 731004257 727712326 725378342 722867050 719992371 718542175
2356.9 718542175 718473358 718275223 717097168 716243439 717219238 717230988 718235016 719564667 720318832
2365.6 720318832 720697174 721913452 724249039 725191193 727369232 729901428 731605148 732661057 733983765
$$ packed form
2304.9G48195419o82525j355439p97882p66525r77554N68847N4627L91312q71811j006546
2314.5G42751923l97034p70416m86603j665802j080551j016159n09262n89371n28641
2323.2G35708084k61001r58939m3259j933517j362992p57141J84327K91824j820831
2331.9G29046555J038208N09262j77918j218490j699295K20871J39846L96195o32706
2340.6G27622528R5596j15127N33981N8365j26495K017669J531678L515396K235946
2349.2G37369537p47757k031631l585892l291931k333984k511292k874679j450196
2356.9G18542175o8817j98135j178055q53729R75799J1750J004028J329651P54165
2365.6G20318832L78342J216278K335587R42154K178039K532196J703720J055909J322708
$$ plain form
2374.3 733983765 735977402 737037048 737916031 739184418 741119537 742922668 744597321 745952835
2382 745952835 746593094 747284470 747465897 747239532 746807175 746957550 747776337 748468933 749181671 749378891
2391.7 749378891 749051590 748451385 747962341 747359619 746840439 746740265 746869888 747494354 747623444 747539139
2401.3 747539139 747633133 747373505 746660919 745727997 745152893 744916687 745253067 745540237 745596466 745801544
2410.9 745801544 745967026 745829697 745306625 744820328 744109573 743786087 744008179 744370117 744664536 744660034
2420.6 744660034 744473801 743656769 743211975 743078003 742608490 742354431 742395554 742622910 742739105 743071136
2430.2 743071136 742951355 742433548 742204819 741729736 741070404 740858917 741104431 740878906 741008453 741640472
2439.9 741640472 741627884 741154785 740709610 740535583 740138245 739714050 739351654 739140549 739041061 738977509
$$ packed form
2374.3G33983765J993637J059646Q78983J268387J935119J803131J674653J355514
2382G45952835O40259O91376J81427k26365m32357J50375Q18787O92596P12738J97220
2391.7G49378891l27301o00205m89044o02722n19180j00174J29623O24466J29090q4305
2401.3G47539139R3994k59628p12586r32922n75104k36206L36380K87170N6229K05078
2410.9G45801544J65482j37329n23072m86297p10755l23486K22092L61938K94419m502
2420.6G44660034j86233q17032m44794j33972m69513k54059M1123K27356J16195L32031
2430.2G43071136j19781n17807k28729m75083o59332k11487K45514k25525J29547O32019
2439.9G41640472j2588m73099m45175j74027l97338m24195l62396k11105r9488o3552
$$ plain form
2449.5 738977509 739288635 739034576 738351746 737832336 737754440 738216782 738489304 738113403 737828827 738073807
2459.2 738073807 737793961 737289429 736555252 736024704 736165543 736018143 735970688 735836868 735767212 735714645
2468.8 735714645 735518646 735540848 735170364 734597473 734326172 734330826 734061279 733927612 733980179 733994141
2478.5 733994141 733947906 733221588 732612534 732215424 732179871 732176208 731789551 731933136 732270813 732416611
2488.1 732416611 732061844 731584702 731088486 730786057 730709381 730101700 729869385 730024414 730359879 730464249
2497.7 730464249 730022125 729874268 729582291 728879471 728375854 728258209 727990952 727798691 728137436 728646393
2507.4 728646393 728563309 728056412 727845459 727427444 727000427 726499023 726144562 726318893 726621094 726780167
2517 726780167 726387863 726156311 725668182 725125427 724788666 724336243 724729843 724974594 725038300 725270157
$$ packed form
2449.5G38977509L11126k54059o82830n19410p7896M62342K72522l75901k84576K44980
2459.2G38073807k79846n04532p34177n30548J40839j47400m7455j33820o9656n2567
2468.8G35714645j95999K2202l70484n72891k71301M654k69547j33667N2567J3962
2478.5G33994141m6235p26318o09054l97110l5553l663l86657J43585L37677J45798
2488.1G32416611l54767m77142m96216l02429p6676o07681k32315J55029L35465J04370
2497.7G30464249m42124j47857k91977p02820n03617j17645k67257j92261L38745N08957
2507.4G28646393q3084n06897k10953m18015m27017n01404l54461J74331L02201J59073
2517G26780167l92304k31552m88129n42755l36761m52423L93600K44751O3706K31857
$$ plain form
2526.7 725270157 725268860 725213165 724890366 724190369 723261185 722907486 722887650 723172913 723470383 723309937
2536.3 723309937 723350601 723422241 723304214 722840424 722530060 722311096 721989822 721639099 721213989 721694794
2546 721694794 722531662 722523575 721627579 721119156 721012878 720325928 719623718 719370499 719755630 720081024
2555.6 720081024 720174789 720021515 719779816 719580154 718830261 718580170 718645706 718488159 718371582 718438721
2565.2 718438721 718713684 718486786 717811584 717268829 717195740 716796951 716271286 715969696 715937424 716358261
2574.9 716358261 716278229 716403198 716320724 715599365 715191116 715051727 714854050 714305191 714239197 714388199
2584.5 714388199 714499741 714429855 713917389 713785782 713718872 713174591 712412796 712374420 712513885 712442245
2594.2 712442245 712268753 711869049 711803589 711348953 711033020 710902634 710526505 710400696 710235291 710027084
$$ packed form
2526.7G25270157j297n5695l22799o99997r29184l53699j9836K85263K97470j60446
2536.3G23309937M0664P1640j18027m63790l10364k18964l21274l50723m25110M80805
2546G21694794Q36868q087q95996n08423j06278o86950p02210k53219L85131L25394
2555.6G20081024R3765j53274k41699j99662p49893k50091O5536j57547j16577O7139
2565.2G18438721K74963k26898o75202n42755p3089l98789n25665l01590l2272M20837
2574.9G16358261q0032J24969q2474p21359m08249j39389j97677n48859o5994J49002
2584.5G14388199J11542o9886n12466j31607o6910n44281p61795l8376J39465p1640
2594.2G12442245j73492l99704o5460m54636l15933j30386l76129j25809j65405k08207
$$ plain form
2603.8 710027084 709913940 710009613 709556198 709185333 708991013 708387833 707878189 707339249 707553253 707626190
2613.5 707626190 707319336 707209091 706979675 706609497 705615692 705067444 704895859 704789505 704739685 704679947
2623.1 704679947 704777756 704323578 703912659 703221893 702548370 702424393 702069702 701475143 701037140 701081619
2632.8 701081619 700942383 700867462 700723495 700263138 699458237 698139877 697534866 697481384 697820892 698141403
2642.4 698141403 697981033 697953568 697650757 696823044 695920792 695556641 695354767 694835815 694267731 694171143
2652 694171143 694361267 694386368 694311981 693564606 692648544 691848755 691154556 690939178 690874329 690894699 690799408
2662.6 690799408 690800095 690611954 690281982 689912796 689202042 688675079 688047867 687689972 687627029 687519836
2672.3 687519836 687663193 687381363 686872406 686569290 686140442 685576859 684945984 684720993 684883118 684534607
$$ packed form
2603.8G10027084j13144R5673m53415l70865j94320o03180n09644n38940K14004P2937
2613.5G07626190l06854j10245k29416l70178r93805n48248j71585j06354m9820n9738
2623.1G04679947R7809m54178m10919o90766o73523j23977l54691n94559m38003M4479
2632.8G01081619j39236p4921j43967m60357q04901j318360o05011n3482L39508L20511
2642.4F98141403j60370k7465l02811q27713r02252l64151k01874n18952n68084r6588
2652F94171143J90124K5101p4387p47375r16062p99789o94199k15378o4849K0370r5291
2662.6F90799408O87j88141l29972l69186p10754n26963o27212l57895o2943j07193
2672.3F87519836J43357k81830n08957l03116m28848n63583o30875k24991J62125l48511
$$ plain form
2681.9 684534607 684032898 683802185 683923416 683842316 682892075 682186356 681403885 681055908 681402969 681184921
2691.6 681184921 680979691 680452805 680211411 680108490 679372025 678807983 678337555 678305283 678303604 678144608
2701.2 678144608 678057404 678124313 678162689 677615280 676968918 676213913 675524521 675108871 675218735 675448914
2710.9 675448914 675402298 675176926 674551315 674466782 674091721 673244553 672600708 672203522 672466583 672276306
2720.5 672276306 671937561 671790466 671663284 671446075 671167755 671107025 670315399 669689560 669493179 669370346
2730.2 669370346 669524536 669250641 668927765 668840866 668764191 668398285 667998352 667760468 667492676 667443466
2739.8 667443466 667344818 666857605 666463852 666676331 666688309 666345596 666281204 666310120 666024323 665656204
2749.4 665656204 665705795 665486221 664933090 664510574 664245300 664117432 663765945 663259811 663403473 663852997
$$ packed form
2681.9F84534607n01709k30713J21231q1100r50241p05719p82471l47977L47061k18048
2691.6F81184921k05230n26886k41394j02921p36465n64042m70428l2272j679j58996
2701.2F78144608q7204O6909L8376n47409o46362p55005o89392m15650J09864K30179
2710.9F75448914m6616k25372o25611q4533l75061q47168o43845l97186K63061j90277
2720.5F72276306l38745j47095j27182k17209k78320o0730p91626o25839j96381j22833
2730.2F69370346J54190k73895l22876q6899p6675l65906l99933k37884k67792m9210
2739.8F67443466r8648m87213l93753K12479J1978l42713o4392K8916k85797l68119
2749.4F65656204M9591k19574n53131m22516k65274j27868l51487n06134J43662M49524
$$ plain form
2759.1 663852997 663482819 663311768 662857285 661840439 661748810 661750565 661496887 660982819 660633698 660596542
2768.7 660596542 660710602 660956421 660303879 659825211 659935989 659894791 659270782 658503952 658494568 658191223
2778.4 658191223 657676849 657637787 657808380 657345200 656609726 656318512 655857010 655540619 655292053 655173569
2788 655173569 654808731 654277878 654339142 654014816 653291016 652616196 652222366 651930237 651722717 651588516
2797.7 651588516 650639191 649738617 649679489 649578094 649120178 648539658 647496948 646847839 646790771 646063309
2807.3 646063309 645331650 645025253 644748459 644088745 643043365 642113037 641631088 641281738 640526276
2816 640526276 640164185 639439888 638483543 638284760 637857704 637379875 636399040 634994812 634101868 633304329
2825.6 633304329 632564926 632129860 631442947 630271797 629538460 628792725 627623901 626656990 625890656
$$ packed form
2759.1F63852997l70178j71051m54483j016846r1629J755k53678n14068l49121l7156
2768.7F60596542J14060K45819o52542m78668J10778m1198o24009p66830r384l03345
2778.4F58191223n14374l9062J70593m63180p35474k91214m61502l16391k48566j18484
2788F55173569l64838n30853O1264l24326p23800o74820l93830k92129k07520j34201
2797.7F51588516r49325r00574n9128j01395m57916n80520j042710o49109n7068p27462
2807.3F46063309p31659l06397k76794o59714j045380r30328m81949l49350p55462
2816F40526276l62091p24297r56345j98783m27056m77829r80835j404228q92944p97539
2825.6F33304329p39403m35066o86913j171150p33337p45735j168824r66911p66334
$$ plain form
2834.3 625890656 624924240 623623810 622709007 621894302 620686264 619175148 617519493 615934334 614200363
2843 614200363 612338676 610482712 608793716 606897430 604976425 603108978 600773964 598759918 597350693
2851.7 597350693 596315727 595411949 594646301 594370461 594376259 594280968 593844910 593568459 593344078 592612457
2861.3 592612457 591564941 590790100 590195580 589403343 588876076 588404350 587546921 586456642 585911903
2870 585911903 585697823 584734917 583595543 582772789 582166710 581477432 580879059 580519066 579723816 578912621
2879.6 578912621 578460426 578026123 577476463 576966171 576700058 576361198 575729752 575380402 575014267 574222679
2889.3 574222679 573815460 573298149 572687759 572288551 571951675 572084084 571818237 571455345 571148758 570478745
2898.9 570478745 570184784 570048599 569624863 569217148 569247246 568985596 568537712 568263550 567934952 567987823
$$ packed form
2834.3F25890656r66416j300430r14803q14705j208038j511116j655655j585159j733971
2843F14200363j861687j855964j688996j896286j921005j867447k335014k014046j409225
2851.7E97350693j034966r03778p65648k75840N798r5291m36058k76451k24381p31621
2861.3E92612457j047516p74841n94520p92237n27267m71726q57429j090279n44739
2870E85911903k14080r62906j139374q22754o06079o89278n98373l59993p95250q11195
2879.6E78912621m52195m34303n49660n10292k66113l38860o31446l49350l66135p91588
2889.3E74222679m07219n17311o10390l99208l36876J32409k65847l62892l06587o70013
2898.9E70478745k93961j36185m23736m07715L0098k61650m47884k74162l28598N2871
$$ plain form
2908.6 567987823 567544022 566395836 565322952 564703979 563871002 562422066 561499710 560730057 559775543
2917.2 559775543 558953171 558124390 557319794 556737823 556764259 557009697 556869354 556573792 556816750 557170677
2926.9 557170677 557359085 557523880 557672844 558029518 557932205 557776985 557954865 558405838 559187012 559558716
2936.5 559558716 559813385 560561485 561685371 562272568 562269516 562812805 563464279 563760262 564834290 566105347
2946.2 566105347 566275902 566415634 566794472 567093201 567306595 567469635 568112144 568499794 568450089 568375664
2955.8 568375664 568310699 568679199 569556541 570072403 570349236 571042480 571353645 571827164 572650261 573432693
2965.5 573432693 574148827 574763908 575767288 576363220 577310219 578461494 579310722 580772438 581638107
2974.1 581638107 582234192 583067131 583890533 584826813 585660210 586440582 587001801 587592354 587868080 588162498
$$ packed form
2908.6E67987823m43801j148186j072884o18973q32977j448936r22356p69653r54514
2917.2E59775543q22372q28781q04596n81971K6436K45438j40343k95562K42958L53927
2926.9E57170677J88408J64795J48964L56674r7313j55220J77880M50973P81174L71704
2936.5E59558716K54669P48100J123886N87197l052N43289O51474K95983J074028J271057
2946.2E66105347J70555J39732L78838K98729K13394J63040O42509L87650m9705p4425
2955.8E68375664o4965L68500Q77342N15862K76833O93244L11165M73519Q23097P82432
2965.5E73432693P16134O15081J003380N95932R46999J151275Q49228J461716Q65669
2974.1E81638107N96085Q32939Q23402R36280Q33397P80372N61219N90553K75726K94418
$$ plain form
2983.8 588162498 588923035 589744034 590467224 590919037 591343040 591567268 592000771 592740936 593163300 593345108
2993.4 593345108 593343201 593482628 593768196 593899918 593965187 594017525 593997116 594073563 593889465 593537750 593494987
3004 593494987 593283310 592989159 592528229 592290688 592382698 592063789 591917725 591884727 591469536 591057663
3013.7 591057663 591025429 590703049 590132103 589817238 589143486 588597183 588276482 588020401 588026276 587904282
3023.3 587904282 587486534 586796265 586190720 585763855 585458069 584806290 584444275 584665909 584045143 583661957
3033 583661957 583800621 583267555 582660828 582371597 582057800 581348648 580697937 580696373 580469704 579810715
3042.6 579810715 579350128 578601379 577903938 577424660 576864281 576920776 576973381 576246300 575072327 574116783
3052.2 574116783 573639526 573407936 573054314 572203484 571770134 571816978 571262779 570461884 570417747 570235596
$$ packed form
2983.8E88162498P60537Q20999P23190M51813M24003K24228M33503P40165M22364J81808
2993.4E93345108j907J39427K85568J31722O5269N2338k0409P6447j84098l51715m2763
3004E93494987k11677k94151m60930k37541R2010l18909j46064l2998m15191m11873
3013.7E91057663l2234l22380n70946l14865o73752n46303l20701k56081N875j21994
3023.3E87904282m17748o90269o05545m26865l05786o51779l62015K21634o20766l83186
3033E83661957J38664n33066o06727k89231l13797p09152o50711j564k26669o58989
3042.6E79810715m60587p48749o97441m79278n60379N6495N2605p27081j173973r55544
3052.2E74116783m77257k31590l53622q50830m33350M6844n54199q00895m4137j82151
$$ plain form
3061.9 570235596 569409256 568858070 567952118 567010078 566293297 565785980 565550804 564766273 564263306 563554993
3071.5 563554993 562608147 562531662 562646751 562613449 562176514 561363907 560563736 560177002 559783249 558975220
3081.2 558975220 558357658 557842560 557268677 556810493 556605949 556264801 555660057 554829445 554031563 553499603
3090.8 553499603 552731094 552088928 551455383 551195526 551077957 550294914 549821739 549094315 548614120 548716736
3100.5 548716736 547848091 546884918 546508522 545920792 544911690 544143639 543759766 543241882 542849541
3109.1 542849541 542650795 542163467 541510658 540902557 540479698 540297852 539499245 538448753 538151321
3117.8 538151321 538020706 537410278 536691589 536306152 535579834 534527435 533572235 532710457 532300339
3126.5 532300339 531670227 530827370 530293427 529628716 529033470 528588028 528036613 527673264 527432327 527004242
$$ packed form
3061.9E70235596q26340n51186r05952r42040p16781n07317k35176p84531n02967p08313
3071.5E63554993r46846p6485J15089l3302m36935q12607q00171l86734l93753q08029
3081.2E58975220o17562n15098n73883m58184k04544l41148o04744q30612p97882n31960
3090.8E53499603p68509o42166o33545k59857j17569p83043m73175p27424m80195J02616
3100.5E48716736q68645r63173l76396n87730j009102p68051l83873n17884l92341
3109.1E42849541j98746m87328o52809o08101m22859j81846p98607j050492k97432
3117.8E38151321j30615o10428p18689l85437p26318j052399r55200q61778m10118
3126.5E32300339o30112q42857n33943o64711n95246m45442n51415l63349k40937m28085
$$ plain form
3136.1 527004242 526204338 525270119 524685440 524277344 523764343 522895660 522031174 521360283 520734825 520336418
3145.8 520336418 519566154 518865891 518269196 517484703 516942101 516348267 515946655 515150566 514630241 514671059
3155.4 514671059 513698196 512708244 512433128 512198868 511293488 510104256 509574013 509184952 508409233
3164.1 508409233 507777328 507507286 506780205 505998154 505610657 505384941 504891014 504035263 503467560 503012123
3173.8 503012123 502853127 502194519 501352081 501025848 500080109 499321098 498823013 498479271 498278465 497592506
3183.4 497592506 496669235 495777740 495307198 494916573 494573975 493991814 493101730 492572899 492375526 491842194
3193 491842194 491066208 490843010 490082550 489189529 488626709 487866096 487386589 486956825 486892433 486260185
3202.7 486260185 485661201 485723953 485131378 484506836 484064598 483755684 482969055 481971169 481490746 481359634
$$ packed form
3136.1E27004242p99904r34219n84679m08096n13001q68683q64486o70891o25458l98407
3145.8E20336418p70264p00263n96695p84493n42602n93834m01612p96089n20325M0818
3155.4E14671059r72863r89952k75116k34260r05380j189232n30243l89061p75719
3164.1E08409233o31905k70042p27081p82051l87497k25716m93927q55751n67703m55437
3173.8E03012123j58996o58608q42438l26233r45739p59011m98085l43742k00806o85959
3183.4D97592506r23271q91495m70542l90625l42598n82161q90084n28831j97373n33332
3193D91842194p75986k23198p60460q93021n62820p60613m79507m29764o4392o32248
3202.7D86260185n98984O2752n92575o24542m42238l08914p86629r97886m80423j31112
$$ plain form
3212.3 481359634 481326675 480323486 479322624 478653641 478159294 478240891 477661896 476445923 475897217
3221 475897217 475731850 475061302 474415131 473837128 473756828 473873558 473056335 472436676 472145691 471818428
3230.7 471818428 471485939 471209106 470745544 469951973 469475670 468769302 467894440 467481918 467322693 466721611
3240.3 466721611 466171074 465772667 465035439 465152512 465223999 464471855 463498039 462950974 463027573 462535782
3249.9 462535782 462214165 462111092 461684418 461279945 460936661 460694542 460080986 459107361 458392220 458354416
3259.6 458354416 458224182 457826042 457288895 456699944 456579323 456178246 455667534 455354958 454931564 454357872
3269.2 454357872 453959541 453398895 452732697 452856522 452351532 451735687 451468506 450814209 450799980 450974464
3278.9 450974464 450926666 450464706 450093575 449948959 449852295 449621048 448473854 447902336 447938766 447864914
$$ packed form
3212.3D81359634l2959j003189j000862o68983m94347Q1597n78995j215973n48706
3221D75897217j65367o70548o46171n78003q0300J16730q17223o19659k90985l27263
3230.7D71818428l32489k76833m63562p93571m76303p06368q74862m12522j59225o01082
3240.3D66721611n50537l98407p37228J17073P1487p52144r73816n47065P6599m91791
3249.9D62535782l21617j03073m26674m04473l43284k42119o13556r73625p15141l7804
3259.6D58354416j30234l98140n37147n88951j20621m01077n10712l12576m23394n73692
3269.2D54357872l98331n60646o66198J23825n04990o15845k67181o54297j4229J74484
3278.9D50974464m7798m61960l71131j44616r6664k31247j147194n71518L6430p3852
$$ plain form
3288.5 447864914 447796478 447574654 447818680 447811623 447129097 446334267 445696182 445562706 445378532 444585495
3298.2 444585495 444482727 444848747 444293671 443622894 443375816 443453445 443104210 442682533 442866058 442977905
3307.8 442977905 443033600 442316437 441438332 441068306 440706673 440452118 440162048 439784470 439210320 438803558
3317.4 438803558 438449211 438472939 438597145 438053322 437602386 437094727 436346436 435458374 435157738 435087967
3327.1 435087967 434736443 434721832 434308739 433837662 433248482 432810135 432802620 432504616 432307320 432067757
3336.7 432067757 431915627 431495323 430933075 430559196 430262146 430105934 429595451 429136162 428585930 428442955
3346.4 428442955 428511009 427865334 427336998 427267876 427295799 426568451 425940857 425898018 425842285 425534096
3356 425534096 424823341 424989510 425047493 424469261 424107780 423469467 423077850 422859535 422416000 422165489
$$ packed form
3288.5D47864914o8436k21824K44026p057o82526p94830o38085j33476j84174p93037
3298.2D44585495j02768L66020n55076o70777k47078P7629l49235m21677J83525J11847
3307.8D42977905N5695p17163q78105l70026l61633k54555k90070l77578n74150m06762
3317.4D38803558l54347K3728J24206n43823m50936n07659p48291q88062l00636o9771
3327.1D35087967l51524j4611m13093m71077n89180m38347p515k98004j97296k39563
3336.7D32067757j52130m20304n62248l73879k97050j56212n10483m59289n50232j42975
3346.4D28442955O8054o45675n28336o9122K7923p27348o27594m2839n5733l08189
3356D25534096p10755J66169N7983n78232l61481o38313l91617k18315m43535k50511
$$ plain form
3365.7 422165489 422337494 422238312 421730156 421554489 421371613 420877037 420302734 420235519 420377998 419893188
3375.3 419893188 419417877 419232903 419109688 419204788 418982544 418233910 417762184 417888908 417736359 417042656
3384.9 417042656 416874695 416847267 416694679 416572609 416089211 416009293 415841675 415619240 415786247 415384789
3394.6 415384789 414885483 414519615 414510803 414782028 414532433 413780670 413365517 413638573 413506737 413116493
3404.2 413116493 413043137 413146172 413176231 412893181 412893600 412968254 412411804 411767998 411372070 411009979 411441803
3414.8 411441803 411892624 411550903 411594963 411813583 411840477 411195335 410245781 410239143 410426254 410712852
3424.5 410712852 411288414 411302605 411257553 411780396 411837692 411796074 411814766 411563568 411859818 411879005 411544991
3435.1 411544991 411584778 411697693 411424255 411224060 411194229 411169434 411955338 412440910 412782745 412789497
$$ packed form
3365.7D22165489J72005r9182n08156j75667j82876m94576n74303o7215J42479m84810
3375.3D19893188m75311j84974j23215R5100k22244p48634m71726J26724j52549o93703
3384.9D17042656j67961k7428j52588j22070m83398p9918j67618k22435J67007m01458
3394.6D15384789m99306l65868q812K71225k49595p51763m15153K73056j31836l90244
3404.2D13116493p3356J03035L0059k83050M19P4654n56450o43806l95928l62091M31824
3414.8D11441803M50821l41721M4060K18620K6894o45142r49554o638J87111K86598
3424.5D10712852N75562J4191m5052N22843N7296m1618J8692k51198K96250J9187l34014
3435.1D11544991L9787J12915k73438k00195k9831k4795P85904M85572L41835O752
$$ plain form
3444.7 412789497 412143478 412045937 411413345 411956635 413028641 413160782 413395195 413680115 414174881 414215202
3454.4 414215202 414247856 414503593 414840012 414919014 414670601 415477562 415931473 415840073 415608749 415629387
3464 415629387 416660652 417188759 417150192 417471466 418371162 418791084 418611526 418461266 418564835 419187317
3473.7 419187317 419150162 419035454 419466209 420098877 420842209 421083336 421191902 421560555 421712990 422046471
3483.3 422046471 423289070 423501511 422991714 423451920 423676834 423903694 424356651 424808044 425151024
3492 425151024 425810699 426765594 427204056 427484970 427321205 427176018 427189102 427777100 429231110 430365067
3501.6 430365067 430854568 430153313 429922752 430671577 431274948 432187119 433176231 433166962 432811775 433637505
3511.3 433637505 434036713 434037933 434691086 435365715 436272697 436951981 437340240 437895279 438040962 438361206
$$ packed form
3444.7D12789497o46019r7541o32592N43290J072006J32141K34413K84920M94766M0321
3454.4D14215202L2654K55737L36419P9002k48413Q06961M53911r1400k31324K0638
3464D15629387J031265N28107l8567L21274Q99696M19922j79558j50260J03569O22482
3473.7D19187317l7155j14708M30755O32668P43332K41127J08566L68653J52435L33481
3483.3D22046471J242599K12441n09797M60206K24914K26860M52957M51393L42980
3492D25151024O59675R54895M38462K80914j63765j45187J3084N87998J454010J133957
3501.6D30365067M89501p01255k30561P48825O03371R12171R89112r269l55187Q25730
3511.3D33637505L99208J220O53153O74629R06982O79284L88259N55039J45683L20244
$$ plain form
3520.9 438361206 439508629 439732399 439025345 439838486 441083412 441380615 441307755 441530037 442003136
3529.6 442003136 443154068 443475876 443611374 445186005 446292839 447299767 447685013 447876701 448882065
3538.3 448882065 449287567 450114365 450803185 451785164 452814255 453482971 453914680 453370743 453863335
3547 453863335 454004440 455160370 456599960 457790565 459258270 458340607 459027710 460296593 461293831
3555.6 461293831 462876625 463496170 464200287 464557228 465150261 465577888 467065849 468087845 468165550
3564.3 468165550 470842590 470670052 470241547 470306931 469726486 472452278 473908157 474921837 475997696
3573 475997696 477245064 478356476 479071274 480507622 480884399 482468643 483976974 484100266 484592972
3581.7 484592972 485524750 486814804 487424011 489858284 490508804 488727608 490591164 491195908 493067513
$$ packed form
3520.9D38361206J147423K23770p07054Q13141J244926K97203p2860K22282M73099
3529.6D42003136J150932L21808J35498J574631J106834J006928L85246J91688J005364
3538.3D48882065M05502Q26798O88820R81979J029091O68716M31709n43937M92592
3547D53863335J41105J155930J439590J190605J467705r17663O87103J268883R97238
3555.6D61293831J582794O19545P04117L56941N93033M27627J487961J021996P7705
3564.3D68165550K677040j72538m28505O5384n80445K725792J455879J013680J075859
3573D75997696J247368J111412P14798J436348L76777J584244J508331J23292M92706
3581.7D84592972R31778J290054O09207K434273O50520j781196J863556O04744J871605
$$ plain form
3590.4 493067513 495018845 497163467 498266487 498266029 500212898 499391747 500955696 503814697 504694061
3599 504694061 506738968 507391052 508445129 510684662 512866592 514660683 516657867 518640900 517300568
3607.7 517300568 519671516 520100174 519779854 525557251 526501617 525630722 529494400 529358177 532026215
3616.4 532026215 534906006 534713402 537088127 537593842 538201714 541353455 544045486 546081734 548406639
3625.1 548406639 550017738 551873322 557282906 558298416 550719910 553904457 557975540 562999153
3632.8 562999153 565477905 564597359 566722908 569745827 572289658 573210869 574362869 576413841 579045715
3641.5 579045715 580805321 581168480 582943039 585726585 591541367 592898636 589463882 594587860
3649.2 594587860 594663620 593473701 593797684 598469048 603118324 606812515 611306610 605199242 606967316
$$ packed form
3590.4D93067513J951332K144622J103020m58J946869q21151J563949K859001Q79364
3599E04694061K044907O52084J054077K239533K181930J794091J997184J983033j340332
3607.7E17300568K370948M28658l20320N777397R44366q70895L863678j36223K668038
3616.4E32026215K879791j92604K374725N05715O07872L151741K692031K036248K324905
3625.1E48406639J611099J855584N409584J015510p578506L184547M071083N023613
3632.8E62999153K478752q80546K125549L022919K543831R21211J152000K050972K631874
3641.5E79045715J759606L63159J774559K783546N814782J357269l434754N123978
3649.2E94587860P5760j189919L23983M671364M649276L694191M494095o107368J768074
$$ plain form
3657.9 606967316 612052078 613669510 615217514 616199379 619104919 620370102 621422043 623227158
3665.6 623227158 623917160 627178116 629206276 630296783 631342545 626303329 628358421 635110435
3673.3 635110435 642248535 639671478 624482841 629006996 637461319 642555313 640785751 640312195
3681 640312195 642533493 644424667 645354233 645446548 645946579 649897995 655981979 648977356 644905319
3689.7 644905319 650978241 647703934 647571487 651725464 652597961 653864822 653628311 652816620 654004288
3698.4 654004288 654161301 656188889 658968124 654661789 652288666 655591888 656924057 657342911 658206406
3707 658206406 659937210 661877518 655734482 659608383 663577271 652116928 657134399 661783676
3714.8 661783676 661808319 661475143 662239532 662949371 660355377 661830063 665842209 661662827 657898407
$$ packed form
3657.9F06967316N084762J617432J548004R81865K905540J265183J051941J805115
3665.6F23227158O90002L260956K028160J090507J045762n039216K055092O752014
3673.3F35110435P138100k577057j5188637M524155Q454323N093994j769562m73556
3681F40312195K221298J891174R29566R2315N00031L951416O083984p004623m072037
3689.7F44905319O072922l274307j32447M153977Q72497J266861k36511q11691J187668
3698.4F54004288J57013K027588K779235m306335k373123L303222J332169M18854Q63495
3707F58206406J730804J940308o143036L873901L968888j1460343N017471M649277
3714.8F61783676K4643l33176P64389P09839k593994J474686M012146m179382l764420
$$ plain form
3723.4 657898407 661973114 663044281 661346970 659528809 660730896 664059906 665451584 669942474
3731.2 669942474 667002792 659241257 666428909 666904526 658705215 659962616 660975113 661368103 664633713
3739.8 664633713 667652435 664082794 666284256 675634384 667447586 655533142 663016891 666793976
3747.5 666793976 670544052 666726227 658992233 667843323 663664856 658636093 664031677 668217621
3755.3 668217621 670771790 665953369 667810822 673078766 666078720 664235458 668011017 669204941
3763 669204941 669193497 671598663 669680328 665933533 668374786 672134323 671792068 663633041 665250168
3771.7 665250168 668857880 669458618 669849014 669431458 670826569 671439972 672520447 671612930 665321426
3780.3 665321426 667817459 669783936 670803604 672916183 669554291 668226624 669525681 670461960
$$ packed form
3723.4F57898407M074707J071167j697311j818161J202087L329010J391678M490890
3731.2F69942474k939682p761535P187652M75617q199311J257401J012497L92990L265610
3739.8F64633713L018722l569641K201462R350128q186798j1914444P483749L777085
3747.5F66793976L750076l817825p733994Q851090m178467n028763N395584M185944
3755.3F68217621K554169m818421J857453N267944p000046j843262L775559J193924
3763F69204941j1444K405166j918335l746795K441253L759537l42255q159027J617127
3771.7F65250168L607712O00738L90396m17556J395111O13403J080475r07517o291504
3780.3F65321426K496033J966477J019668K112579l361892j327667J299057R36279
$$ plain form
3788 670461960 670553360 669851379 670225372 669679565 670317383 670952988 671476593 673993607 670326843 666011200
3797.7 666011200 667829361 671666946 676614838 668530197 659465637 664313354 667273560 671496964
3805.4 671496964 676081772 667895355 665101166 669485016 671391449 671390686 670945892 670553894 671098022
3814.1 671098022 674959030 673534164 662559052 666469116 671064301 675109940 676162949 660945435
3821.8 660945435 663273849 668043060 669107971 671373672 672327423 668775330 668883209 670155182 672240067
3830.5 672240067 673401718 666613846 669320221 675312271 669860916 668959351 675021744 667072525
3838.2 667072525 663109818 669723969 665934601 665896378 671818771 670547485 667564392 669889603 670566177
3846.9 670566177 669543991 670356827 669173584 670936432 674346008 665715942 668065720 660374451
$$ packed form
3788F70461960R1400p01981L73993n45807O37818O35605N23605K517014l666764m315643
3797.7F66011200J818161L837585M947892q084641r064560M847717K960206M223404
3805.4F71496964M584808q186417k794189M383850J906433p63m44794l91998N44128
3814.1F71098022L861008j424866j0975112L910064M595185M045639J053009j5217514
3821.8F60945435K328414M769211J064911K265701R53751l552093J07879J271973K084885
3830.5F72240067J161651o787872K706375N992050n451355r01565O062393p949219
3838.2F67072525l962707O614151l789368l8223N922393j271286k983093K325211O76574
3846.9F70566177j022186Q12836j183243J762848L409576q630066K349778p691269
$$ plain form
3854.6 660374451 661133804 668664017 667367859 666578369 669227905 671189270 671883163 667447968 669327469
3863.3 669327469 674706421 667388229 663347244 667603226 671769943 676111374 667814178 661026001
3871 661026001 665152359 670490036 673518753 664434891 664868927 668416595 668596878 670636749 673860016
3879.7 673860016 668636322 662748032 667660904 668476639 669758911 673015747 661318130 662913589
3887.4 662913589 666723175 668019562 672314911 671578522 663929443 664766312 667810898 667521362 668870163
3896.1 668870163 669379120 670472565 670483322 661328964 665873489 668098755 663079834 665895309 664069672
3904.7 664069672 664031830 664674454 665727310 667834930 667197952 666603851 666188736 666273651 666333008 666421356
3914.4 666421356 667605438 668109818 664422760 661952133 665925903 666548386 664023819 666162491 667257843
$$ packed form
3854.6F60374451P59353P530213j296158p89490K649536J961365O93893m435195J879501
3863.3F69327469N378952p318192m040985M255982M166717M341431q297196o788177
3871F61026001M126358N337677L028717r083862M34036L547668J80283K039871L223267
3879.7F73860016n223694n888290M912872Q15735J282272L256836j1697617J595459
3887.4F62913589L809586J296387M295349p36389p649079Q36869L044586k89536J348801
3896.1F68870163N08957J093445J0757r154358M544525K225266n018921K815475j825637
3904.7F64069672l7842O42624J052856K107620o36978n94101m15115Q4915N9357Q8348
3914.4F66421356J184082N04380l687058k470627L973770O22483k524567K138672J095352
$$ plain form
3923.1 667257843 667190170 665327682 663252258 664590225 665780716 666759796 666086044 665046387 666041183
3931.7 666041183 664486237 662973099 663694916 663936539 664168472 664463272 664189911 664095306 664485703
3940.4 664485703 666007919 666769028 662962646 661574326 662855453 663837814 664367752 662909241 663885117
3949.1 663885117 663564224 661122665 662557449 662644272 662031784 662420120 662540894 662883606 662400360
3957.8 662400360 662362213 662267914 662825851 663131561 661651154 661455154 661738434 661640244 661514664 661970978
3967.4 661970978 662479858 661375122 661115570 661956863 661162491 660148849 660450821 660795212 660556717
3976.1 660556717 659856873 659876022 660576630 660900421 660611038 660057831 660558014 661553040 661776581 661146393
3985.7 661146393 660441818 659810486 659474792 659945450 659153671 658970718 660364914 660438461 659961548 659371567
$$ packed form
3923.1F67257843o7673j862488k075424J337967J190491R79080o73752j039657R94796
3931.7F66041183j554946j513138P21817K41623K31933K94800k73361r4605L90397
3940.4F64485703J522216P61109l806382j388320J281127R82361N29938j458511R75876
3949.1F63885117l20893k441559J434784Q6823o12488L88336J20774L42712m83246
3957.8F62400360l8147r4299N57937L05710j480407j96000K83280r8190j25580M56314
3967.4F61970978N08880j104736k59552Q41293p94372j013642L01972L44391k38495
3976.1F60556717o99844J9149P00608L23791k89383n53207N00183R95026K23541o30188
3985.7F61146393p04575o31332l35694M70658p91779j82953J394196P3547m76913n89981
$$ plain form
3995.4 659371567 659281082 659681091 659854507 660388565 660315552
4000.2 660315552
$$ packed form
3995.4F59371567r0485M00009J73416N34058p3013
4000.2F60315552
##END=$$ End of the data block
