##TITLE=$$ Begin of the data block
##JCAMP-DX=5.00 $$ ACD/SpecManager v 10.08
##SPECTROMETER/DATA SYSTEM=Varian
##DATE=15 Jan 2013 15:51:22
##DATA TYPE=INFRARED SPECTRUM
##DATA CLASS=XYDATA
##ORIGIN=
##OWNER=
##NPOINTS=3735
##FIRSTX=399.26403809
##LASTX=4000.35498047
##MAXX=4000.35498047
##MINX=399.26403809
##MAXY=76.46365356
##MINY=40.93759155
##XFACTOR=1.0000000000
##YFACTOR=0.000000100000000
##FIRSTY=62.40641022
##DELTAX=0.96440572
##XUNITS=1/CM
##YUNITS=TRANSMITTANCE
##XYDATA=(X++(Y..Y))
399.3F24064102P440186p855187N074921N181923l599129J864929k58560K400475O16226
407.9F34929886j202431l863449k551880K716103j579743l621597l012199N222702
415.7F27037392Q234939K528801N097122k928238j6067085o351967Q50983R35326k247467
424.3F17089806j385155N031395Q583450J675148m356766k649421k760468n660858
432.1F15567131J60751L706360j89934o08406N408173M613304m474296m057885k903251
440.7F17221947k963944L554573P71256K504616L724327K765464M084130k077904p515411
449.4F22069054m201088J947632M57916k555313M54330L628044K5673p710266l480987
458.1F10634995N377159j203614p466888j425362N475045N721931L965454k105369
$$ y = [624064102, 631504288, 623649101, 628724022, 633905945, 630306816, 632171745, 631913185, 634313660, 634929886, 633727455, 629864006, 627312126, 630028229, 628448486, 624826889, 621814690, 627037392, 635272331, 637801132, 642898254, 639970016, 623902931, 617550964, 618401947, 619337273, 617089806, 615704651, 620736046, 629319496, 630994644, 626637878, 623988457, 621227989, 615567131, 615727882, 619434242, 619244308, 618635902, 624044075, 628657379, 624183083, 620125198, 617221947, 614258003, 617812576, 618583832, 621088448, 624812775, 627578239, 631662369, 629584465, 622069054, 617867966, 619815598, 620273514, 617718201, 618172531, 621800575, 621826248, 614115982, 610634995, 616012154, 614808540, 607341652, 605916290, 611391335, 617113266, 621078720, 618973351]
465.8F18973351j380959N75256r49363m366036p401962o741181L95432R567718J26725
474.5F08798981Q97178Q235741k053909j0806580n203400L824845M432564K319259
482.2F10444679J916237j653671k982063m297524r41315L648491l3455r53178J622276
490.9F06770477O62575j24016J999245J517410J96190k141495m745102k808685m61731
499.6F00864868K110405L745804n72968l203468J02577J715508j515923m494972N21622
508.2E99273453L126373L70865j934815k574539k46811K223626M91867p86820k073593
516.9E97869606k352562K213783L801575O58188j008186m04053r30023l601456m281311
525.6E91965561k193070J385155L167229J640167J592484N0468l354683k443924j875038
$$ y = [618973351, 617592392, 618167648, 617218285, 612852249, 605450287, 598709106, 599104538, 608672256, 608798981, 609696159, 617931900, 615877991, 605071411, 599868011, 603692856, 608125420, 610444679, 612360916, 610707245, 607725182, 603427658, 602486343, 606134834, 606101379, 605148201, 606770477, 607433052, 607309036, 609308281, 610825691, 611021881, 608880386, 604135284, 601326599, 600864868, 602975273, 606721077, 606148109, 602944641, 603047218, 604762726, 603246803, 598751831, 599273453, 602399826, 602770691, 600835876, 598261337, 598014526, 600238152, 600730019, 599943199, 597869606, 595517044, 597730827, 601532402, 602190590, 601182404, 600778351, 599848328, 596246872, 591965561, 589772491, 591157646, 594324875, 595965042, 597557526, 597607994, 594253311, 591809387, 589934349]
534.3E89934349k180061k140847q29849K040062M616585M658012J202202n94864k020073
543E94685516l330650k173233j271515J735764M143142K494202N17998K83165k60163
551.6E96824226j295776j466713k649422k636566j048240J574935L028946J448174
559.4E93779564K118263K321549n34592k988091j694564j029244j189957K066651L312569
568E96162148K933578J651115p00645j707649k465325k566070j358032K52685J807251
576.7E94009056L313828J140327o69174k30599k541694j831551j192589j618652j301460
585.4E89077492N51948K977524J696053J064758o86150j571502j626473l453407k640495
594.1E85389748j960144o4354Q37211J236611J106796j025353M5624l49846q22258
$$ y = [589934349, 587754288, 585613441, 584783592, 586823654, 591440239, 596098251, 597300453, 596705589, 594685516, 591354866, 589181633, 587910118, 589645882, 593789024, 596283226, 596801224, 597084389, 596824226, 595528450, 594061737, 591412315, 588775749, 587727509, 589302444, 592331390, 593779564, 595897827, 598219376, 597684784, 594696693, 593002129, 591972885, 590782928, 592849579, 596162148, 599095726, 600746841, 600046196, 598338547, 595873222, 593307152, 591949120, 592201805, 594009056, 597322884, 598463211, 597794037, 597563438, 595021744, 593190193, 591997604, 590378952, 589077492, 589629440, 592606964, 594303017, 595367775, 594681625, 593110123, 591483650, 588030243, 585389748, 583429604, 583365250, 584202461, 585439072, 586545868, 585520515, 585566139, 585216293, 584394035]
602.8E84394035j263733k135849o74705m36440J485634K574883J978683J047783j85547
611.4E86784744l97300q16002P81364K73552j023064K79160N99022O84051j92070M7341
621.1E87020798Q80127K9945K40212L29475n18265Q11768J607818k89077j61896M28734
630.7E90379639j80588k59209n72777M29764P74460l8681q9951n3596M94652K36778
640.4E91120491L38631N83458k59323N06782J282616J303978J297111p15484k238579
649E93219681m73137J532707J657982J507759P86667M82063O36635n02777r30786j726570
658.7E96190224j076355M99305j27563l25775R45930J894112L62968l59268n320930
667.4E92682648k1372948R461098Q015022L068581J686744R49707L10898R4261J229935
$$ y = [584394035, 583130302, 580994453, 580319748, 579883308, 581368942, 583943825, 585922508, 586970291, 586784744, 586387444, 585571442, 586352806, 586626358, 585603294, 585882454, 586481476, 587165527, 586973457, 587020798, 587900925, 587930870, 588171082, 588500557, 587982292, 588794060, 590401878, 590112801, 589950905, 590379639, 590199051, 589939842, 589367065, 589796829, 590571289, 590532608, 590442657, 590389061, 590883713, 591120491, 591459122, 592042580, 591783257, 592290039, 593572655, 594876633, 596173744, 595458260, 593219681, 592746544, 594279251, 595937233, 597444992, 598231659, 598713722, 599350357, 598847580, 597916794, 596190224, 595113869, 595613174, 595485611, 595159836, 596105766, 597999878, 598362846, 598003578, 592682648, 571309700, 580770798, 588785820, 591854401, 593541145, 594490852, 594801750, 594896011, 596125946]
676.1E96125946K98729q66127j120071j299401J79405J185151K873725L251496J656723
684.7F02285576Q27217O43806k0446j832810j543083K14653J904755L413047L096390
693.4F08989105K360382J256295l0365N2337O8932o28090j45645J201172J831245J823349
703.1F16778717K547073K918702J666908M1466j352234q35877L46680P46574J013108
711.7F23871117J770401K670326J761551R98649J003037K99492j897888k923050k82708
720.4F27270927K739983L453674K213517J759529K069969J428451j77612j313705n62516
729.1F38882217j14631J382026J907578J756134J746140O37588P51266j93176j97067
737.8F46558075n01785q07114M42810J053009J636810N93415J938400K072525l68042
$$ y = [596125946, 596424675, 595558548, 594438477, 593139076, 593318481, 594503632, 597377357, 600628853, 602285576, 603112793, 603756599, 603736153, 601903343, 600360260, 600574913, 602479668, 605892715, 608989105, 611349487, 612605782, 612575417, 612627754, 612696686, 612068596, 611922951, 613124123, 614955368, 616778717, 619325790, 622244492, 623911400, 623952866, 622600632, 621764755, 622111435, 622858009, 623871117, 625641518, 628311844, 630073395, 631072044, 632075081, 632374573, 630476685, 627553635, 627270927, 630010910, 633464584, 635678101, 637437630, 639507599, 640936050, 640758438, 639444733, 638882217, 638767586, 640149612, 642057190, 643813324, 645559464, 646197052, 646948318, 646755142, 646558075, 646056290, 645249176, 645691986, 646744995, 648381805, 648975220, 650913620, 652986145, 652618103]
746.5F52618103j465149k806015j284408J82266Q05893P76977L85895O14014m43573
755.1F49384003n21851j246796j495971n79300q47092j574402j596832p11441j11847
763.8F40698471M97894l3264j34735J58310r66339n55687L91731R94263J616669P12814
773.5F43380127n1498R91592P77054n2185J155395J352387J22375N06058J922073J024857
783.1F51128235J69144M71115Q58841J506576P55463R18655J006012N69382m47540
791.8F56935883q33359Q3694j088867j149673j243668n25360n9433j650620j154861
800.5F49313736l41492p5378j821900k527008j607208p08923N95703j31302N20325
809.1F43216553J569214J801300J949157J513443J341477K071609L798142L811111
$$ y = [652618103, 651152954, 648346939, 647062531, 647244797, 648050690, 648827667, 649213562, 649827576, 649384003, 648862152, 647615356, 646119385, 645540085, 644692993, 643118591, 641521759, 640810318, 640698471, 641196365, 641163101, 641028366, 641186676, 640220337, 639664650, 640056381, 641050644, 642667313, 643380127, 643328629, 644320221, 645097275, 645045090, 646200485, 647552872, 647675247, 648181305, 650103378, 651128235, 651297379, 651768494, 652627335, 654133911, 654889374, 655808029, 656814041, 657383423, 656935883, 656102524, 656186218, 655097351, 653947678, 652704010, 652178650, 652119217, 650468597, 649313736, 648972244, 648896866, 647074966, 644547958, 642940750, 642231827, 642827530, 642696228, 643216553, 644785767, 646587067, 648536224, 650049667, 651391144, 653462753, 657260895, 661072006]
816.9F61072006M390869L549729L177032L867111J889496J710892J172104J120376
824.6F81949615j5792J17340K075042J49460l64456K60544j94779j500625n40772N34058
834.2F82469635L65143K289123K238160J666259J644440K348709K199707J195450Q69369
842.9F97285995L27302J028823p5378J69296Q79059R57489J490707L19291J96151p88650
852.5G01790085j506272j609802j103439l72696m51736J77230m10080j071548j007233
861.2F94434509j357193l438949l396378j901016k424393k269516j968765j288223
868.9F76390076j525345j246567j060867k365418k589874k485428q82110m01154m05045
877.6F63428268j36871o4316J137772m81567j505280l45764j28555q74405o30494L04947
$$ y = [661072006, 665462875, 669012604, 672189636, 676056747, 677946243, 679657135, 680829239, 681949615, 681933823, 682051163, 684126205, 684275665, 683911209, 684171753, 683976974, 682476349, 681935577, 682469635, 682834778, 685123901, 687362061, 689028320, 690672760, 693021469, 695221176, 696416626, 697285995, 697613297, 698642120, 698566742, 698736038, 699615097, 700572586, 702063293, 702382584, 702578735, 701790085, 700283813, 698674011, 697570572, 697197876, 696746140, 696923370, 696513290, 695441742, 694434509, 693077316, 689638367, 686241989, 684340973, 681916580, 679647064, 677678299, 676390076, 674864731, 673618164, 672557297, 670191879, 667602005, 665116577, 664234467, 663833313, 663428268, 663291397, 663227081, 664364853, 663883286, 662378006, 662032242, 661903687, 661029282, 660398788, 660703735]
887.3F60703735m24423n65185m76532l81623m92401q27408k70996J87836J65329m12216
896.9F57206116l04413n3482N50537O12793k59857m73099k28195N77621N40314R22623
906.5F59090958N52597l32108J18790k19727k62069P10067K389527K377166J782837
915.2F66208038J264572Q87452J903228O80008O95725J061630O9656J11771O2714M68292
924.9F73413086M87900N72509j49154r73969j710434j671600o35376j141968q74176
933.6F67316818m62951n62287q33587j057358j697312k314529k201157k669830j858292
942.2F53659515j937103j686630j780396k773285j614151k569122l162765l276902
949.9F34859161m157905l185044k299690j579094j334839j368637j920471k396698
$$ y = [660703735, 660279312, 659714127, 659237595, 658855972, 658363571, 657536163, 657265167, 657453003, 657618332, 657206116, 656901703, 656848221, 657398758, 658011551, 657751694, 657278595, 657050400, 657628021, 658168335, 659090958, 659643555, 659311447, 659430237, 659210510, 658948441, 659658508, 662048035, 664425201, 666208038, 667472610, 668360062, 670263290, 670943298, 671639023, 672700653, 672770309, 672882080, 672944794, 673413086, 673900986, 674473495, 674324341, 673350372, 671639938, 669968338, 669332962, 668190994, 667316818, 666853867, 666291580, 665457993, 664400635, 662703323, 660388794, 658187637, 655517807, 653659515, 651722412, 650035782, 648255386, 645482101, 643867950, 641298828, 638136063, 634859161, 630701256, 627516212, 625216522, 623637428, 622302589, 620933952, 619013481, 616616783]
957.7F16616783j814880j665879j105995n86433m68521m158M37164M59099Q78715J320458
967.3F14066353R2850J09672J58920j232071k87590J302758O70662N74417J207161
976F16663132j019860k568016j636810k242050l673325k947616j990662k846641k235337
984.7E95502815j362610k726593l102836k847824l306122l429909l138580l086815
992.4E72501526k937851j350098j061859k129898k459946k920265k953796l597374
1000.1E53090439m169808l716621l471680k429275j027222j900902l025894k063370
1007.8E31285667k407302k854462k761994k320938j315231j433182j118965r05723
1015.5E16167870m45862j402321k333603j878090j684494r89075j477203q95729n47791
$$ y = [616616783, 614801903, 613136024, 612030029, 611443596, 610975075, 610970917, 611408081, 611867180, 612745895, 614066353, 614159203, 614268875, 614427795, 613195724, 612908134, 614210892, 614881554, 615455971, 616663132, 615643272, 613075256, 611438446, 609196396, 605523071, 602575455, 600584793, 597738152, 595502815, 594140205, 591413612, 588310776, 585462952, 582156830, 578726921, 575588341, 572501526, 569563675, 568213577, 567151718, 565021820, 562561874, 559641609, 556687813, 553090439, 548920631, 545204010, 541732330, 539303055, 538275833, 536374931, 533349037, 531285667, 528878365, 526023903, 523261909, 520940971, 519625740, 518192558, 517073593, 516167870, 515722008, 514319687, 511986084, 510107994, 508423500, 507434425, 505957222, 505061493, 504513702]
1024.2E04513702l96003n7946j08261K41661j379776j694755j571808l26500M83437
1032.9D99703751m31443k2049J25504R78432j12305r3994K96211k35023L31039k05765
1042.5E00334358O32210K708j72576k57760m27703R50355p6904j408501j449928P26166
1052.2D98852425K19841l31345J122932L46337R3803m34570k55585q35380n62630K31667
1061.8D98447495L26881O84700k56844J88408l55797L85972L86962n32035l22609p34444
1071.5D98218689J029510j0070m41628N49698R90562Q27942k31971L86161p38792K09236
1081.1E00789337O69518K80342P12471M17518J180497j76087m09851p55882o58569
1089.8E02049294m30336o72150M84238r76754r56993j382522j905976o88286m81987
$$ y = [504513702, 504117699, 504059753, 503951492, 504193153, 502813377, 501118622, 499546814, 499220314, 499703751, 499272308, 499250259, 499375763, 500354195, 500241890, 500147896, 500444107, 500209084, 500540123, 500334358, 500966568, 500969276, 500796700, 500538940, 500111237, 501061592, 500984688, 499576187, 498126259, 498852425, 499072266, 498740921, 499863853, 500210190, 500303993, 499869423, 499613838, 498778458, 498215828, 498447495, 498774376, 499459076, 499202232, 499390640, 499034843, 499420815, 499807777, 499275742, 498953133, 498218689, 499248199, 499238129, 498796501, 499346199, 500336761, 501164703, 500932732, 501318893, 500580101, 500789337, 501458855, 501739197, 502451668, 502869186, 504049683, 503873596, 503463745, 502707863, 502049294, 501618958, 500946808, 501431046, 500454292, 499497299, 498114777, 496208801, 495520515, 495038528]
1098.5D95038528r42039q52127J094665J032143J911964K220841J240158J046677P95173
1107.1E02585983J463814J453667K674217J773682O00547J904831K410622K107506
1114.9E16974869J749534K399483J203499J171188K593003K568283K221374J903115
1122.6E32784348K017860J403999J580620J311226R54246J169282P93113K044754K804108
1131.2E46863556J999206J045533J15814j01090J048127P87468l50609J61247L83225
1139.9E51952477Q62960M06647m3030J78604n30166p31697j306191k70691P24907L11012
1149.6E51554832O38733J80397J22452M89311P30973K09655o42929m75807M15039J671753
1159.2E54894409J662407J116142J137581J473580J385536J031952Q21380J104050
$$ y = [495038528, 494096489, 493244362, 494339027, 495371170, 497283134, 499503975, 500744133, 501790810, 502585983, 504049797, 505503464, 508177681, 509951363, 510551910, 512456741, 514867363, 516974869, 518724403, 521123886, 522327385, 523498573, 526091576, 528659859, 530881233, 532784348, 534802208, 536206207, 537786827, 539098053, 540052299, 541221581, 542014694, 544059448, 546863556, 548862762, 549908295, 550024109, 549923019, 550971146, 551758614, 551408005, 551569252, 551952477, 552815437, 553222084, 553179054, 553357658, 552827492, 552095795, 550789604, 550518913, 551243820, 551554832, 552193565, 552373962, 552496414, 552985725, 553716698, 553926353, 553283424, 552807617, 553222656, 554894409, 556556816, 557672958, 558810539, 560284119, 561669655, 562701607, 563522987, 564627037]
1166.9E64627037J606293J674995K419586L037796L338623L029290K085952J765290
1174.6E83584862J781578J765976K125091K604218K639503K444382K404709K967148
1182.4F02317467K058525J118507J445847J360817J688499K072296K551194K212829
1190.1F16825981J970482J491623P42912P65953J04904K25716o07567j047744m43917
1198.8F20028343q31032n71594n09529j344719k147941k083245k266617k621765k537613
1207.4F05114288k389755k127647k148323k581063k980880k792397k684326l104820
1215.1E84305077l661004l221969k270432k190742k547836k408562k222099k269860
1222.9E63512573k047500j878510j859970j890259j432152j530990j813126j536636
$$ y = [564627037, 566233330, 567908325, 570327911, 573365707, 576704330, 579733620, 581819572, 583584862, 585366440, 587132416, 589257507, 591861725, 594501228, 596945610, 599350319, 602317467, 604375992, 605494499, 606940346, 608301163, 609989662, 612061958, 614613152, 616825981, 618796463, 620288086, 621030998, 621796951, 621901855, 622127571, 621520004, 620472260, 620028343, 619197311, 618625717, 618116188, 616771469, 614623528, 612540283, 610273666, 607651901, 605114288, 602724533, 600596886, 598448563, 595867500, 592886620, 590094223, 587409897, 584305077, 580644073, 577422104, 575151672, 572960930, 570413094, 568004532, 565782433, 563512573, 561465073, 559586563, 557726593, 555836334, 554404182, 552873192, 551060066, 549523430]
1230.6E49523430j573067j586532j542359j005287r94530o86569n97496j142158l96500
1239.3E39998932l56827q33626o34002o7711q9607P5912O0158k30294L02544l9749
1248.9E38185730J45187j38588k75192L59497M51775J018791P06558P43637Q54416
1257.6E42051811P15599N1537j64948N64347M47998J157036J070594J465683J981697
1266.3E49341354J472741J241226P09495Q31108N31006R06105J327973J752548K444649
1274.9E60558205J825828J782418J889724J748429J089325O35833P78046J315803J890641
1283.6E73514252J803627K246551K200852J784401J225509M87786J26991L45306P08657
1292.3E84443932O18515R13429J307030J128501N74952L24707j78719m13895n83190
$$ y = [549523430, 547950363, 546363831, 544821472, 543816185, 542821655, 542135086, 541537590, 540395432, 539998932, 539642105, 538808479, 538174477, 538106766, 538017159, 538093071, 538153229, 537922935, 538225479, 538185730, 538330917, 538192329, 537917137, 538276634, 538728409, 539747200, 540453758, 541197395, 542051811, 542767410, 542818947, 542653999, 543218346, 543666344, 544823380, 545893974, 547359657, 549341354, 550814095, 552055321, 552764816, 553595924, 554126930, 555033035, 556361008, 558113556, 560558205, 562384033, 564166451, 566056175, 567804604, 568893929, 569529762, 570307808, 571623611, 573514252, 575317879, 577564430, 579765282, 581549683, 582775192, 583262978, 583389969, 583735275, 584443932, 585062447, 585975876, 587282906, 588411407, 588986359, 589311066, 589132347, 588718452, 588135262]
1301E88135262j070710l45154J82229K91366K81677j10244o90575j558914j538506
1309.7E83576431j574402j708564j526680j280289q09670p48214j161843j857223j329270
1318.3E71580276n33790K68974J616516J798210K347451K395553K199898K073250J120682
1327E84867020M17061k87781l46375m90608o15807L00827J245804K149849K416191
1335.7E89656181K014618J310997J259232J149254O73599Q98743J469917J584129J808892
1344.4F01825562J610260Q95004Q58002m7226j051445j047364n28450j205024j152039
1353.1F00157280o95343j467590j110115j558114k454452l108254l052215l426247
1360.8E83284950l664932l396950m071197j719132j686935k606430k212296l013763
$$ y = [588135262, 587064552, 586719398, 586901627, 587192993, 587474670, 587364426, 586673851, 585114937, 583576431, 582002029, 580293465, 578766785, 577486496, 576676826, 575928612, 574766769, 572909546, 571580276, 571046486, 571315460, 572931976, 574730186, 577077637, 579473190, 581673088, 583746338, 584867020, 585284081, 584996300, 584649925, 584159317, 583543510, 583844337, 585090141, 587239990, 589656181, 591670799, 592981796, 594241028, 595390282, 596063881, 596962624, 598432541, 600016670, 601825562, 603435822, 604330826, 605188828, 605141602, 604090157, 603042793, 602514343, 601309319, 600157280, 599461937, 597994347, 596884232, 595326118, 592871666, 589763412, 586711197, 583284950, 579620018, 576223068, 572151871, 570432739, 568745804, 566139374, 563927078, 560913315]
1368.5E60913315k800598j540375j457253p91854p29294j078797J64566P69501J93024
1377.2E53642235k40097K92053K10495M44565N96199K90985O78902J022491J207275
1385.8E58145103M70925j78299J251831J886215J594772J457253J443748J194230j55297
1394.5E67110481m31862J465493P3127m05960j018715m05693P73163m6387R7657k08969
1404.2E67002335j285210j122627o05316q00515r64851o44074m97703L74451L69911
1412.8E61826401K07100k51885j022377j381149j620445n67971l420295O48689J724129
1421.5E56142197K48794m29840j733360K79426p18345j501045j62011p12890j110306
1430.2E50302620l33519J151161k5558j38665L84331q11500l296090p16552K067985
$$ y = [560913315, 558112717, 556572342, 555115089, 554323235, 553593941, 552515144, 552679710, 553449211, 553642235, 553402138, 553694191, 553904686, 554349251, 554945450, 555236435, 555915337, 556937828, 558145103, 558616028, 558437729, 559689560, 561575775, 563170547, 564627800, 566071548, 567265778, 567110481, 566678619, 568144112, 568217239, 567811279, 566792564, 566386871, 567160034, 567113647, 567211304, 567002335, 565717125, 564594498, 563989182, 563188667, 562223816, 561579742, 561082039, 561456490, 561826401, 562033501, 561781616, 560759239, 559378090, 557757645, 557189674, 553769379, 554418068, 556142197, 556390991, 555961151, 554227791, 554507217, 553788872, 552287827, 552125816, 551412926, 550302620, 549969101, 551120262, 551094704, 550956039, 551340370, 550528870, 547232780, 546516228, 548584213]
1438.9E48584213K00577J071777J818657R79348J813735L55492J098900P41425M03556
1447.6E57067680L78266J714668K819366J406136K456780J587829J790123N94406j144905
1456.2E68670349j966247j619187N618172K413101L753548K786026K493972L073082
1464E85222816m61463L368644K981148L651657K970390L468514M645767L028031L889198
1472.6F12764702K736015O149750L551674J673202L548279L353768L421859K592583
1480.3F39791832L389320K930909L198165K519913J173859J880264J94626P89413K088013
1489F57956314L31879P56149K984085K874146N81436J74026n78689m276657J609420
1497.7F62412109m2877m7226K565537R80987k04010n56946M47693j31759j0095597
$$ y = [548584213, 548784790, 549856567, 551675224, 552654572, 554468307, 554823799, 555922699, 556664124, 557067680, 557445946, 559160614, 561979980, 563386116, 565842896, 567430725, 569220848, 569815254, 568670349, 566704102, 565084915, 570703087, 573116188, 576869736, 579655762, 582149734, 585222816, 584761353, 588129997, 591111145, 594762802, 597733192, 601201706, 605847473, 608875504, 612764702, 615500717, 621650467, 625202141, 626875343, 630423622, 633777390, 637199249, 639791832, 643181152, 646112061, 649310226, 651830139, 653003998, 654884262, 655078888, 655868301, 657956314, 658288193, 659044342, 662028427, 664902573, 665484009, 665658035, 665079346, 660802689, 662412109, 662369232, 662322006, 664887543, 665868530, 665664520, 665107574, 665555267, 665423508, 655327911]
1506.4F55327911p534866M595566L101578K5329J301727o20040j962204m64936k189560
1515.1F51580505j705856l016968k704315J834946J705169l308639l863907n01633
1522.8F40019302K42157J62659m825554j60370k23312k361374n64766l78570p38373
1531.5F31171799k209053k723275n464706J26190j426964j925392L16048q791885o353379
1540.1F02719383r24339j58234l650665j539993l237763o632194j58577k521057j345978
1548.8E82550583m243622o384621k044944k901154j674995q457756k488594m89388
1556.5E53865509j793594q921166j3510895J0035057Q41103K266426p04803o05545
1564.2E41472092j373406m40063J574783o54106o0921l615913K164535Q08449r90906
$$ y = [655327911, 647793045, 652388611, 655490189, 655515518, 656817245, 656197205, 654235001, 653770065, 651580505, 649874649, 646857681, 644153366, 645988312, 647693481, 644384842, 640520935, 640019302, 640261459, 640424118, 635598564, 635438194, 635214882, 632853508, 632288742, 631910172, 631171799, 628962746, 626239471, 620774765, 620900955, 619473991, 617548599, 617864647, 609072762, 602719383, 601795044, 601636810, 597986145, 596446152, 593208389, 586576195, 586417618, 583896561, 582550583, 578306961, 571922340, 569877396, 566976242, 565301247, 556843491, 554354897, 553865509, 552071915, 543150749, 529639854, 539674911, 540516014, 542782440, 542077637, 541472092, 540098686, 539658623, 541233406, 540579300, 540518379, 536902466, 539067001, 539875450, 538884544]
1572.9E38884544m51469j396065n50690o209411K880821J204109N3368L05j641884
1581.6E32773628l54004j805839n48096o91490j19248k45170j455345M2762q97712
1590.3E26699486M3449j573944q92830q16955j436272J77193r59168O16303l29247
1599E21528015j62277p38373p51610J04332j045723M89769o01272m2382l52211L81241
1608.6E18809509J26496j186867N61447q30650K27661m38042Q47435J044769m654884
1617.3E14506874K290573Q18291Q24966n05104J61438n51986k345849J990700R84116
1626E18174019J712036o06155K94418J230202K57072P15370K8992J767311J705093
1634.6E25278358k655830k2507K920418J728783J262436K026787R67979J654205R43375
$$ y = [538884544, 538433075, 537037010, 536486320, 530276909, 533157730, 534361839, 534415207, 534415512, 532773628, 532419624, 530613785, 530065689, 529374199, 529254951, 529009781, 527554436, 527597198, 526699486, 526742935, 525168991, 524276161, 523459206, 522022934, 522200127, 521240959, 521857262, 521528015, 521365738, 520627365, 519875755, 519980087, 518934364, 519424133, 518822861, 518780479, 518428268, 518809509, 518936005, 517749138, 518310585, 517479935, 517707596, 517269554, 518116989, 519161758, 514506874, 516797447, 517615738, 518440704, 517935600, 518097038, 517545052, 515199203, 517189903, 518174019, 519886055, 519279900, 519574318, 520804520, 521061592, 521776962, 521805954, 523573265, 525278358, 522622528, 522600021, 525520439, 527249222, 528511658, 530538445, 531506424, 533160629, 534104004]
1643.3E34104004J985512K841034k61498L28522P04002L062783K631683K804298L592568
1652E51792908j932602p244187N373459N609741L549195K324600K235069J514626J139259
1660.7E64362068J756516J044845R61914L565941L081627J998634K440834K181778
1668.4E81394157N8823J716461K446251K043877K832413L444366R29260K04926L994713
1677.1E99065247L148460K645493J307373M63714K531052K524185o32706m200782O467704
1685.8F13319740M874649K666970M74510J378059K08931M40712J312981K79541J957435
1694.4F26913528M52500m818230J208191K177467K767373n395623p088852L343087
1702.1F19559441K062721j195946k939110j440773l510551j485291j353492l413277
$$ y = [534104004, 536089516, 538930550, 538669052, 538997574, 539701576, 542764359, 545396042, 548200340, 551792908, 549860306, 542616119, 547989578, 553599319, 557148514, 559473114, 561708183, 563222809, 564362068, 566118584, 567163429, 568125343, 571691284, 574772911, 576771545, 579212379, 581394157, 581452980, 583169441, 585615692, 587659569, 590491982, 593936348, 594865608, 595070534, 599065247, 602213707, 604859200, 606166573, 606630287, 609161339, 611685524, 611052818, 606852036, 613319740, 618194389, 620861359, 621335869, 622713928, 622922859, 623363571, 624676552, 624956093, 626913528, 627366028, 622547798, 623755989, 625933456, 628700829, 623305206, 616216354, 619559441, 621622162, 620426216, 617487106, 616046333, 612535782, 611050491, 609696999, 606283722]
1709.9F06283722m791412l156891k866783l047944m901542n160408j20888k633514
1717.6E79604340r499512j190376p33567k124710k447319k713051k850074j706582
1725.3E56339149j480140j863709j979484j026993k992973k654763L43361l5934m247017
1734E40401497n318451K733688J233826r0103O7291j461220k299614J426621J202164
1742.7E37895699j093369J207123J617927J502076L76548M17672J536521K254258K486610
1751.3E48201065P65686M776116L976478L946800M097138K624206N945130N262794
1759E79595413O173783N475082M949875O767120P321320P677803O582298O804276N703201
1767.7F37050171O617279O770248O171799M503632L669128N492935N719605N348816
$$ y = [606283722, 601492310, 598335419, 595468636, 592420692, 587519150, 582358742, 582237854, 579604340, 570104828, 568914452, 568180885, 566056175, 563608856, 560895805, 558045731, 556339149, 554859009, 552995300, 551015816, 549988823, 546995850, 544341087, 544684448, 544648514, 540401497, 535083046, 537816734, 539050560, 538960457, 539027748, 537566528, 535266914, 536693535, 537895699, 536802330, 538009453, 539627380, 541129456, 541506004, 541923676, 543460197, 545714455, 548201065, 548966751, 553742867, 557719345, 561666145, 565763283, 568387489, 574332619, 579595413, 585769196, 591244278, 596194153, 602961273, 610282593, 617960396, 624542694, 631346970, 637050171, 643667450, 650437698, 656609497, 661113129, 664782257, 670275192, 675994797, 681343613]
1775.4F81343613K492218M440307L412781L006058L003998J059570L772354L142242
1783.2G05673141K542267N31464J019821K597656J401902J733932J511841J327591
1790.9G18339615O86340j342850J348725L644485J484833n07049J550521J519776j6938
1799.5G26707458m88586K181244J205215P07627J853637O00663P70645l6850j79520
1808.2G33321533J252823Q71201o28281Q08105J913071Q79669J049958J36032J5335
1816.9G39619446m03519O3706J230697M63639J293029N63126J448135J780091k458649
1825.6G43599701k47269J450577J386795m63333l439560J705627L128281J504517M58145
1834.3G49083481J38702J23444l39813p89414R88083Q92944P12586P97500J247483
$$ y = [681343613, 683835831, 688276138, 691688919, 694694977, 697698975, 698758545, 702530899, 705673141, 708215408, 708746872, 709766693, 712364349, 713766251, 715500183, 717012024, 718339615, 719025955, 717683105, 719031830, 722676315, 724161148, 723654099, 725204620, 726724396, 726707458, 726218872, 728400116, 729605331, 730312958, 732166595, 732767258, 733537903, 733501053, 733321533, 734574356, 735445557, 734817276, 735625381, 737538452, 738418121, 739468079, 739604111, 739619446, 739215927, 739279633, 740510330, 740973969, 742266998, 742830124, 744278259, 746058350, 743599701, 743352432, 744803009, 746189804, 745726471, 742286911, 743992538, 747120819, 748625336, 749083481, 749222183, 749345627, 749005814, 748216400, 749204483, 750097427, 750810013, 751607513, 752854996]
1842.9G52854996M55093m508972J815185K128144m48456k49329P48520J330490L30582
1851.6G54456253P65991N30548M34494K74582o92444k76336n14755L73001M65622O00814
1861.3G56417770P36695L20587O85348M64936P9040j137466k56653j052780j303940
1869.9G54953537J747818J780777J090546K29873L46527j95083l10593r6130l00827
1878.6G59246445J33209K4490Q78144M72717K76642J28784m84238j04828l00598O86875
1888.3G60957642o64750j637115J117020J189346M82101L97644j43966j092530J73645
1896.9G60779037M12751J11160k4872o561N36194O9961L24021l84140k70768J98517
1906.6G61745300o90994j46942L18069L10288M93164P94296l17612l71246l586J12915
$$ y = [752854996, 753310089, 748801117, 750616302, 752744446, 752295990, 752046661, 752795181, 754125671, 754456253, 755222244, 755752792, 756187286, 756461868, 755769424, 755493088, 754978333, 755351334, 755816956, 756417770, 757154465, 757475052, 758160400, 758625336, 758704376, 757566910, 757310257, 756257477, 754953537, 756701355, 758482132, 759572678, 759802551, 760149078, 759953995, 759643402, 759547272, 759246445, 759379654, 759404144, 760282288, 760755005, 761031647, 761160431, 760676193, 760571365, 760270767, 760957642, 760292892, 758655777, 759772797, 760962143, 761444244, 761841888, 761697922, 760605392, 760779037, 761191788, 761302948, 761278076, 761271515, 761807709, 761877670, 762201691, 761817551, 761546783, 761745300, 761054306, 760907364, 761225433, 761535721, 762028885, 762823181, 762505569, 762134323, 762130737, 762243652]
1916.2G62243652J106110j867371q94165J604004J031571Q00781j148529r90677M75159
1924.9G62360535K94418k01492j71051J13067L60184M96750P1792J61896J4572k76260
1934.6G63224411j042480n50156M70734K23312M99420N82275J229020n77774k164536
1943.2G61894226N37872K63672l70865k30941M99267O23017K75955M13513j8921m18014
1952.9G63468781m37699j99280o72912k64359J31607J76010N66025K36588L51486l92227
1962.5G62964020o68411m47007k73742P9574m35638k2583L91617Q06503N21240P7973
1972.2G62993546j10322n16357m76227q00552R8572N24139M15878M78058O0425K24838
1981.8G62891998k06222l81546p00913n63888K5253q9111R9487M89502J073608j78222
$$ y = [762243652, 763349762, 761482391, 760588226, 762192230, 763223801, 764024582, 762876053, 761885376, 762360535, 762654953, 762453461, 762282410, 762395477, 762755661, 763252411, 763324203, 763486099, 763500671, 763224411, 762181931, 761631775, 762102509, 762325821, 762825241, 763407516, 764636536, 764058762, 761894226, 762432098, 762695770, 762324905, 762093964, 762593231, 763216248, 763492203, 763905716, 763886795, 763468781, 763031082, 762831802, 762158890, 761894531, 762026138, 762202148, 762768173, 763004761, 763356247, 762964020, 762295609, 761848602, 761574860, 761654434, 761218796, 761196213, 761587830, 762394333, 762915573, 762993546, 762883224, 762366867, 761890640, 761090088, 761188660, 761712799, 762128677, 762606735, 762667160, 762891998, 762685776, 762304230, 761603317, 761039429, 761064682, 760975571, 761075058, 761564560, 762638168, 762459946]
1991.5G62459946j393280M2648Q8806p40662n30319K34833N44739Q35647M10843m8752
2001.1G61904449j3046l90396n67856n60226l62168j86615J36109M72259M82712K49558
2010.7G61164780j03608k07214l25928l51944l35769m01993m14429L41492N34134j6480
2020.4G59883041K35825J40915m55322q56400l04489O1340J37787J63117j86921N48706
2030G59367599K98844k15836m22516l53927n7984o74133J64490K29645K04544M37164
2039.7G58977890k25983q0795n36575r6283m3259n69153j99203L35922Q72345L11890
2049.3G58746796k15531o00815n75103m22440j28326K50473J30996K86103L6010M44565
2059G57952728P2785l84369L9291n49545l50952k33383j90201L84979O30341K48260
$$ y = [762459946, 761066666, 761109314, 761198120, 760457458, 759927139, 760161972, 760706711, 761542358, 761953201, 761904449, 761891403, 761501007, 760933151, 760372925, 760010757, 759824142, 759960251, 760432510, 760915222, 761164780, 761061172, 760853958, 760528030, 760176086, 759840317, 759438324, 759023895, 759365387, 759899521, 759883041, 760118866, 760259781, 759804459, 758948059, 758643570, 758704910, 758842697, 759005814, 758818893, 759367599, 759666443, 759450607, 759028091, 758674164, 758616180, 757942047, 758106537, 758336182, 758540726, 758977890, 758751907, 758671112, 758134537, 758038254, 757994995, 757425842, 757226639, 757562561, 758434906, 758746796, 758531265, 757930450, 757355347, 756932907, 756804581, 757055054, 757186050, 757472153, 757508163, 757952728, 758025513, 757641144, 757680435, 757130890, 756779938, 756546555, 756356354, 756741333, 757371674, 757619934]
2068.6G57619934j55716j24130m53720l85361m03976L9444M11071K80533J78299k1896
2078.2G56984482M42581p9422o08063q83102q09784J03531L16696N80368N81131L72620
2087.9G57001038o5689k32468n69916j004410l95431k96478K46658N99212L91922K66724
2097.5G55941162j76620q1787k54975m96521p77054n68695L16696O38733M40140L50418
2107.2G55331497J87760m56925m00162n01480q33740n88913k20489R9792K53220O80237
2116.8G53550797O51931K47040n73196r09958o90232q63723l41721J90506P51648O47278
2126.5G52660370N07431O41098k67410p80793r57717o39267l40500M8523K36358J47095
2136.1G51255188P44781L06473M5471j89895q20236o14167k29721O9351K25297M14962
$$ y = [757619934, 757464218, 757340088, 756886368, 756501007, 756097031, 756136475, 756547546, 756828079, 757006378, 756984482, 757427063, 757347641, 756739578, 755856476, 755046692, 755150223, 755466919, 756047287, 756628418, 757001038, 756935349, 756702881, 756132965, 755128555, 754733124, 754436646, 754683304, 755282516, 755674438, 755941162, 755764542, 755682755, 755427780, 754931259, 754154205, 753585510, 753902206, 754540939, 754981079, 755331497, 755519257, 755062332, 754662170, 754160690, 753326950, 752738037, 752517548, 752617340, 752870560, 753550797, 754202728, 754449768, 753876572, 752966614, 752276382, 751412659, 751070938, 751261444, 752013092, 752660370, 753167801, 753808899, 753541489, 752760696, 751802979, 751163712, 750823212, 750871735, 751108093, 751255188, 751999969, 752306442, 752351913, 752162018, 751341782, 750727615, 750497894, 750567245, 750792542, 751207504]
2145.8G51207504K82288M95987J18408o12717m76913o07224l18527m1809J74332L35312
2155.4G50556641L41262L06473r9334j06049l69034n03311l84827r4528M05502M96827
2165G50549622N37033L82080R0942l38516m31671k39868j60141j29090P6828K33536
2174.7G50570755J32446N68924M94843Q7127k79235l07770Q240n23072k08664N72358
2184.3G51115952N24749J0834N7831M34952J74713p2251k80380m4479k73285l4332
2194G51614304N98526L49960K43225k85187j92489k17286k18811J45417j03760L81164
2203.6G52315063N75486L60107J18485Q1939n188k42767j87225k03476J95999K20718
2213.3G53229141L99933M01230Q0719k70462m83246j03912l62625R1476K34375K95029
$$ y = [751207504, 751489792, 751985779, 752104187, 751491470, 751014557, 750407333, 750088806, 750046997, 750221329, 750556641, 750897903, 751204376, 751105042, 750998993, 750629959, 750126648, 749741821, 749647293, 750052795, 750549622, 751086655, 751468735, 751559677, 751221161, 750789490, 750549622, 750389481, 750260391, 750337219, 750570755, 750703201, 751272125, 751766968, 751854095, 751574860, 751267090, 751275330, 750752258, 750543594, 751115952, 751640701, 751651535, 751709366, 752144318, 752319031, 752246780, 751966400, 751921921, 751648636, 751614304, 752212830, 752562790, 752806015, 752520828, 752328339, 752111053, 751892242, 752037659, 751933899, 752315063, 752890549, 753250656, 753369141, 753451080, 753445892, 753203125, 753015900, 752812424, 753008423, 753229141, 753629074, 754030304, 754111023, 753840561, 753357315, 753253403, 752890778, 752982254, 753216629, 753511658]
2222.9G53511658O56738L62396K52838n33828k33994l17535o62537K73132O16379N13840
2232.5G54439087J53198N64652K31170l32260n59540q52432L0594J20697m5319K43302
2242.2G53993149Q09860O58951O3476o6757o21414n58853l48969J71662N8517j80816
2251.8G53978806M17404L46374L86658J78375L6469l20206q15125o17752r6130K68860
2261.5G53763733K55356O07528N62211J07269p10297n15518k04391o75431R537L63159
2271.1G53563156O53458M56238M06341J33743m51278m3259o42395l97263m4174L20206
2280.8G53954773N66940M42429N36804n22537k04163l61557m73938j56021n07812l44620
2290.4G52930298m85230M75083L5095j36490j28784o36292l52630j070099j00861j47323
$$ y = [753511658, 754168396, 754530792, 754783630, 754249802, 754015808, 753698273, 753035736, 753308868, 753925247, 754439087, 754592285, 755156937, 755388107, 755055847, 754496307, 753643875, 753674469, 753795166, 753749847, 753993149, 754803009, 755461960, 755525436, 755458679, 754837265, 754278412, 753929443, 754101105, 754159622, 753978806, 754396210, 754742584, 755129242, 755307617, 755344086, 755023880, 754208755, 753591003, 753494873, 753763733, 754019089, 754626617, 755188828, 755296097, 754585800, 754070282, 753865891, 753190460, 753199997, 753563156, 754216614, 754672852, 755079193, 755212936, 754761658, 754718399, 754076004, 753678741, 753634567, 753954773, 754521713, 754964142, 755500946, 754978409, 754774246, 754412689, 753938751, 753782730, 753274918, 752930298, 752445068, 752920151, 752955246, 752818756, 752689972, 752053680, 751701050, 750630951, 750530090, 750382767]
2300G50382767p9804J55182l03650J06812p37076n12390j301041j173401p88574r61838
2309.7G44786987L82004j67694J46103o15006o70700k45056r41696n89523j435929
2318.4G40649490j300048j537476n79147l07541n93567k21329j151810l7994j281586
2327.1G33638992j339035j024246p74002N54810k14234P72934L52860j0071j892777
2335.7G30065231k525482N26047J206283p79800j893997J350860L67890j33057M94614
2344.4G28678589J64490K064056K182846L506088J936722j472015k989197l373795
2352.1G30697784k784271j996002k547226k781906j288452p06482m52652o15463K24990
2360.8G17750320M3564j016693K057572Q79364L24783J257172J491165K221908O36444
$$ y = [750382767, 750302963, 750458145, 750154495, 750261307, 749524231, 749011841, 747710800, 746537399, 745748825, 744786987, 745168991, 745001297, 745147400, 744532394, 743861694, 743616638, 742674942, 742085419, 740649490, 739349442, 737811966, 737232819, 736925278, 736331711, 736110382, 734958572, 734920578, 733638992, 732299957, 731275711, 730501709, 731056519, 730842285, 731615219, 731968079, 731958008, 730065231, 727539749, 728065796, 729272079, 728492279, 726598282, 727949142, 728317032, 728183975, 728678589, 728843079, 730907135, 733089981, 736596069, 738532791, 737060776, 734071579, 730697784, 727913513, 725917511, 723370285, 720588379, 719299927, 718593445, 718140793, 717525330, 717750320, 717793884, 716777191, 718834763, 719714127, 720038910, 721296082, 722787247, 725009155, 725645599]
2369.5G25645599J913834K989044J864243Q63342J726608J787491P58743J324082J532135
2378.2G40405121J640625J423721K036133J824951O82221M45251J221q4763l99399
2386.8G47975082L75061P57752M04053N08194j77536J62887j43890o57807q25653r64431
2396.5G47413712R3612N22309L59878M3717L48358J31530o77642p99103n51605j16578
2406.1G46768188o00128k56881O20575N55954J70745j1825k90375o83289l59268p73925
2415.8G45139771o17905K35824N00718N85022O027m13208n57327k82059m11530m67300
2425.4G43718033j14823l7307J82953n494J57013j68304j63269M120p43714m49600
2435.1G42379608k50244k41775o3630J86386L38669k0065k36740l00446l22647n19104
$$ y = [725645599, 727559433, 730548477, 732412720, 733276062, 735002670, 736790161, 737548904, 738872986, 740405121, 742045746, 743469467, 745505600, 747330551, 748012772, 748458023, 748459244, 748374481, 747975082, 748350143, 749107895, 749511948, 750020142, 749842606, 750005493, 749861603, 749203796, 748378143, 747413712, 747507324, 748029633, 748389511, 748433228, 748781586, 748913116, 748235474, 747436371, 746884766, 746768188, 746168060, 745911179, 746531754, 747087708, 747258453, 747246628, 746956253, 746272964, 745913696, 745139771, 744521866, 744757690, 745258408, 745843430, 745849457, 745436249, 744878922, 744596863, 744185333, 743718033, 743603210, 743565903, 743748856, 743743362, 743900375, 743732071, 743568802, 743572922, 742829208, 742379608, 742129364, 741887589, 741823959, 742010345, 742349014, 742328949, 742092209, 741791763, 741469116, 740950012]
2444.7G40950012k63519k33841j19934J94168l5172j74713l93600k41394k99835j1750
2454.3G39370422J30539k32238j05744l02353j3199j09329m79584n52978l69415L8833
2464G37374954o4926J00174j19247K6168O5918j70211j50223o44837n13687m47998
2473.6G35456085l04413j61361J14975J02462n18341k19192k32773k21176m84467n53207
2483.3G32978592J1520l7155L06702L94440j88218o88934k31400k70385p55615j01700
2492.9G31417847m2725l15399o6071M32892N4093m29459j02005k02560o02875o85501
2502.6G29458237j88065k97012R8877M64172M7531L1967o99844m44031o8512l06396
2512.2G28096924l32184m86450Q5449K57111L49426J46026k69317m25186o65512o90155
$$ y = [740950012, 740686493, 740452652, 740332718, 740526886, 740491714, 740317001, 739923401, 739682007, 739382172, 739370422, 739500961, 739268723, 739162979, 738860626, 738847427, 738738098, 738258514, 737705536, 737336121, 737374954, 737310028, 737410202, 737290955, 737317123, 737383041, 737212830, 737062607, 736417770, 735904083, 735456085, 735151672, 734990311, 735105286, 735207748, 734689407, 734470215, 734237442, 734016266, 733531799, 732978592, 732990112, 732952957, 733259659, 733654099, 733465881, 732776947, 732545547, 732275162, 731519547, 731417847, 731375122, 731059723, 730993652, 731426544, 731480637, 731051178, 730949173, 730746613, 730143738, 729458237, 729270172, 728973160, 729072037, 729536209, 729583740, 729615707, 728915863, 728471832, 728403320, 728096924, 727764740, 727278290, 727363739, 727620850, 727970276, 728116302, 727846985, 727421799, 726756287, 726066132]
2521.9G26066132q25043j26877M35486L59039J99661N7602J23978k62909o95343p47147
2531.5G24584579j48849j4877j04599O7138j43737M7912M4480r6360l10974m63333
2541.1G23461380k46429k51313j88369p0954Q3695L30124K54058m81186o86111m52576
2550.8G21752319l55835k07595m67759j6174L35846k8305j15891O4621q087n85174
2560.4G20367966m53263k24762k63824m6387O3324O8588J05668l00675q61816n18952
2570.1G17935867l41644J82343L57742l99094k82135j38473L4866k57492m34189O8207
2579.7G16725998m2114n26429p69729k07749K1515J21231J75324n7831l10745o77262
2589.4G14452209k94113j74560j8158j04370k99530J64795j65329n16358l49197k30026
$$ y = [726066132, 725241089, 725114212, 725549698, 725908737, 726108398, 726166000, 726289978, 726027069, 725331726, 724584579, 724435730, 724420853, 724316254, 724383392, 724239655, 724287567, 724332047, 724235687, 723924713, 723461380, 723214951, 722963638, 722775269, 722704315, 722788010, 723118134, 723372192, 722891006, 722204895, 721752319, 721396484, 721188889, 720721130, 720704956, 721040802, 721012497, 720896606, 720961227, 720953140, 720367966, 719914703, 719689941, 719426117, 719379730, 719443054, 719511642, 719617310, 719316635, 718454819, 717935867, 717594223, 717776566, 718134308, 717735214, 717453079, 717314606, 717349472, 717091980, 716657791, 716725998, 716683884, 716157455, 715387726, 715179977, 715201492, 715322723, 715498047, 715440216, 715129471, 714452209, 714158096, 713983536, 713965378, 713861008, 713561478, 713726273, 713560944, 713044586, 712695389, 712465363]
2599G12465363m95377k09732L2959k81296K1362J69831m1199p07703o60247m29383
2608.6G09864578n05905l63769m48304L43399J73035l86047k83509m35485n63736q39768
2618.3G06554489l97186m2267N7144l82843l57056J36796l65372j81656m64401p72629
2627.9G03785019m93088l59955l98788l97644K94418m577j18180r7275n47409q55178
2637.6G00807343j274109p30057r7656L72848K1286k91443L7003m50897o00586o06766
2647.2F97186966n54352k31781k594l50799n95322p4082r9563j79749j71203n04227
2656.9F94423294j033173q88290m00619j63346K92893J54113k6626l54309l71857k25525
2666.5F91406555p00912p42569p02515o1340J36871l69491l09372l49732l28598k08206
$$ y = [712465363, 711969986, 711760254, 711793213, 711511917, 711533279, 711703110, 711661911, 710954208, 710293961, 709864578, 709358673, 708994904, 708546600, 708889999, 709063034, 708676987, 708393478, 707957993, 707394257, 706554489, 706157303, 706115036, 706172180, 705789337, 705432281, 705569077, 705203705, 705022049, 704557648, 703785019, 703291931, 702931976, 702533188, 702135544, 702429962, 702425385, 702307205, 702209930, 701662521, 700807343, 699533234, 698803177, 698705521, 699078369, 699099655, 698808212, 698845215, 698394318, 697793732, 697186966, 696632614, 696400833, 696398239, 696047440, 695452118, 695378036, 695278473, 695098724, 694927521, 694423294, 693390121, 692501831, 692101212, 691937866, 692230759, 692384872, 692358246, 692003937, 691632080, 691406555, 690705643, 689963074, 689260559, 689199219, 689336090, 688966599, 688657227, 688307495, 687978897, 687770691]
2676.1F87770691l2272l83988q63190m60281j77841m98581k19955Q39m55323l10974
2685.8F84369125m65774p34787q05512l78341M99649K92663j54876o49033l76816k69012
2695.4F81327286p06787l02964l91311m12293m79278k99225J02463J37024J89743k62375
2705.1F78902283m80423q91342q51975k91748J50070L17002k16828l00445n99594m59061
2714.7F75277939k17133n23605m56925m20837J42288l7307l32489P8125k97013n79605
2724.4F72633438l19595k54441o71691o52085k20947j11694L6087K63366P0877m06799
2734F70366516m15878j37863j16806l23105m50516o07834j89209O1722k63367J70746
2743.7F68094406m3793o05239m60129m6997r5444k76871K75650l29208n65415j23367
$$ y = [687770691, 687738419, 687354431, 686491241, 686030960, 685853119, 685354538, 685134583, 685135422, 684680099, 684369125, 683903351, 683168564, 682363052, 681984711, 682484360, 682777023, 682622147, 681973114, 681596298, 681327286, 680620499, 680317535, 679926224, 679513931, 679034653, 678735428, 678837891, 678974915, 679164658, 678902283, 678421860, 677530518, 676678543, 676386795, 676536865, 676853867, 676637039, 676336594, 675737000, 675277939, 675060806, 674537201, 674080276, 673659439, 673801727, 673764420, 673431931, 673510056, 673213043, 672633438, 672313843, 672059402, 671387711, 670735626, 670514679, 670402985, 670439072, 670702438, 670773315, 670366516, 669950638, 669812775, 669695969, 669372864, 668922348, 668314514, 668125305, 668187027, 667923660, 668094406, 668050613, 667445374, 666985245, 666938248, 666842804, 666565933, 666841583, 666512375, 665946960, 665823593]
2753.3F65823593n38483m58831j76926K33612K02484j13830k30713l30048l32641n02167
2762.9F63576050k08893j47400m53873l58123j19400j47629o8665o6299k70462J18942
2772.6F61854248k0447m21753m66690n62668p55539n47409J9227l99323k59705J04599
2782.2F58544540l34854o66275n37262j89819k94418J22528m19007n72662K22931m76303
2791.9F55399399m88968m83322o51245o27594m75693K0676o34537p14646k33993l47443
2801.5F50762634q69293r92966n17120l54538k75879p40051n23148J00861m54178r14536
2811.2F45221786q64562p27234m09089m37393j011505q59909n48248l64990k37809
2819.8F39761047q08639p79190o41556r27124r32617p25098p00607q17719r12208j012116
$$ y = [665823593, 665285110, 664826279, 664649353, 664882965, 665085449, 664971619, 664740906, 664410858, 664078217, 663576050, 663367157, 663219757, 662765884, 662407761, 662288361, 662140732, 662072067, 662005768, 661735306, 661854248, 661833801, 661412048, 660945358, 660382690, 659627151, 659079742, 659098969, 658699646, 658439941, 658544540, 658209686, 657543411, 657006149, 656816330, 656521912, 656644440, 656225433, 655652771, 655875702, 655399399, 654910431, 654427109, 653775864, 653148270, 652672577, 652693253, 652058716, 651344070, 651110077, 650762634, 649893341, 648900375, 648383255, 648028717, 647752838, 647012787, 646489639, 646590500, 646136322, 645221786, 644357224, 643629990, 643220901, 642783508, 641772003, 640912094, 640363846, 639998856, 639761047, 638952408, 638173218, 637531662, 636604538, 635671921, 634946823, 634246216, 633428497, 632516289, 631504173]
2829.5F31504173m96101m56390j048203j187210j024284j203995j355438p43332q41751
2838.2F23147469j341134j785736j656227j038666j723289j944237j676407j818313
2845.9F10163460k123375k386360k102013k202110j754112j099740j136474r71489
2853.6E96387787n75905l0212K15683L4790m01535o23207q39463r41925o74858n13306
2863.2E92037849l97415o89010q17490m94041n48516j108894j158753n83801n71670
2871.9E85668259j034050j147919m57115n39856j028481m91485j86730k32124m28505
2880.6E80121994m74548r59854r46427K68974j87530j008530o72645k17629o3324o13441
2890.2E75247040p01828k84653l43552l99589p2250j91613p24411n99289k92205l86086
$$ y = [631504173, 631008072, 630551682, 629503479, 628316269, 627291985, 626087990, 624732552, 623989220, 623147469, 621806335, 620020599, 618364372, 617325706, 615602417, 613658180, 611981773, 610163460, 608040085, 605653725, 603551712, 601349602, 599595490, 598495750, 597359276, 596387787, 595811882, 595781670, 595997353, 596032143, 595630608, 595007401, 594167938, 593226013, 592551155, 592037849, 591640434, 590951424, 590133934, 589639893, 589091377, 587982483, 586823730, 586239929, 585668259, 584634209, 583486290, 583029175, 582489319, 581460838, 580969353, 580782623, 580550499, 580121994, 579647446, 578687592, 577741165, 578010139, 577822609, 576814079, 576141434, 575923805, 575860481, 575247040, 574545212, 574260559, 573917007, 573517418, 573445168, 573253555, 572529144, 571929855, 571637650, 571251564]
2899.9E71251564l59688m50287k44522K58408l59459m31213k8306n02243k13165j61362
2909.5E68759727r85374j317253j050835q76465p76977r52072j328965p07817m22630
2918.2E60341339n72090o93932p02743k28195n74456l82270p9728J57738P88918L89328
2927.8E58443909L73192L59573r7504m11873j01127O94008N75523K40211K43683Q30498
2937.5E61150093J096420N32647K65655M49562J022988Q64791L89328O21643Q35076
2946.2E67228203Q33854K78435J4839K24381j50032J71242N77011J07689J40190L42674
2955.8E69768486N73616M96788k4452J05972O17829P19833M13246N83458O50520M80996
2965.5E74386292N88035Q12073J399841Q63915L86276J260643J268234Q86574Q72078
$$ y = [571251564, 570891876, 570441589, 570197067, 570455475, 570096016, 569664803, 569636497, 569134254, 568921089, 568759727, 567774353, 566457100, 565406265, 564529800, 563752823, 562800751, 561471786, 560763969, 560341339, 559769249, 559075317, 558372574, 558144379, 557569923, 557187653, 557107925, 557265663, 558054581, 558443909, 558817101, 559176674, 559079170, 558667297, 558566170, 559260178, 559835701, 560075912, 560319595, 561150093, 562246513, 562779160, 563044815, 563494377, 564517365, 565382156, 565771484, 566393127, 567228203, 568062057, 568340492, 568355331, 568579712, 568429680, 568600922, 569177933, 569285622, 569425812, 569768486, 570342102, 570838890, 570814438, 570920410, 571538239, 572258072, 572671318, 573254776, 573905296, 574386292, 574974327, 575786400, 577186241, 578050156, 578436432, 579697075, 580965309, 581851883, 582723961]
2974.1E82723961O61125P71294Q84857Q52890J078339O62727L78723O42204O53534
2982.8E89309654Q17375N60990M37584N87539M60396K10190K30789R67598P84187J65825
2992.5E94532127J8387K1591L19176L03841K32124j17721l32833o6833M7188k04430
3002.1E94752617l86543K43492K21023m72564k20452L6698l43781l93104j28441o0883
3011.7E93248062n03502p24334j6022k71225o99349j61438j42593m21867n60494m46319
3021.4E89300919l42827q9264K7275k14920o42357j032372l92417l17765l43361O1837
3031E86014748n52483m92134n9509j56365m57763j043931r45091j87416m2572j57165
3040.7E81920319l57438o09092l40653n68542m55818j58120l77693m83894p43065m57764
$$ y = [582723961, 583385086, 584156380, 585041237, 585894127, 586972466, 587635193, 588013916, 588656120, 589309654, 590127029, 590688019, 591125603, 591713142, 592173538, 592383728, 592614517, 593582115, 594366302, 594532127, 594550514, 594572105, 594891281, 595195122, 595427246, 595309525, 594976692, 594909859, 594957047, 594752617, 594366074, 594609566, 594830589, 594358025, 594137573, 594174271, 593830490, 593437386, 593308945, 593248062, 592744560, 592020226, 592004204, 591732979, 591033630, 590872192, 590729599, 590307732, 589747238, 589300919, 588958092, 588868828, 588896103, 588681183, 588038826, 587006454, 586614037, 586296272, 585952911, 586014748, 585462265, 584970131, 584910622, 584754257, 584296494, 583252563, 582307472, 582120056, 582077484, 581920319, 581562881, 580953789, 580613136, 580044594, 579588776, 579430656, 579052963, 578569069, 577826004, 577368240]
3050.3E77368240o51130p30286n92918o45867p8850l13720l17841n66101j071930p78084
3060E71621513m63371j26495o61202r98306p53441l73344m09508p04613l49197o46134
3069.6E66135902m06265k81410q73985l93715l62778p55119j87798p8659q12111p52563
3079.2E61231499n16815j03112j35879j056328o46095k45591m71496n87692p28798
3087.9E56739693n29824m44259o18630o74858o81724j075669o82411l45077m35372
3096.6E51251869j3084m18892o57501q43964r98459k99949j29433n45426p09152o64978
3106.2E45971031q44879n78423l12690k24915n77926p62444j05324o94694o89888m29039
3115.9E40750809q03414m80232r22165r23805n03349k89765l93371p26853l25355l91503
$$ y = [577368240, 576717110, 575986824, 575393906, 574748039, 574669189, 574355469, 574037628, 573471527, 572399597, 571621513, 571158142, 571031647, 570370445, 569372139, 568618698, 568245354, 567835846, 567131233, 566782036, 566135902, 565729637, 565448227, 564574242, 564180527, 563817749, 563062630, 562874832, 562796173, 561984062, 561231499, 560714684, 560611572, 560475693, 559419365, 558773270, 558527679, 558056183, 557468491, 556739693, 556209869, 555765610, 555146980, 554472122, 553790398, 552714729, 552032318, 551687241, 551251869, 551238785, 550819893, 550162392, 549318428, 548319969, 548020020, 547890587, 547345161, 546636009, 545971031, 545126152, 544547729, 544235039, 544010124, 543432198, 542669754, 542564430, 541869736, 541179848, 540750809, 539947395, 539467163, 538544998, 537621193, 537117844, 536828079, 536434708, 535707855, 535382500, 534990997]
3125.5E34990997p08160q47282o10199m25454o99920q54073q55446n64842o89468q55065
3135.2E27881088q10966n92880k43607l16849m29802r40208j057282m83246l79257
3143.9E22626991l75747l12615p42836r78393o43883p77359o30760j79520m45213n05562
3153.5E17035103n42832q63113o69708n44167o64863m22669n85136r02138p64351p26242
3163.1E10349884p22351m45709k42501o08558r35440j016007p49550m58603o08406
3171.8E04562759n92193l45116J5564o64673r04083l51563q49914n70068n10598o09016
3181.5D99181099j90620l62435l40576r01413j157761o52046m48417l92228n01289
3190.1D94234314m32320o25991o79093k58675o55860j019669l41644l18680o48956
$$ y = [534990997, 534282837, 533435555, 532825356, 532399902, 531699982, 530845909, 529990463, 529425621, 528736153, 527881088, 527070122, 526477242, 526233635, 525916786, 525486984, 524546776, 523489494, 523006248, 522626991, 522251244, 521938629, 521195793, 520217400, 519573517, 518796158, 518165398, 517985878, 517540665, 517035103, 516492271, 515629158, 514959450, 514415283, 513750420, 513327751, 512742615, 511840477, 511076126, 510349884, 509627533, 509181824, 508939323, 508330765, 507395325, 506379318, 505629768, 505171165, 504562759, 503970566, 503625450, 503641014, 502976341, 502072258, 501720695, 500870781, 500300713, 499790115, 499181099, 498990479, 498628044, 498287468, 497386055, 496228294, 495576248, 495127831, 494735603, 494234314, 493801994, 493176003, 492496910, 492238235, 491582375, 490562706, 490221062, 489902382, 489253426]
3198.8D89253426q19359p86782j7738j34430m27437p63931q76121l73459q49648n95665
3208.5D83608856j61094l51677n21012p18574m44947q24623j120338n87387l6202j19209
3218.1D78723793m74510m42925n53398o66313o11649l57475n69763m13971r7694p49626
3227.8D73786469o70052k20718j85662l88565n51414o24237n40505m63371p46193l93486
3237.4D69002266l69721p66487q72802o15616j5640M3640j95542m36287l19709p77359
3247D64676743p91436j00631l59688l35694n95169o58531m76036k54249J73034o95839
3256.7D60582504j182899q09975n4779K3460o01425l79791n29251m77562l54462m81453
3266.3D55734367J76964J68495o25305n74722m39530n89447m40101n07393n5313N7792
$$ y = [489253426, 488434067, 487647285, 487629547, 487495117, 487067680, 486303749, 485427628, 485054169, 484204521, 483608856, 483447762, 483096085, 482575073, 481856499, 481411552, 480586929, 479466591, 478879204, 478843002, 478723793, 478249283, 477806358, 477252960, 476586647, 475974998, 475617523, 475047760, 474633789, 474536095, 473786469, 473116417, 472895699, 472710037, 472321472, 471770058, 471145821, 470605316, 470141945, 469395752, 469002266, 468632545, 467866058, 466993256, 466377640, 466362000, 466405640, 466210098, 465773811, 465454102, 464676743, 463885307, 463784676, 463424988, 463089294, 462494125, 461835594, 461359558, 461105309, 461278343, 460582504, 459399605, 458589630, 458534851, 458558311, 457956886, 457577095, 457047844, 456570282, 456215820, 455734367, 455911331, 456079826, 455454521, 454879799, 454440269, 453850822, 453410721, 452903328, 452848015, 452905807]
3276D52905807l46984l00637m15954k68975l38287m87366o20117p02629l64303k67220
3285.6D48793335K13585P6752q78907o38618K85988M98237j02958r02443n98603j87339
3295.3D46559029m75884k08778m76647j35612N87005k72522r55009p12242K5902m87671
3304.9D43447571p15065K60429K11525m14505q62198k01568j69983n33142o12793n20363
3314.6D39889908N12695k34299r24224l88680l49312l40385l42446l59954q00705n47753
3324.2D36114845j75323j06049j5030l18641m42200n98450m94308m44603l21274o32515
3333.8D32566452l73878M11720o57845r45053m37431k03552J63383L9291j14440l44086
3343.5D30104561m15535p18689o47316n00374l86047L16124J61018o86989j143608
$$ y = [452905807, 452558823, 452258186, 451842232, 451573257, 451234970, 450747604, 450127487, 449424858, 449060555, 448793335, 449006920, 449083672, 448204765, 447566147, 447852135, 448350372, 448247414, 447344971, 446746368, 446559029, 446083145, 445874367, 445397720, 445262108, 445849113, 445576591, 444621582, 443909340, 443935242, 443447571, 442732506, 442992935, 443204460, 442789955, 441927757, 441726189, 441556206, 441023064, 440410271, 439889908, 440402603, 440168304, 439244080, 438855400, 438506088, 438165703, 437823257, 437463303, 436662598, 436114845, 435939522, 435833473, 435818443, 435499802, 435057602, 434459152, 433964844, 433520241, 433198967, 432566452, 432192574, 432604294, 431946449, 431001396, 430563965, 430360413, 430523796, 430563087, 430448647, 430104561, 429689026, 428970337, 428323021, 427822647, 427436600, 427752724, 427913742, 427226753, 426083145]
3352.2D26083145m50668J65367m7989o36406o64177J04866l21579l21922O8970m43497
3361.8D23536110k76833j05896m74052k89421J7891o44989o41289j23138k07138k39678
3371.4D20551567m62074m51737m40063k04811Q0833k15950l24516k50855L7384o8130
3381.1D18251648m18778m23355m50592k85072n00717o51817J00631Q5984m44794k04621
3390.7D15058517m6615M9400j82648k89459M1504M7875l8758m01764l42292j56708
3400.4D13739052r6436M6730k20108q84628q68683L98331l319l79868J94626o34765
3410D11290932n70946r7008K55852L70636q0757j63460j55983J49231M6806k37541
3419.7D10807762p79075o52771J91535L63122N26428K31285J15051N5657J8539J62544
$$ y = [426083145, 425632477, 425797844, 425749855, 425113449, 424449272, 424554138, 424232559, 423910637, 423979607, 423536110, 423259277, 423153381, 422679329, 422389908, 422407799, 421762810, 421121521, 420998383, 420791245, 420551567, 420089493, 419637756, 419197693, 418992882, 419073715, 418857765, 418533249, 418282394, 418319778, 418251648, 417832870, 417409515, 416958923, 416673851, 416173134, 415521317, 415621948, 415707932, 415263138, 415058517, 415011902, 415061302, 414878654, 414589195, 414630699, 414678574, 414639816, 414238052, 413895760, 413739052, 413642616, 413689346, 413469238, 412584610, 411715927, 412114258, 412110939, 411731071, 411925697, 411290932, 410719986, 410622978, 410878830, 411249466, 411168709, 411005249, 410849266, 410998497, 411045303, 410807762, 410028687, 409375916, 409567451, 409930573, 410457001, 410688286, 410803337, 410858994, 410877533, 411040077]
3429.3D11040077l59382n56984k11754P6408J26877K70271K11373L65257N43861M4251
3439D11550255k88353q5259K52457l06663m1771K53105N24750P58399r89112k1630
3448.6D11606178O83785M387M69665M03519J90163o9848N38826N78804K5063m16412
3458.2D14014130l30658R72366P98264O32934K11983k05841j05744l34053M35601N87730
3467.9D16676712N93147J20507r8915L85093L40691O50902L04870m6959K1210L62816
3477.5D19310074M03633M64668N72319L02773K66723n87768N97381J053238l929N59616
3487.2D22938728J28365K90375Q75320M04587n7640M39491R27124L53966M29954K80800
3496.8D27011070L13645L80058M25110O12068K78511J62735n65109J17302R15947N03616
$$ y = [411040077, 410680695, 410123711, 409911957, 409988365, 410115242, 410385513, 410596886, 410962143, 411506004, 411550255, 411261902, 411176643, 411429100, 411122437, 411080666, 411333771, 411858521, 412616920, 411627808, 411606178, 412289963, 412294350, 412764015, 413167534, 413357697, 413287849, 413826675, 414405479, 414430542, 414014130, 413683472, 414655838, 415454102, 416087036, 416299019, 416093178, 415987434, 415653381, 416088982, 416676712, 417269859, 417390366, 417291451, 417676544, 418017235, 418668137, 418973007, 418926048, 418947258, 419310074, 419713707, 420178375, 420750694, 421053467, 421320190, 420732422, 421329803, 422383041, 422379112, 422938728, 423067093, 423357468, 424232788, 424637375, 424579735, 425019226, 425946350, 426300316, 426730270, 427011070, 427324715, 427704773, 428129883, 428741951, 429020462, 429183197, 428618088, 428735390, 429651337, 430154953]
3506.5D30154953R27620J513290M18511o40869Q70285Q67042N31235O91757J08414
3515.1D35442238L76625L97072P62176Q49114n8823P9613R53407O10161m33235K29492
3524.8D39207840R79118P89643K30598Q72994Q50296L70903O68792M44184Q25386J132049
3534.4D46371803J411171L14293l00140P84759K36969R19724J115036O43387Q98704
3543.1D52395706J213684O64177o66542L52821K79007R24607R40895J278190J708374
3551.8D59090919j198539R45129J919480R28115P61986l31611J131629J822548J135445
3560.5D66205101P0992J370849O59485p85027K946473J106109o33774J75019k28844
3569.1D70886383K298164J235772J416893J659927Q02231j64604M51927K124710P50389
$$ y = [430154953, 431082573, 432595863, 433014374, 432373505, 433243790, 434110832, 434642067, 435333824, 435442238, 435818863, 436215935, 436978111, 437827225, 437768402, 437848015, 438801422, 439411583, 438978348, 439207840, 440186958, 440976601, 441207199, 442080193, 442930489, 443301392, 443970184, 444414368, 445239754, 446371803, 447782974, 448097267, 447797127, 448581886, 448818855, 449738579, 450853615, 451497002, 452395706, 453609390, 454273567, 453607025, 453959846, 454238853, 455163460, 456104355, 457382545, 459090919, 457892380, 458837509, 460756989, 461685104, 462447090, 462115479, 463247108, 465069656, 466205101, 466276093, 467646942, 468306427, 467521400, 470467873, 471573982, 470940208, 471115227, 470886383, 473184547, 474420319, 475837212, 477497139, 478299370, 478134766, 478586693, 480711403, 481461792]
3577.8D81461792J336098J245613j9646O24085J450729J482239M15115K447853J262589
3586.5D91706467r23958J375084q08983J551666K401619K560120J234398k35863K223587
3595.2E01084137l75862J309624K898025P56340K148323N80673K95296K182732K107620
3603.9E12986908K189522K498283J700287q73032K332764m54521j44425O115380J070251
3612.5E27421417p56721M146690J5717K784538L293037N85938K030182k95182R60503
3621.2E40186119K928772K493973K209701K188492J444702J602097M925308q31375
3628.9E57147789o946907M820785M430237N167618J987763j450501K954750L604927
3636.6E71716461J986046L72963J683083L254470K822991O62918J93634K905312L519477
$$ y = [481461792, 482797890, 484043503, 484023857, 484647942, 486098671, 487580910, 487996025, 490443878, 491706467, 490782509, 492157593, 491348610, 492900276, 495301895, 497862015, 499096413, 498860550, 501084137, 500708275, 502017899, 504915924, 505672264, 507820587, 508401260, 508696556, 510879288, 512986908, 515176430, 517674713, 519375000, 518501968, 520834732, 520380211, 520235786, 526351166, 527421417, 526664696, 530811386, 530827103, 533611641, 536904678, 537490616, 539520798, 539225616, 540186119, 543114891, 545608864, 547818565, 550007057, 551451759, 553053856, 557979164, 557147789, 550200882, 555021667, 559451904, 564619522, 566607285, 565156784, 568111534, 571716461, 573702507, 574075470, 575758553, 579013023, 581836014, 582498932, 582692566, 585597878, 589117355]
3645.3E89117355M464913m83437k412453M442635p74574o18363J808167N279579L923607
3654F04747429L531151N172195o531982J066665M995232J764603K101249J633454K508735
3662.7F20988731J183510J558266J619873Q73604M168014K209244q26302k54783m103661
3671.4F27416496K818947O933403O314583l736038j2882424L936272O717567M257164
3679.1F41775970l18832J028442K481156J721115Q21533L22800J062851L835373M447250
3687.8F57177658q899155k278213O718597m918976O59638N095978P27463J708679J18942
3696.4F56110611j096573Q19626J8234K200089K428131m361267j499176L787384J370697
3705.1F59777756N5618M00391J762848K725067o475067K338333L722763j0254898M712982
$$ y = [589117355, 593582268, 593098831, 590686378, 595129013, 594354439, 593736076, 595544243, 600823822, 604747429, 608278580, 613450775, 606918793, 607985458, 612980690, 614745293, 616846542, 618479996, 620988731, 622172241, 623730507, 625350380, 626223984, 630391998, 632601242, 631774940, 631520157, 627416496, 630235443, 637168846, 643483429, 639747391, 626864967, 630801239, 637518806, 641775970, 641457138, 642485580, 644966736, 646687851, 647509384, 647832184, 648895035, 652730408, 657177658, 648278503, 646000290, 652718887, 647799911, 648459549, 653555527, 654282990, 655991669, 656110611, 655014038, 655833664, 655851898, 658051987, 660480118, 656118851, 654619675, 658407059, 659777756, 659833374, 660233765, 661996613, 664721680, 658246613, 660584946, 664307709, 654052811, 658765793]
3713.8F58765793M225845%M12369J667480O56739l101807J054840M243546l351136
3722.5F64573669l764343L712464K98461q93707j153793K32162L047104J179123M333725
3731.2F71564865k479248p048569O431885k624969q774567L927002L175583M67682
3738.9F64639664J789398K411804k220230L117371J0214614r960174j5484314R745865
3746.6F64253998M734421L623886k909241q658066Q709412l878708n520477M861068
3754.3F65216293L942490K294769m709701K900314N009079p522583j311951M052582
3762F69871292J573486K3499K725449k230454m379730L082123M012985o73065p432709
3770.7F66572876K103195L210449J09330K49405l64304R06296K13470J713486m51431
$$ y = [658765793, 662991638, 662991638, 663404007, 665071487, 665728226, 662626419, 663681259, 667924805, 664573669, 660809326, 664521790, 664820251, 663926544, 662772751, 663004913, 666052017, 667231140, 671564865, 669085617, 662037048, 668468933, 665843964, 657069397, 660996399, 664171982, 664639664, 666429062, 668840866, 666620636, 669738007, 679952621, 669992447, 654508133, 664253998, 668988419, 672612305, 669703064, 661044998, 669754410, 665875702, 660355225, 665216293, 669158783, 671453552, 666743851, 669644165, 674653244, 667130661, 665818710, 669871292, 671444778, 671468277, 674193726, 671963272, 667583542, 670665665, 674678650, 674005585, 666572876, 668676071, 671886520, 671995850, 672245255, 671880951, 672787247, 673000717, 674714203, 674262772]
3779.4F74262772o396332J577911J096344J229096K277832k957306p00226J563110
3787.1F71953201P43561K45972j71967J61362m18244L90091j97219N98983K504959
3795.8F75810699l545227l910827J635360L907547N418168o659851r307557L379212
3803.5F66727524K621765M859238M762268r482575l069763M339142K070846K35215
3811.2F73063660r76563l30200J872864N242996k245178j2749863M993668N566330
3818.9F74437714M552459n6076j6678619K513275M596863K284469K810822k83585m253387
3827.6F69923935J37863J855927K505416P08008p155456K761078N664520n251999m06647
3836.3F70742645N521012p503205l004684O512298l693161J65406N802993j902160
$$ y = [674262772, 667866440, 669444351, 670540695, 671769791, 674047623, 671090317, 670390091, 671953201, 672696762, 672942734, 672770767, 672932129, 672513885, 672903976, 672706757, 673305740, 675810699, 672265472, 668354645, 669990005, 673897552, 679315720, 672655869, 663348312, 666727524, 669349289, 674208527, 678970795, 669488220, 666418457, 670757599, 672828445, 673063660, 672087097, 671756897, 673629761, 678872757, 676627579, 663877716, 668871384, 674437714, 678990173, 678934097, 662255478, 664768753, 669365616, 671650085, 674460907, 674177322, 669923935, 670061798, 671917725, 674423141, 675131149, 667975693, 670736771, 676401291, 671149292, 670742645, 676263657, 668760452, 665755768, 672268066, 668574905, 668740311, 674543304, 672641144]
3844F72641144l251267K306290R71375r01413Q00399p31582J676025L658447p722244
3852.7F69447174K35519j0855865K715454Q855209j357345r41162K915497K436599
3860.4F73451080J618958m928665K19421N119019p142563m494019M646073M712219
3868.1F73201523M608841r509201o704026N328598M844132K402115p762299J344757
3875.8F67754440L752289j52740J880493K817459o121292n554505N680695J058197
3883.5F71115036Q61359M218597j1015778O93970L776398R66492L388748j346512p290726
3892.2F65367584J326294L326340o14472J505433R06906J89285j95465o851044M915543
3900.9F69876404O33545n265579M409866k343292j325531Q60977J379699K052231p57293
$$ y = [672641144, 669389877, 671696167, 672667542, 671766129, 672566528, 671834946, 673510971, 677169418, 669447174, 669682693, 658826828, 661542282, 670397491, 669040146, 668098984, 671014481, 673451080, 675070038, 670141373, 670360794, 675479813, 668337250, 663843231, 668489304, 673201523, 677810364, 668301163, 661597137, 666925735, 671769867, 674171982, 666409683, 667754440, 671506729, 671353989, 673234482, 676051941, 669930649, 664376144, 670056839, 671115036, 671976395, 676194992, 665179214, 665873184, 669649582, 670616074, 674004822, 672658310, 665367584, 666693878, 670020218, 669405746, 670911179, 671818085, 672007370, 671811905, 664960861, 669876404, 670509949, 665244370, 669654236, 667310944, 665985413, 666846390, 668226089, 670278320, 669521027]
3909.6F69521027k78321k75497r4834J39237j33667J178589J306457l402633l059845
3918.2F64900513L274231p172k880630J982345K197800J181717k311631k898864J347732
3926.9F66786041J867371Q26492j811676r93728J340408k507019k007446J571884J181640
3935.6F66253967M44260K5406q03147p24258N70755K067947K65961m389801o03638
3944.3F63107452K147446R65500Q22296j430130k46735J55564j468048J221008K61612
3953F65535965n82809j9989l17612k88468j102447K23389K73590M87747O2332j757813
3962.6F62513885Q43277J446152K64511q79516j176377P93152J01166K05994J129379
3971.3F65241623p61108j320343j28098N8136o29273K36664O76728m63486k95487p0877
$$ y = [669521027, 669242706, 668967209, 668872375, 669011612, 668877945, 670056534, 671362991, 667960358, 664900513, 668174744, 668167572, 665286942, 667269287, 669467087, 670648804, 668337173, 665438309, 666786041, 668653412, 669479904, 667668228, 666674500, 668014908, 665507889, 663500443, 665072327, 666253967, 666698227, 666723633, 665920486, 665196228, 665766983, 667834930, 668100891, 663711090, 663107452, 665254898, 666220398, 667042694, 665612564, 665365829, 665521393, 664053345, 665274353, 665535965, 664953156, 664933167, 664615555, 664327087, 663224640, 663448029, 663721619, 664209366, 664271698, 662513885, 663357162, 664803314, 665067825, 664188309, 663011932, 663805084, 663906250, 664112244, 665241623, 664480515, 663160172, 663032074, 663090210, 662460937, 662697601, 663374329, 662910843, 662615356, 662544479]
3980.9F62544479K96936N13306o7139k53906o20499k43682m19922n8289P23038k39945
3990.6F62174377r1857l57056J38702J030197o94274n62439L68347N722L00674J43280
4000.2F62455673
$$ y = [662544479, 662841415, 663354721, 663287582, 663033676, 662413177, 662169495, 661749573, 661691284, 662414322, 662174377, 662082520, 661725464, 661864166, 662894363, 662200089, 661637650, 662005997, 662011719, 662312393, 662455673]
##END=$$ End of the data block
