##TITLE=$$ Begin of the data block
##JCAMP-DX=5.00 $$ ACD/SpecManager v 10.08
##SPECTROMETER/DATA SYSTEM=Varian
##DATE=15 Jan 2013 15:51:18
##DATA TYPE=INFRARED SPECTRUM
##DATA CLASS=XYDATA
##ORIGIN=
##OWNER=
##NPOINTS=3735
##FIRSTX=399.26403809
##LASTX=4000.35498047
##MAXX=4000.35498047
##MINX=399.26403809
##MAXY=76.59654236
##MINY=40.87237549
##XFACTOR=1.0000000000
##YFACTOR=0.000000100000000
##FIRSTY=63.63670349
##DELTAX=0.96440572
##XUNITS=1/CM
##YUNITS=TRANSMITTANCE
##XYDATA=(X++(Y..Y))
399.3 636367035 648400726 652112274 641038971 625963745 619362450 621915703 619965668 624799690
407 624799690 636081505 642185593 638359337 635353584 638938560 640437698 638434944 631308784 631083984
415.7 631083984 639774475 643883438 643429260 652491074 646285172 632305489 618482819 615068207
423.4 615068207 622080498 620874062 622588158 629272957 631440506 633232574 630506325 624252052
431.1 624252052 617868423 617228317 621169281 619207039 619725761 627161140 629982910 625760803 622934761
439.8 622934761 624229622 622770882 618053894 613313675 616816368 625559235 630570717 629126129
447.5 629126129 626078758 624079819 622332382 622565918 621175385 618229599 618714905 620652428 619389839
456.2 619389839 612108994 611349258 617622910 617136612 614328728 611924744 610660591 617220306 624315987
464.8 624315987 620905838 617308197 614357986 612545967 614780884 616008415 612125053 604623833
472.6 604623833 608778877 610071030 609061127 614019356 616817322 613911133 610653572 610516777 608607330
481.2 608607330 611638412 617111969 615201149 610840034 604767418 605252457 606574631 601110992 602106361
489.9 602106361 606813164 608563995 610321388 611997910 608077736 604480896 603362198 599560471
497.6 599560471 598999519 602392693 608454628 612272263 610291481 606927795 603001709 601785202 602125778
506.3 602125778 601314964 600344238 601380539 604590645 603224220 601353493 601329689 599660988 599269409
515 599269409 599886818 599453430 598180580 598748856 600187149 599916077 600119476 599626312 596920738 593907738
524.6 593907738 589440689 586111870 588909798 593588676 596864395 597962303 597150154 594659958 591709290
533.3 591709290 589434395 587259331 586026344 586979027 589521828 593607254 597266998 598855247 598124619
542 598124619 595413246 592369080 588788414 586519356 587272377 589594269 593862839 597478371 597591095
550.7 597591095 596128616 595309067 594367867 591396675 589343414 587956161 588082924 592062492 593975792
559.4 593975792 594381027 595805054 595997734 594399681 591951447 589658852 589298668 593242874 596609154
568 596609154 597962646 600829887 601673393 599828072 597188148 594562569 593378716 592117348 591503792
576.7 591503792 594000854 596143646 596247635 596122627 595485649 594240723 592244720 589817696 588025436
585.4 588025436 589259796 592020302 593232193 594394646 593896217 592466736 591238899 588578529 586676331
594.1 586676331 585560875 584639626 584303818 585131531 586129761 586469955 585863876 583852654 583046341
602.8 583046341 582057457 580466156 580172920 581377449 584129143 585434608 586075706 586140823 586026688
611.4 586026688 586080170 584752007 584787445 584507751 583210831 582904167 584562073 587699852 589096031
620.1 589096031 589583817 588914337 587545815 587239532 586957779 587769508 589684906 589930115 588646240
628.8 588646240 588827744 589806290 590542603 591333694 590707512 589348145 589077644 590396538 591755180
637.5 591755180 591162987 590073242 590554771 590848656 590726128 591036797 591779175 593360939 593728523
646.2 593728523 594113960 594080353 592371178 592972298 594667282 595913086 596576233 597562675 599882660
654.8 599882660 600084915 598554039 597408218 596693573 595980644 594230843 592602196 592611847 595036240
663.5 595036240 596804886 596764030 597238541 592770424 574441147 581516418 588056755 591202393 592787209
672.2 592787209 594102287 595462570 595747871 595688171 595331497 594366074 593209953 592598152 593518791
680.9 593518791 594770088 596764107 599875031 602294617 603388710 603639183 603392754 602046089 601128273
689.6 601128273 601924019 604020309 607240944 609628868 611146545 612211418 612678566 613245773 612632332
698.2 612632332 611714401 612374229 614267235 615978775 616880112 619172325 622222023 624081383 624380722
706.9 624380722 622624702 621310387 621821480 623538818 625224533 626384277 628708611 631095505 631831818
715.6 631831818 631821518 631902542 630912361 628729057 627952614 630049553 632805405 635279541 637897530
724.3 637897530 640077209 641885529 641315384 639302177 638357315 638289642 640407333 642138596 643860092
733 643860092 646060333 646826859 647366638 646653824 646806335 647903671 648045959 647739105 648035660 649233170
742.6 649233170 650142975 651946106 652566605 652251205 651219559 648888016 648150253 647939758 648819122
751.3 648819122 649724579 649930191 650027161 649085846 648683090 647650452 645095749 642890167 642951508 643553238
760.9 643553238 643082581 642021942 641198959 641473541 640532379 640265656 641380310 641570358 641337585
769.6 641337585 640972519 641947098 642721100 642666855 643110580 643802567 644912796 646007233 647532196
778.3 647532196 648917236 649327087 649365692 650099564 651533051 652345123 652309494 653086929 654012222 654099426
787.9 654099426 655900192 657659988 657844009 657022247 655872421 655718918 655280762 654538803 653026199
796.6 653026199 652737122 653060532 651492767 650413513 649968567 649271698 647176437 644800491 643041229
805.3 643041229 642378693 642567139 642017365 642965698 644695663 646534271 648624649 650327682 652025681
814 652025681 653765335 657222214 661427002 665626221 669473953 673751373 677262878 678359833 679495010
822.6 679495010 680176010 681471786 681931610 682526855 684040680 683812790 684040833 684298782 683866730
831.3 683866730 682204437 681723709 682351456 682542038 684644775 686703873 689124756 691893845 694326782
840 694326782 696001205 696826782 697708740 697879105 698790588 698657608 697890167 698597412 700348511 701790390
849.6 701790390 702170944 702553482 701667023 700167923 698662567 698267136 698622284 698326340 698294754 698011780
859.3 698011780 697017593 695015182 693130417 689748917 686185760 684392319 681682053 679068756 677355881
868 677355881 676178894 674726715 673508835 672054672 669460831 667739868 666815491 666179352 664904785
876.7 664904785 663910904 663709641 663892670 664479752 663984909 663636169 663105240 661635742 660231400
885.3 660231400 660090256 660400772 659635086 659179230 658625870 658140335 658030167 658059006 657666473 656697311
895 656697311 656751099 656981430 657121506 657033234 656906509 657419052 658063889 658193512 658098373 658869171 659014053
905.6 659014053 658622208 658467712 658641357 659068069 659334183 660058823 661185989 663162766 664601822
914.3 664601822 665618744 666881256 668385315 670075607 670622635 672032394 672588120 672380905 673386002
922.9 673386002 673734283 673497238 673587723 674948807 675218430 674073639 672384338 670727539 669591751
931.6 669591751 668263016 667876587 667031784 666763382 666431198 664374008 662268524 660354614 658382721
940.3 658382721 655361099 653476181 652232971 650549088 648648758 645563736 643158112 640952759
948 640952759 638356209 634534950 630422707 627702446 625110588 622808304 621011581 620437088 619340439
956.7 619340439 616966591 615053711 613252335 612539062 611845016 610527649 610391273 611311531 612190170
965.4 612190170 613067093 614342308 614595451 614620399 614382324 613157234 613080330 614066887 614721336 615444412
975 615444412 616344643 615279579 613075066 611570282 609403381 606452484 603392792 600725708 598316994
983.7 598316994 595862617 594141388 591828461 588479385 585240250 581757011 578151283 574622993
991.4 574622993 571913033 569817390 567732658 566155167 564506378 562479782 559856110 556327133
999.1 556327133 552204742 548311310 544920692 541743774 539349670 538028297 537138863 535424881 532766571
1007.8 532766571 529671669 526748314 524352150 521875572 518864594 517024956 517037430 516432533 515478668
1016.5 515478668 514156876 512357407 510720940 509159050 507833138 506187706 505326958 504817772 504471436
1025.2 504471436 503815994 503330345 503700485 502512627 501105042 499944954 499427528 499089775 498783417
1033.8 498783417 499493523 499288216 499408722 500045662 501035576 501409607 501127396 500845909 500486870 501349068
1043.5 501349068 501309624 501264877 501033669 500671158 500948677 500202103 499381447 498543282 499347305 500271721
1053.1 500271721 500366669 500321159 499840584 499838600 499672203 499725571 498565102 498103905 498216286 498255844
1062.8 498255844 499395905 498949394 498965530 499534798 499847488 499481239 498926582 498489761 497741814 498439941
1072.4 498439941 498593864 499137115 499537506 500144997 501133957 501133423 501609154 501094971 501320953 501248894
1082.1 501248894 501317978 502377090 503036118 504207649 503745804 502933502 501781616 501231689 501440926
1090.7 501440926 501166725 501631012 501210823 499952164 497579994 495955467 494660568 493781433 494407654
1099.4 494407654 494051476 494454727 495371094 497705994 500462227 501684647 502672844 503250427 503994408
1108.1 503994408 505609932 507782631 509210243 511251335 513123550 514843559 516879463 517995567
1115.8 517995567 519964905 522200050 524644623 526205330 528006630 530708618 532378006 534718437
1123.5 534718437 536645432 537822037 538885536 540392952 541906586 542631912 544061699 545906792
1131.2 545906792 547724648 549036407 550381966 551140404 550811310 550455399 550702209 552138748 553099442
1139.9 553099442 553527298 553494415 553414536 553501930 552590714 551712875 550808678 550733833 551250687 551264458
1149.6 551264458 552010727 553142319 553484650 553596191 554321632 554394608 554073181 553657951 553587227 554686623
1159.2 554686623 556073685 557786636 559241600 560578384 561763496 562985039 564050446 564654503
1166.9 564654503 566104584 568400917 571435661 574084015 576554337 579360466 581656761 583492928
1174.6 583492928 585570145 588033752 589989510 592118263 594664574 597309265 599590569 601759911
1182.4 601759911 604446678 606477776 607453423 608498764 610362778 612138290 614130630 616621475
1190.1 616621475 619166679 620946999 621633873 622370491 622296371 621839600 621449394 620968971 620525436
1198.8 620525436 619234505 617953377 617238159 616223679 614740829 612783737 610252457 607789001
1206.5 607789001 605639229 603219223 600567017 598321152 595912704 593082733 590032692 586759987
1214.2 586759987 583849487 580988770 578200073 575475235 572627602 569779396 567394333 565438385
1221.9 565438385 563588409 561940994 560027733 558182983 556271248 554720039 553241653 551319199
1229.6 551319199 549619179 547941208 546649818 545364113 544462242 543628349 542486000 541902618 541439323
1238.3 541439323 540580521 539398651 538903427 538768196 538656425 538122330 537963715 538596001 538457336
1247 538457336 538562622 538695869 538777618 538797455 538680687 538756447 538899422 540082321 541186981 541852188
1256.6 541852188 542297668 542843208 543154716 542950668 543446693 544204369 545330429 546547050 548129959
1265.3 548129959 549610252 550880814 552181549 552795944 553901596 554953041 555882988 556988716 558666420
1274 558666420 560758324 562275887 564231720 566227417 567871666 569036522 570015144 570981407 572209167
1282.7 572209167 574234085 576233215 578337669 580234909 581678848 582789154 583764076 584238091 584176636
1291.3 584176636 584765396 585636139 586566124 587892189 588947678 589310875 589586792 589516716 588744698
1300 588744698 587732964 586922722 586906967 587514420 587979355 587902756 587766685 587216072 585878754 584462547
1309.7 584462547 582506599 580496368 579017830 578028259 577622681 576985779 575650673 573806190 572518311
1318.3 572518311 571799622 571951790 573406906 575132904 577476921 579856911 582369118 584518242 585500259
1327 585500259 586244164 586111298 585317268 584595947 584158707 584382744 585591125 587964554 590200233
1335.7 590200233 591958542 593544540 594825287 595472679 596379623 597785454 599307556 600905609 602341728
1344.4 602341728 603387604 604440269 605666008 605728798 604877701 603643646 602913055 602093697 600782967
1353.1 600782967 599720306 598581886 597646217 595845528 593024902 589732323 586568336 582911034
1360.8 582911034 579141235 575704422 572204781 570993309 569611893 567131271 564471207 561063309
1368.5 561063309 558249016 557011642 555724678 554562798 554079971 553490791 552992935 553428993 553831062
1377.2 553831062 553828773 553898392 554120712 554997673 555608101 555910301 556557503 557476997 558686371 559310799
1386.8 559310799 560005569 561546707 563021469 563901978 565165749 566803017 568043823 568352470 567629890
1395.5 567629890 568346138 568237381 567797966 566601219 566497421 567844772 567769051 567637749 567021484
1404.2 567021484 565074959 564511719 564442177 563797188 562786140 561997833 561375961 561463203 561715164 561847839
1413.8 561847839 561296844 560421371 559798012 558445702 557919769 554784966 555186462 556848488 556956940
1422.5 556956940 556331253 554037857 554370880 554475517 553352318 553180923 552413139 550746078 550371895
1431.2 550371895 552009811 552151031 551800499 552074852 551203728 547607079 546829872 549308968 549746552
1439.8 549746552 550444527 552000275 553070183 554993248 555387421 556391449 557004242 557488022 557741623
1448.5 557741623 559491997 562582893 563937988 566283340 567713203 569584351 570583191 569561043
1456.2 569561043 568226395 566330757 571220016 573767128 578081627 580998688 583175888 586350327
1464 586350327 585990906 589017181 591526527 594954987 598245430 602089272 606967621 609711761 613541451
1472.6 613541451 616814613 622891541 626513977 628239555 631745644 634780731 638019829 640904694
1480.3 640904694 644062042 646822433 650403671 653079834 654095459 655240326 655163116 656960068 658664169
1489 658664169 658528214 660045547 662759094 665242691 665617142 666076126 666047363 661896973 663510971
1497.7 663510971 663998184 663553391 665533371 666467209 666322937 666253815 666689148 666095428 658956680
1506.4 658956680 650748825 653570938 656218262 656476212 657864075 657047119 655160217 654768906 653206558
1515.1 653206558 651377411 647355804 644666748 646485825 648361053 644472656 640556793 641201935
1522.8 641201935 641526566 641841049 637259750 636061668 634659119 633235130 633460846 632983627 632216682
1531.5 632216682 629820023 626929436 620827370 621174355 620088272 618004951 617888489 607998886 603426704
1540.1 603426704 603368111 602268715 598206978 597425041 594105453 587282791 587509499 584793396 583151131
1548.8 583151131 578890228 572825508 570916710 567953796 566273880 557261047 554515381 554143791
1556.5 554143791 553175621 547701836 531980133 539887428 540609398 543071823 542575569 541732063 540308685
1565.2 540308685 539869080 541273155 541196556 542345085 538113785 539348221 539965401 539022217 538928375
1573.9 538928375 537960243 537574654 530777054 533958092 535364571 535129395 535073853 533512802 532991142
1582.6 532991142 531252327 530850182 530005150 529566116 529379272 528263664 528171883 526805801 526587067
1591.2 526587067 525243759 524562531 523796310 522596359 522644615 521514206 521929054 521501770 521556740
1599.9 521556740 520868263 520322876 520468712 519114799 519227600 518494492 518904953 518782387 518942680
1608.6 518942680 518614082 517154884 517815552 517057114 517271843 516769447 517598495 518251190 514013138
1617.3 514013138 516914864 517755966 518399849 517806778 518410225 518306389 515621452 517591743 518548965
1626 518548965 520077553 519023743 518706093 519958687 520458794 521320457 521648445 523446999 524857330
1634.6 524857330 522861862 523109665 525508347 526883545 528196297 529994392 530799599 532620888 533654175
1643.3 533654175 535832901 538614693 538125687 538864326 539819412 542951736 545485001 548028564 551177330
1652 551177330 549286499 544355392 549448051 554271851 557490578 559788246 561612701 563097153 564784012
1660.7 564784012 567063751 568234367 568609619 571741409 574882927 577275200 579684181 581795235
1668.4 581795235 581577225 583064499 585351448 587182121 590640373 594584961 596242180 596558876 600304604
1677.1 600304604 603407669 605545654 606674042 607474480 610152130 612894592 612037086 607735710 614227066
1685.8 614227066 619155769 622078209 622188110 622854919 623371925 624147949 625374603 625804596 627742691
1694.4 627742691 627929993 623199921 624789963 626847954 628828430 622501335 617553139 621003494
1702.1 621003494 622625923 621076622 618050880 616334915 612818146 611480942 610289307 606922951
1709.9 606922951 602316132 599460793 596590958 593797951 589706459 584151955 583014107 579464111
1717.6 579464111 569819565 569555435 569165497 566989899 564713135 562071228 559223938 557673073 556042137
1726.3 556042137 554013062 552133827 550857162 547455177 545128174 545418396 545151558 540718918 535527802
1734.9 535527802 538603554 539739685 539743423 539786110 538175316 536256142 537414780 538132935 537170868
1743.6 537170868 538906174 540554123 542001457 542450676 542957039 544543228 546578217 548519020 549243584
1752.3 549243584 554474678 558244514 561889610 566485786 569357414 575173607 580330200 586391869
1760 586391869 591924438 596934929 603718529 610868187 618293839 624660683 631970596 638434296 644134369
1768.7 644134369 650070267 656503830 662465897 666077042 670704193 676706924 682186737 685230713
1776.4 685230713 689878159 692919464 695699158 698727722 700002975 703600006 706623306 709499741
1784.1 709499741 710282211 711260223 713708954 714761200 716407166 718114929 719093552 719710159 718967590
1792.8 718967590 720166016 724016418 725778656 725298233 726839142 728183365 728211899 727891312 729964905
1801.5 729964905 730618134 731103210 733301010 734124298 735066757 735142593 734972153 736071777 736801529
1810.2 736801529 736436310 737237091 739101181 740057068 741027222 741107101 741056137 740537872 740591660 741763840
1819.8 741763840 742077637 743444901 744349442 746147614 747485962 744028702 744345474 746284714 747562485
1828.5 747562485 746932297 743866730 745977707 748912735 750018539 750516739 750968246 751026382 750581360
1837.2 750581360 749954910 750674057 751126251 751697693 752865677 754602051 755085907 750269470 752109375
1845.8 752109375 754448624 753793564 753101807 753708649 755096283 755643997 756577682 757326965 757602310
1854.5 757602310 757560806 757114792 757205276 756762695 756847305 757131424 757769012 758498917 758934937 759513474
1864.2 759513474 759531021 759698639 759201736 758800812 757499924 756967010 758848953 760150604 760943298
1872.8 760943298 761179428 761360855 761135941 761172867 761036835 760670776 761241150 761269684 761637497 762053909
1882.5 762053909 762569656 762575378 762012253 762071304 761750488 762434616 761868057 760367737 761642151 762753296
1892.1 762753296 763028564 763100739 762702408 761879807 762205505 762443390 762565308 762819519 762931366 763566895
1901.8 763566895 763757858 763945694 763298187 762750092 763296432 763188705 762908249 762934418 763046570 763540955
1911.4 763540955 764395828 764182968 763973312 763820038 763901749 764957809 763173599 762789993 764223175
1920.1 764223175 764831848 765289841 763922958 763491974 764327698 764425583 763894043 763653717 764144669 764649048
1929.7 764649048 764992981 765025864 764868851 764508896 764501419 763980179 763520432 763886108 764095306 764594574
1939.4 764594574 764984131 765965424 765639648 763625488 764007416 764142761 763508148 763415756 763940201 764479141
1949 764479141 765058746 765359650 765148468 764959869 764465866 763974686 763545303 763801804 763898010 763850327
1958.7 763850327 764608459 764872055 764933395 764749374 764360580 763603210 763154526 763321533 762660370 762586975
1968.3 762586975 763354950 764364700 764722519 764668350 764684448 764163971 763581696 762829819 762789383 763066025
1978 763066025 763350906 764025421 764307480 764479446 764407120 764115982 763450775 762736206 762581024 762657318
1987.6 762657318 762512283 762831879 764185486 764478760 763086624 762406693 762644882 762387619 761899719
1996.3 761899719 762082520 762309799 762792664 763322296 763755875 763622589 762866364 762512817 762095261 761601257
2005.9 761601257 761490479 761726303 761893234 762474518 763031235 762827530 762775116 762470169 762046204 761781082
2015.6 761781082 761311722 760866776 760864639 761054001 761420288 762113647 762114182 761668472 760973434 760581436
2025.2 760581436 760523834 760272141 760393753 760442047 761177597 761590805 761020737 760741043 760450516 760050049
2034.9 760050049 759331589 759343109 759973450 760373764 760620346 760532990 760243759 759908752 759879456 759535294
2044.5 759535294 759322815 759430161 759694214 760053024 759950104 759939651 759519577 758828735 758366013 758608170
2054.1 758608170 758913193 758763962 759056396 759205475 759554901 759373093 759065933 759019318 758589249 758744354
2063.8 758744354 758242035 757895737 758481827 759102859 759377823 759277420 759368286 758769531 758158722 757976303
2073.4 757976303 757875290 757834930 758274536 758942566 758784332 758726120 758449478 758003616 757566071 757239914
2083.1 757239914 757286530 757124557 757660599 758384171 758755798 758787613 758645706 758205185 757193222 756795731
2092.7 756795731 756741638 756786346 756995239 757492371 757884445 757618332 757308960 757106552 756979904 756260681
2102.4 756260681 755624619 755736618 756193237 756579132 756660995 756874008 756663055 756425476 756053772 755060196
2112 755060196 754343033 754544601 754999771 755243912 756004562 756140213 756022873 756094437 755475082 754651718
2121.6 754651718 753649216 753037567 753039551 753788986 754393234 754647522 755176697 755159225 754624023 753599091
2131.3 753599091 753022614 752623138 752532196 753114090 753280182 753901596 754328003 754186249 753690414 753012924
2140.9 753012924 752775421 752555084 752514420 752427368 752808685 753560638 753940735 753978653 753733063 753261490
2150.6 753261490 752373352 751835861 751796494 752143021 752414246 752614365 752996750 752950821 753074188 752970276
2160.2 752970276 752536621 752084198 751740952 752019958 752358017 752657166 752989807 753334351 753288727 752718887
2169.9 752718887 752267990 752159500 752115555 752345276 752958374 752956085 752900620 753168030 753150940 752963333
2179.5 752963333 753170776 753589096 753054123 752743301 753260117 753627090 753511429 753445358 753995667 754236450
2189.1 754236450 754093628 753776779 753502579 753337555 753513260 754206238 754744797 755048065 754616928 754354630
2198.8 754354630 754460220 754284439 754364395 754407272 754796448 755366592 755530319 755395279 755149918 754786987
2208.4 754786987 754514389 754484787 754614029 755311279 755757141 755918427 756009598 756068420 756169434 755647278
2218.1 755647278 755279160 755035553 755056305 755431366 755703125 756038437 756575241 757087326 756554260 756030197
2227.7 756030197 755654068 755210342 755531998 755975266 756324615 756533585 757070007 757299271 756956863 756643295
2237.4 756643295 756096954 755928345 756032028 756089172 756373596 757126236 757442780 757294388 757198181 756569748
2247 756569748 756055679 755860138 756253586 756567917 756383820 756693954 757080917 757324829 757354355 757230072
2256.7 757230072 756594009 755733414 755669098 755907211 755819016 756008835 756777039 757260742 757347412 756818390
2266.3 756818390 756499863 756600266 756247253 756014786 756009827 756543884 756827393 756918640 756966629 756717529
2275.9 756717529 756666718 756224289 756183395 756084747 756039200 756426468 756842499 757106781 756781311 756969223
2285.6 756969223 756491852 755919952 755828781 755325241 755073929 754871750 755277863 755219193 755030594 754566116
2295.2 754566116 753778534 753475266 752736588 752571640 752265701 752500458 752514572 752092133 752216644 751586914
2304.9 751586914 751156693 749598694 748362885 747438202 746583176 747073898 747026443 747634430 746702728
2313.5 746702728 745487137 745147476 744609985 744154434 742119064 740895844 739617767 739165649 738922882
2322.2 738922882 737922897 737904129 737030487 736699982 735685196 734742279 733500061 732770538 732702713 731330566
2331.9 731330566 732446747 733399963 733349533 731898575 730373306 730605850 731022797 731382980 730282745
2340.6 730282745 729615021 728111496 728927002 730368347 730071182 732031784 734555969 738388443 740071030
2349.2 740071030 738554687 735685043 731937637 729442444 727560806 725126877 722557678 721141281
2356.9 721141281 719961700 718823090 717867508 717777863 719601593 718461304 718643494 720858078 722171936
2365.6 722171936 722704544 722888336 725202103 727093124 729292831 732136612 734239807 735658569 736872635
2374.3 736872635 738222656 739458084 740884933 742224731 743917084 745612869 747518997 749011459
2382 749011459 749649506 750505600 750932999 750833130 750333633 750465775 751269760 751904373 752634964 752771988
2391.7 752771988 752550125 752019196 751440353 750812988 750082397 749838562 750018845 750701065 750825424 750827637
2401.3 750827637 750993423 750524673 749833069 749022446 748394547 748144836 748567352 749220581 749706726 749869766
2410.9 749869766 749576797 749323502 748769226 747938080 747248077 747130890 747126617 747182465 747820587 748254013
2420.6 748254013 747914352 747014542 746792068 746810379 746211166 745788498 745748062 745797729 746032562 746549454
2430.2 746549454 746430893 746118317 745836029 745223083 744712143 744484482 744700699 744353943 744323883 744909515
2439.9 744909515 744661636 743939743 743388290 743368683 743226166 742935181 742725067 742794571 742898102 742691193
2449.5 742691193 742745209 742413025 742304535 742351990 742073364 742046204 741768188 741309814 740881653 740796509
2459.2 740796509 740698776 740430450 740228348 739951706 739689865 739616241 739927292 739641037 739108429 739007339
2468.8 739007339 739156418 739228668 738563232 737872620 737582397 737506638 737187271 737190170 737605667 737438583
2478.5 737438583 737111359 736806564 736591721 736131821 735737228 735681839 735707550 735829926 735807648 735863800
2488.1 735863800 735339737 734830017 734485397 734174805 734306870 733815460 733511810 733524399 733556061 733668442
2497.7 733668442 733587570 733603592 733262787 732753677 732233505 731879501 731570663 731547623 731816635 731815491
2507.4 731815491 731937180 731725540 731373291 730882263 730421219 730021439 729477158 729720001 730062332 730459061
2517 730459061 730572205 730139389 729881668 729303665 728553848 727804260 727504807 727831955 728334961 728733749
2526.7 728733749 728878860 728768082 728249588 727721710 727257996 726912766 726563950 726425629 726790466 726988754
2536.3 726988754 727086334 727098465 726884918 726455688 725944214 725663757 725497360 725268555 725282135 725758896
2546 725758896 726206055 726082535 725157547 724633408 724727783 724324036 723721161 723488312 723752213 723766861
2555.6 723766861 723647232 723645477 723688507 723656464 722944565 722447433 722075119 721988983 722396088 722409592 722365341
2566.2 722365341 722128754 721671371 721193314 720913162 720585480 720253830 720270157 720116348 719929962 719638214
2575.9 719638214 719683151 719848938 719607468 719310532 718846207 718493881 718175812 718209839 718299026 718299942 718463593
2586.5 718463593 718061218 717588806 717102966 716589813 716347809 716276550 716130524 715814972 715842056 715717621
2596.1 715717621 715600357 715505676 714924622 714531860 714227066 714010468 714090347 714014740 713917847 713600388
2605.7 713600388 713063736 712985001 712780380 712272034 711784058 711562881 711687622 711403732 711216354 710953140
2615.4 710953140 710469894 710220032 709500351 708822556 708685608 708704987 708582001 708679428 708661041 708209457
2625 708209457 707894516 707116318 706271286 705878067 705809326 705545502 704945221 704743958 704715195 704841003
2634.7 704841003 704423065 703884888 703281631 702034531 701525497 701263733 701262817 701491547 701456985 701581650
2644.3 701581650 701055069 700405731 699971161 699278488 698975449 698968506 698559036 698216858 698193512 698072433
2654 698072433 697990494 697552490 696774673 696232681 695848312 695104065 694587631 694900208 695080185 695078354
2663.6 695078354 694782181 694279938 693916626 693345413 692622910 691848984 691761551 691815109 691343384 691051559
2673.3 691051559 690987244 690856476 690368652 689778519 689123230 688823318 688997040 688526688 687854233 687813034
2682.9 687813034 687826385 687488861 687021790 686469269 685913315 685407867 685121384 685030060 685032043 685254593
2692.5 685254593 685091934 684558792 683897171 683411026 683325043 682877045 682378006 682177277 681892624 681720734
2702.2 681720734 681955566 681870499 681136246 680465775 679961014 679756470 679653778 679475632 679384689 679512939
2711.8 679512939 679577484 679121857 678653946 677875900 677037888 676596298 676231384 676208878 676086960 675866699
2721.5 675866699 675826111 675830765 675625534 675029678 674409332 673817825 673183441 672811661 673169708 673561172
2731.1 673561172 673441086 673126602 672676620 672533264 672633209 672566605 672282028 671781693 671199570 671218719
2740.8 671218719 671299515 670578690 670416336 670702515 670518646 670275726 670076828 669777069 669377365 669200058
2750.4 669200058 668925552 668442917 668249283 668218842 668087845 668032532 668012466 667921295 667686157 667038116
2760 667038116 666960144 667206421 666742554 666326599 665926208 665379181 665044479 664780655 664536896 664612122
2769.7 664612122 664831772 664869537 664644547 664263687 664108200 663676071 663071442 662573395 662323227 662227631
2779.3 662227631 661629791 661345749 661290359 661127472 660620117 659712830 659364624 659328232 659396210 658973312
2789 658973312 658330994 658114014 657744217 657293015 656995850 656819839 656298218 655826340 655431137 654942780
2798.6 654942780 654563141 654011230 653575134 652913742 652226639 651441116 650760956 650516510 649870605 649493027
2808.3 649493027 649300003 648723679 647831345 647041473 646480637 645706940 644987411 644107056 643493958 642992783
2817.9 642992783 642526627 642411270 641712723 640841141 640217590 639456978 638234215 637059059 636454582
2826.6 636454582 636020546 635411949 634373245 633581657 632994194 632153435 631246719 630124741 628695641
2835.3 628695641 627471809 626972466 626287193 624766541 622832603 621302223 620025291 618311920 616298828
2843.9 616298828 613918266 611843796 609968719 608005028 606367226 604535294 602500916 600652313
2851.7 600652313 599515114 598773499 598159180 598138161 598364944 598415871 598066940 597520599 596763840 595813789
2861.3 595813789 595024452 594834709 594598999 593443375 592753105 592597160 591667175 590256271 589361305
2870 589361305 588906059 588082924 587068901 586224060 585520782 584616852 584054184 583948822 583379250 582706184
2879.6 582706184 582151947 581578560 580784149 580033035 579932251 579817657 579058685 578297615 578151436 578110237
2889.3 578110237 577756538 576966629 576184006 575464935 574915771 575173950 575013161 574453049 574249802 574030495
2898.9 574030495 573853378 573762131 573582764 572942314 572367249 571936302 571922951 571925430 571100845 570905151
2908.6 570905151 570720978 569861679 569168854 568261375 567064819 566015434 565107765 563995247 563124466
2917.2 563124466 562419662 561905174 561599998 561169891 560912514 560229874 559756813 559876900 560195694 560853119
2926.9 560853119 561204796 561420135 561310120 560797462 560867043 561468391 561884384 562082901 562397614 563123512
2936.5 563123512 564022865 564757919 565659904 565959091 565632019 565793495 566414604 567136650 568001595 569157448
2946.2 569157448 569784393 570208015 571022339 571345558 571095123 570919952 571356201 571779633 571878166 572022095
2955.8 572022095 572130508 572421036 572975693 573479996 573952827 574654007 575005646 575410233 576214371 576808929
2965.5 576808929 577368355 578047180 579439240 580934372 581892204 582723618 583483505 584542732 585297699
2974.1 585297699 585897713 586985893 587918854 588634377 589550209 590449677 591017113 591413536 591771469
2982.8 591771469 592452965 593275337 593614235 593812714 594430580 594985085 595474052 596573029 597244225
2991.5 597244225 597347221 597514954 597545547 597889290 598239632 598137398 597835541 597534676 597417221 597773285
3001.1 597773285 598025894 597666855 597476997 597430305 597198448 597020493 597115746 596941452 596427078 596407661
3010.8 596407661 596455956 596170692 595556870 595058022 594704514 594315758 594132309 593355331 592670555 592743645
3020.4 592743645 592811165 592720795 592134323 591385498 591186638 590925217 590171089 589835281 589751091 589490356
3030.1 589490356 589042702 588183250 587994537 588063393 587495117 586944427 586525993 586168442 585718803 585317383
3039.7 585317383 585196800 584798126 584125061 583719215 583132019 582308998 581997948 581797218 581184082 580591965
3049.4 580591965 580225410 579479561 578511467 578206024 578174362 577612572 576991463 576911163 576340599 574936523
3059 574936523 574179497 574250450 573844757 573031044 572411690 571672401 571272011 571410751 570968437 569964142
3068.6 569964142 569428711 569041824 568234520 567434998 566909332 566591072 566049194 565485764 565081673 564661560
3078.3 564661560 564456978 563886375 563254814 562891502 562529411 562121925 561321754 560649719 560240211 559761581
3087.9 559761581 558883324 558182411 557945404 557182922 556434479 555992966 555836220 555389061 554350433
3096.6 554350433 554011536 553562241 552622643 552131767 551729164 551017952 550586166 550570564 550086479 549245758
3106.2 549245758 548754730 548293190 547499352 547097244 546766434 545731621 544936676 544779968 544435654
3114.9 544435654 543557358 542942352 542524681 541633720 540909348 540635796 540128860 539231644 538401642 537870407
3124.6 537870407 537726974 537105789 536050453 535428238 534730911 533953819 533090591 532702370 532577553
3133.3 532577553 531823311 531047592 530230942 529708519 529081993 528292999 527946205 527289734 526632347 526133003
3142.9 526133003 525465012 524966278 524558105 523645782 522757263 522308846 521686440 521251221 520781479 519790230
3152.5 519790230 518725815 518248100 517866287 517013206 516382599 515864449 515298843 514690132 514454575
3161.2 514454575 514053802 513197975 512974854 512386246 511612930 510913391 509947243 509288712 508397293 507594948
3170.9 507594948 506998100 506464081 506259193 506056442 505235405 504110565 503644028 503437157 503205986
3179.5 503205986 502613487 501711769 501204109 500858154 500383301 499584503 498629379 498054581 497791977 497213402
3189.2 497213402 496754646 496530380 495971069 495060081 493999481 493407402 492787476 492287865 491773224
3197.9 491773224 490864868 490517540 490362129 490183144 489586601 488976860 488467598 487596092 487149773 486729202
3207.5 486729202 486463852 486022415 485285492 484673500 484302521 484376450 483433380 482130394 481372948 481117210
3217.2 481117210 481298714 480645790 479574509 478856583 478249130 477293930 476696434 476777039 476557999 476111069
3226.8 476111069 475664749 475274734 474703026 474144897 473867187 473441963 472593575 472061348 472397270 472211838
3236.4 472211838 471234856 470281372 469583702 468980255 468417931 468167801 467949753 467777596 467163048 466479301
3246.1 466479301 466344872 466183662 465913658 465223923 464478874 463960533 463476067 462949333 462255173 461991920
3255.7 461991920 461758614 460840378 460291634 460615005 460431786 459550552 458933144 458689423 458329697 457691689
3265.4 457691689 457123260 456953964 457345657 457242203 456522446 455771904 455286179 455203323 454387703 453781128
3275 453781128 453674164 453102074 452683449 452522392 452520065 452463150 452288361 451766777 451228447 450805702
3284.7 450805702 450371017 450287514 450069313 449795952 449399986 449348068 449413033 448845024 448200989 447614403
3294.3 447614403 447444954 447121658 446805153 446523514 446058350 446034927 445657425 444998131 444606018 445086784
3303.9 445086784 445068283 444149208 444332428 444300842 443430862 442807426 442595215 442250710 441958847 441604996
3313.6 441604996 440663872 440361557 440376091 440098534 439408646 438894157 438555412 437885628 437893562 437460747
3323.2 437460747 436920013 436484833 435636330 435726814 435888252 435653038 435312233 434838295 434193268 433629379
3332.9 433629379 433156242 432582169 432486534 432205963 431792336 431413574 431123123 431040077 430859566 430637131
3342.5 430637131 429862785 429379883 429010925 428541183 428646812 428504601 428123817 427680092 427469940 427057190
3352.2 427057190 426307907 425981216 425524521 424935760 424470291 424285431 424315567 423994293 423252029 422507362
3361.8 422507362 422187614 422164612 421917801 421528130 421702919 421696777 421126137 420754280 420543251 420191231
3371.4 420191231 419485626 419250107 419470634 418930168 418216057 418084679 418138237 418187218 417772102 416805077
3381.1 416805077 416363029 416257286 415816727 415494232 415528641 415644188 415537300 415104713 414574471 414473152
3390.7 414473152 414574890 414629173 414266777 413187866 412879295 413477325 413272514 412431183 412115784 412051582
3400.4 412051582 411889267 411720314 411381378 411263084 411460114 411418839 410963364 410617752 410628281 410413780
3410 410413780 409988098 410035858 410128365 409523354 409166985 409257736 409403992 409547768 409668617 410055656
3419.7 410055656 409663811 408947067 408723755 408779030 409154282 409171524 409232750 409298592 409318886 409419136
3429.3 409419136 409372292 409185791 408936310 409368324 409508667 409449844 410071716 410321693 409886551 409472809
3439 409472809 409290314 409129181 409702950 410301666 410394554 410443687 410543098 410745087 409735756 409489670
3448.6 409489670 410508156 411451988 411964874 411662445 411784782 412140350 412484741 412665138 412462769
3457.3 412462769 412675896 412936172 413014526 413028374 413608513 413962822 414084930 414728966 414880943 414828568
3466.9 414828568 414980049 415763168 416096382 415270920 415503731 416898994 417727509 417473221 417551003 418295059
3476.6 418295059 418552933 418770714 419689178 420316620 419900780 419480209 419570389 420256500 421131516 421651154
3486.2 421651154 422068787 422343712 422642784 423415909 423969688 423530235 423338928 424069290 425425797
3494.9 425425797 426624222 426812439 427029724 427484741 427761307 427940331 428531342 429007759 428605499
3503.6 428605499 428736839 429452133 430042763 430380592 431213493 431592598 431281967 432400856 433311157
3512.2 433311157 433584442 434150581 434838982 435307770 435713425 436461525 436888580 437176857 437496147 438295708
3521.9 438295708 438776550 438504562 439454765 440781364 441215057 440901566 441518555 442206001 442383118
3530.6 442383118 443041382 444062843 445156212 445878906 447424164 448001480 447725372 448796806 449278793
3539.2 449278793 449736557 450570450 451841888 452618828 453633728 454662170 453725662 453955994 454446983
3547.9 454446983 456021652 457365913 458035812 459201164 458611183 459717407 460421448 461142235 463203278
3556.6 463203278 463377075 463865318 465345840 466500893 466592712 467947197 468776169 468713226 471586761
3565.3 471586761 471413574 470101509 470379982 471431541 474780350 475640869 476142159 477696724 478568192
3574 478568192 479027367 480291443 481947136 482703934 484547653 485775261 485920792 486508369 487533760
3582.6 487533760 488679657 489412079 492503624 493955536 491883011 492290726 492066612 494285545 497211723
3591.3 497211723 499774628 500357819 500411911 503722496 504436722 505593796 507374992 507531128 510036201
3600 510036201 511087570 511717644 513586769 515416679 517766151 519987030 521264877 520342636 523466225
3608.7 523466225 524391327 524238281 530043411 530295944 528452339 532591858 533339691 537006721 540628815
3617.4 540628815 540065613 541127739 541357079 542954597 546427193 548723373 550617905 553204918 554550438
3626 554550438 556031570 561065483 560708084 554152031 558703537 563459587 568440285 570328484 569309731
3634.7 569309731 571960983 575337601 577670135 578442612 579673042 582057152 584983521 587150993
3642.4 587150993 587884178 589816170 592895927 597396965 596325378 594252853 601125793 601681137 598630753
3651.1 598630753 599241409 605023918 610027351 613664093 617688980 611095734 612777786 617709389
3658.8 617709389 619268951 620920944 622134895 625072250 626384087 627886047 629718819 630420914
3666.5 630420914 634790154 637080956 635977821 635482330 631393700 634582367 641155853 647295914
3674.3 647295914 642933044 629307556 634921265 642538147 646878281 645705032 646783829 649527359
3682 649527359 651162872 652235260 652413406 653083038 656999283 662026520 653989334 651324692 657524185
3690.6 657524185 652478104 652864380 657594757 658382797 660314026 660526962 659436646 660644684 660621948
3699.3 660621948 662693253 666132889 661354599 658975525 663056030 664449692 664141769 664163818 666112747
3708 666112747 669378738 664044876 666457367 669314499 659089050 663524551 667288437 667162399 667976456
3716.7 667976456 670314331 671601639 668304901 668474503 672502823 669128113 665794296 670072784
3724.4 670072784 669752502 667485199 666203156 667392654 670357513 671274872 675995102 672929687 665333939
3733.1 665333939 672935333 673813553 665278473 666169357 668518448 669268570 672212601 675613937 672452164
3741.8 672452164 674538879 684313889 676443634 661629181 668796463 672520828 676419449 673064270
3749.5 673064270 666219940 675477142 669729843 665172348 671417313 675622101 677577209 672070923
3757.2 672070923 673990784 679185638 673050613 671718140 675188065 676191788 676568222 679634094
3764.9 679634094 677049866 672398300 674962997 679233627 679844437 672099304 672922745 675684280 676299286
3773.6 676299286 676730957 676247253 677533875 678221893 680133133 679097977 671888962 674124374 676294785
3782.3 676294785 677798691 679841156 676505051 675155411 676256790 676947174 677295456 677473602 678265533
3790.9 678265533 677804108 677593842 677153702 677721634 680301895 676793900 673389969 675612183 679189529
3799.6 679189529 684421310 679417496 669981232 672023544 673978653 678336945 682985458 675067596
3807.3 675067596 672379608 676178589 676965256 676860046 677996674 678373566 678957901 683679047 681580429
3816 681580429 669449997 674201050 678564911 681972198 681759186 666351547 669859848 674811935
3823.7 674811935 676746826 679277725 679177856 675327377 675972977 678113708 680567245 681371841 673970184
3832.4 673970184 676406326 682358322 676501083 675694656 682601318 675214081 670703125 677129059
3840.1 677129059 672708740 673002853 679724426 678408966 675425873 677517319 678100815 677425385 678086472
3848.8 678086472 676475220 677633133 681743774 675401993 675792465 664815674 667111664 676008682
3856.5 676008682 674846954 673483810 676288528 678730698 679583969 674984207 676969299 682901764
3864.2 682901764 676494980 671411438 674639816 678364334 682613525 673940430 666726227 671866608
3871.9 671866608 677521362 680281143 671356049 672134476 676120987 675918045 677856216 680965118 674514008
3880.6 674514008 669276505 674759979 675408401 676240845 680103073 669640579 670539551 673965225 675434952
3889.3 675434952 679938202 678637238 670526123 672137070 676016159 675234146 675505524 676344681 678311691
3898 678311691 678950882 670115280 674122849 675406265 671040573 675369339 672191544 670798492 672043915
3906.7 672043915 673179398 675126114 674851685 674761047 674574509 675215454 675226135 674109955 675026016
3915.3 675026016 676137619 672281418 669815903 674195404 673592911 669768066 672724075 674870682
3923.1 674870682 675224915 673447952 671175995 672236481 673497009 674784088 674308243 673754196 674573822
3931.7 674573822 671586990 670083008 671960449 672089691 671697998 672437363 672098389 671320572 671578445
3940.4 671578445 672877502 673532486 669964447 669394150 671348495 671941452 672368164 670500641 670909729
3949.1 670909729 671372757 669349594 670375137 670402908 670215607 670190201 669839020 670356522 669559555 670014420
3958.7 670014420 670328445 670751419 670938873 668590088 668317184 668778381 669237137 669394531 668638916
3967.4 668638916 669100952 669183350 669494095 670420761 669994125 668766479 668327026 668776627 668533783 668221207
3977.1 668221207 668339920 668007202 668031921 668312912 668327026 668124542 667800293 668213425 668813248 668501740
3986.7 668501740 667671585 667645416 668167801 667737808 667443085 667426910 667353287 668143539 668638916 668250885
3996.3 668250885 667883453 668006821 668400345 668455124
4000.2 668455124
##END=$$ End of the data block
