##TITLE=$$ Begin of the data block
##JCAMP-DX=5.00 $$ ACD/SpecManager v 10.08
##SPECTROMETER/DATA SYSTEM=Varian
##DATE=15 Jan 2013 15:50:52
##DATA TYPE=INFRARED SPECTRUM
##DATA CLASS=XYDATA
##ORIGIN=
##OWNER=
##NPOINTS=3735
##FIRSTX=399.26403809
##LASTX=4000.35498047
##MAXX=4000.35498047
##MINX=399.26403809
##MAXY=77.03155518
##MINY=40.52555084
##XFACTOR=1.0000000000
##YFACTOR=0.000000100000000
##FIRSTY=62.02855682
##DELTAX=0.96440572
##XUNITS=1/CM
##YUNITS=TRANSMITTANCE
##XYDATA=(X++(Y..Y))
399.3F20285568L842278O218948N42565l511124k69203l571587M398308N748253j586571
407.9F32097435L979836l26615n683250p145081m95605O19659l932304o37894L182335
416.6F21658516R483681k718735j6266441M314193J658745l080215q918801P74193
424.3F06905136J035004M136734Q614044N157661L754578o739349j0638504m165535
432.1F08059769j118813j167297j70059P031173Q761025N295982q69560n373879m575767
440.7F15872574p836495k889709N709915R075012L698960l810883j783180L51944k107697
449.4F16280441n036430l599014K368965N921478L375931J535415r04388q060226m023285
458.1F07858887K335663k645302j58272q55217Q89206N455551M59595j587563Q5488
$$ plain form
399.3 620285568 624127846 630346794 630889359 627378235 627109032 623537445 627935753 633684006 632097435
407.9 632097435 636077271 635750656 630067406 622922325 622426720 623046379 619114075 618476181 621658516
416.6 621658516 631142197 628423462 612157021 616471214 618129959 615049744 606130943 606905136
424.3 606905136 607940140 612076874 620690918 625848579 629603157 622863808 612225304 608059769
432.1 608059769 606940956 605773659 605603600 612634773 621395798 626691780 625822220 620448341 615872574
440.7 615872574 608036079 605146370 610856285 619931297 623630257 619819374 618036194 618388138 616280441
449.4 616280441 611244011 607644997 610013962 615935440 619311371 620846786 619942398 611882172 607858887
458.1 607858887 610194550 607549248 607390976 606535759 607424965 612880516 613340111 611752548 611838036
466.8F11838036l591881k863465K391434l43475n450096k122193L398438P82356L605461
475.5F07644615N854073j262779l737450l132515l952179K177048M515724M71039j632042
484.1F06945534l942070k208252j31035j746140r51652K049942L326416l78265k584572
492.8F00379906K859420K708016m66194m444351n629845J147079Q69103J039238P324638
501.5F05787010M423180m132347k681847q34770m868546m016914K852821J228562p6256
510.2E97680893K153053K090683j498298k814980k964973k615967J439209N30128q13064
518.9E93186684J503143J672974J286392p06749k891731l606759m744262k150574K641487
527.5E86190605K504654L139534L843689L12080k304611k948265k816734l603211m072609
$$ plain form
466.8 611838036 608246155 605382690 607774124 607430649 601980553 599858360 603256798 604039154 607644615
475.5 607644615 613498688 612235909 608498459 605365944 601413765 603590813 608106537 608577576 606945534
484.1 606945534 603003464 600795212 600664177 598918037 597966385 600016327 603342743 602964478 600379906
492.8 600379906 603239326 605947342 605481148 601036797 595406952 596554031 597423134 598462372 605787010
501.5 605787010 610210190 606077843 603395996 602561226 597692680 593675766 596528587 597757149 597680893
510.2 597680893 599833946 601924629 600426331 597611351 594646378 592030411 593469620 593999748 593186684
518.9 593186684 594689827 596362801 597649193 596942444 594050713 590443954 585699692 583549118 586190605
527.5 586190605 588695259 591834793 595678482 595990562 593685951 590737686 587920952 584317741 580245132
536.2E80245132L03917K771454M414368M614830J112747p25937j801338k716522k941551
544.9E85277100j148873J736832K903480L390160J512795o40069j084785r66721p60383
553.6E90219536k665978k332916l14979K00958K343101L551102L008537J362496q57277
562.3E94514580j713944j183777j948585k044983K169838L532333J368828K084618
570E96778908O91719j317139j285896k533074j862487j467438j271629K278137J868095
578.6E91879196N79453J930923K6207k535705k431679j116181j049804m66957L98941
587.3E87214394J341095K432441l47709r53522l33557k561417k832107k299347o11077
596E81049194k93693R20334J677246r75342j58348L56216m49524j720695k347412J51100
$$ plain form
536.2 580245132 580549049 583320503 587734871 592349701 593462448 592736511 590935173 588218651 585277100
544.9 585277100 584128227 585865059 588768539 592158699 593671494 593031425 591946640 590979919 590219536
553.6 590219536 587553558 585220642 584905663 585106621 587449722 591000824 594009361 595371857 594514580
562.3 594514580 592800636 591616859 589668274 587623291 589793129 593325462 594694290 596778908
570 596778908 597470627 596153488 594867592 592334518 590472031 589004593 587732964 590011101 591879196
578.6 591879196 592458649 594389572 594415779 591880074 589448395 588332214 587282410 586815453 587214394
587.3 587214394 588555489 590987930 590640221 589686699 589353142 586791725 583959618 581660271 581049194
596 581049194 580755501 581675835 583353081 582377739 582219391 582575607 582126083 580405388 578057976 578209076
605.6E78209076K94418Q74100K032127K097168J441613j9417K28920r31435k012253
614.3E82214317l08723J446152J030273M3030Q95500J254196L5210r91554o95687o63452
624E84259262J61362J847343J694412L00217j698494j79748J939773M2038m53987N88989
633.6E88501167K34413l34320J55640R80415M44832j93023l09372n03121J007042J047897
643.3E91031570p98225O44646J415329K81944n12810j069221Q11233J399422M12331
651.9E93616219J227150J773338J294174j47095j861648j862221j329575k43873P30171
660.6E93196640k70309p76253J078377J737938K29187o62461o869926k0267639J1287574
669.3E78683128P598572K645264K549362J820488O44951P52449P43370j152496k177163
$$ plain form
605.6 578209076 578503494 579377594 581409721 583506889 584948502 584929085 585158005 584226570 582214317
614.3 582214317 581905594 583351746 584382019 584425049 585320549 586574745 586609955 585618401 584922714 584259262
624 584259262 584420624 586267967 587962379 588262596 586564102 586384354 588324127 588366165 587912178 588501167
633.6 588501167 588735580 588401260 588556900 589537315 589982147 589789124 589479752 588976631 589983673 591031570
643.3 591031570 590233345 590877991 592293320 592575264 592062454 590993233 591804466 593203888 593616219
651.9 593616219 594843369 596616707 597910881 597763786 595902138 594039917 592710342 592466469 593196640
660.6 593196640 592926331 592150078 593228455 594966393 595195580 594533119 587663193 567395554 578683128
669.3 578683128 586281700 588926964 591476326 593296814 593941765 594694214 595437584 594285088 592107925
678E92107925n79681k36588K59247J871071K716980K813873K394715J113701J50146
686.7F02611389j7280j259766j558952p9041J624947K786598K757110K477761J381416
695.3F10724182P14836J97678q70247l66821O27479J807060K070046J494789K406273
704F18805275K397194J641464Q43659j179848j491127j66245R85909J748047K167587
712.7F25751915K100944J641884J616249J217080J40152k064896k746849L46336K948761
721.4F30951576K710800K377167K234154J121216L97033m67605r09729K65922J149331
730.1F39829865J016387N66178K348556K318573Q54493J64871j216584K67029k27050
738.7F45922318o11802Q40226P64007J354447J146392J249924q4000Q69370J611938
$$ plain form
678 592107925 591528244 591291656 591550903 593421974 596138954 598952827 601347542 602461243 602611389
686.7 602611389 602594109 601334343 599775391 599696350 601321297 604107895 606865005 609342766 610724182
695.3 610724182 611439018 611636696 610766449 610399628 611027107 612834167 614904213 616399002 618805275
704 618805275 621202469 622843933 623687592 622507744 621016617 620850372 621836281 623584328 625751915
712.7 625751915 627852859 629494743 631110992 632328072 632468224 630403328 627656479 628002815 630951576
721.4 630951576 633662376 636039543 638273697 639394913 639791946 639324341 638414612 638680534 639829865
730.1 639829865 640846252 641412430 643760986 646079559 646934052 647098923 645882339 646149368 645922318
738.7 645922318 645310516 646150742 646914749 648269196 649415588 650665512 650581512 651450882 653062820
747.4F53062820k619934k504501L5172P15866J25656O05011O86798j044083q76541
756.1F48186264j319656j184235m67911r40094j309738p42187k2965n40695l39737
764.8F41319046m31595j27868P4462n57403J42364J68839N92117J100540M00391L66974
774.4F43047867P90253N20629L36838J554489J861954O37360O79397J447525M48914
783.1F51325226p7973O19431J226425Q91495J8997J768494K023697J74408o64368o29578
792.7F56676254m57992j383667o75125l88794j249695j346283l20282j09940j109924
801.4F49634552j049728k189866j745910j279602j325836P5607L90625J702042J558990
810.1F45770874J563034K476120J758576J978988J956024J995163L370819N465775
$$ plain form
747.4 653062820 650442886 647938385 647973557 648689423 648815079 649420090 650106888 649062805 648186264
756.1 648186264 646866608 645682373 645214462 644274368 642964630 642222443 642199478 641658783 641319046
764.8 641319046 640887451 640759583 640834045 640276642 640419006 640587845 641179962 642280502 642680893 643047867
774.4 643047867 643838120 644358749 644695587 646250076 648112030 648749390 649428787 650876312 651325226
783.1 651325226 651247253 651866684 653093109 653984604 654003601 655772095 657795792 657970200 657305832 656676254
792.7 656676254 656218262 654834595 654159470 653770676 652520981 651174698 650854416 650744476 649634552
801.4 649634552 648584824 646394958 644649048 643369446 642043610 642119217 642509842 644211884 645770874
810.1 645770874 647333908 649810028 651568604 653547592 655503616 657498779 660869598 666335373
817.8F66335373M981689M034424L168335J327286J261978M43649M48304L9596N27649
826.5F82568283R42917O19125J327515n33295o29272j114044q90808P44781Q41980
835.2F83877182K130814J591186J652603K192688K221680K917404K303391Q4991j104355
843.9F97867584M2877J20469R13238R68475J375504J489792o1112J56479j162414j662674
853.5G00048218j261368m39072L9368n77850n6534l51944r31320k017670j909943k607650
863.1F89934235l603745k543716j984101j729583k318802j475067p35321r72977j743012
871.8F72827911l157882k340012j704636j091842o38199k87094M80423M55780L30810
880.5F64875259q64944o21719K67334r17206j701279p69195o5461J8158q6517o97479
$$ plain form
817.8 666335373 671317062 675351486 678519821 679847107 681109085 681552734 682001038 682040634 682568283
826.5 682568283 683511200 684130325 685457840 684924545 684295273 683181229 682290421 683035202 683877182
835.2 683877182 686007996 687599182 689251785 691444473 693666153 696583557 698886948 698971939 697867584
843.9 697867584 697910461 698030930 698944168 699912643 701288147 702777939 702716827 702873306 701710892 700048218
853.5 700048218 698786850 698347778 698387146 697809296 697752762 697400818 696469498 694451828 692541885 689934235
863.1 689934235 686330490 683786774 681802673 680073090 677754288 676279221 675543900 674570923 672827911
871.8 672827911 669670029 667330017 665625381 664533539 663895340 663608246 664088669 664544449 664875259
880.5 664875259 664010315 663388596 663655930 662738724 661037445 660268250 660202789 660220947 660134430 659436951
890.2F59436951o24466o11267K56805K79083o20269j08338p55997n15136L48663M30222
899.8F57516251K75497l81N9356j02081L33176Q8806O62994J006470l33176n15365
909.4F58991547k18430M82025J538086K286148J736908J686478J901474J061325R59473
918.1F70425034N25589P17239M08401N30167J145554K00729m3182M42199N69687o86798
927.8F74234619q80813j018601j443863j260147j388321k3422j13297j155624j416092
936.4F65534439j256561j928711k599182j551056k157517k321624j793366j855926
944.2F50070496j943894k263641k496338k822495k515525l002129l306656l480530
951.9F28239288k760353j712646k233734j154938q77228j760635k391434k142906k02332
$$ plain form
890.2 659436951 658812485 658201218 658458023 658737106 658116837 658008499 657252502 656737366 657086029 657516251
899.8 657516251 657791748 657791367 657850723 657748642 658081818 658170624 658833618 659840088 659506912 658991547
909.4 658991547 658773117 659255142 660793228 663079376 664816284 666502762 668404236 669465561 670425034
918.1 670425034 670950623 671667862 672076263 672606430 673751984 673952713 673909531 674351730 674921417 674234619
927.8 674234619 673353806 672335205 670891342 669631195 668242874 668219452 668106155 666950531 665534439
936.4 665534439 664277878 662349167 659749985 658198929 656041412 653719788 651926422 650070496
944.2 650070496 648126602 645862961 643366623 640544128 638028603 635026474 631719818 628239288
951.9 628239288 625478935 623766289 621532555 620377617 619500389 617739754 615348320 613205414 613003082
960.6F13003082o91223j267090r7770N83992N71785Q61320J721840N82314k81029o74858
970.2F14312363r02748P44171J075706l84254n09568Q11005k8572j806259k036057
978.9F11275787k571029l395500l078805k384452k403908k183647k048493k254104
986.6E90955849k234154l275299l712273l087158l258781k843209k509384k556496
994.3E67479095j713256j224480k065010k953949l359909l732300l538589l540497
1002E45351105l073349k433281k094727j621475k262917k414512k794953k798957j766434
1010.7E24090500j877403k384529j594620m54483j042519j056175j376152j765213
1018.4E12539406j810951j942139q31337r74350r78737j019859p23038k31781r8038
$$ plain form
960.6 613003082 612311859 611044769 610946999 611530991 612102776 612964096 614685936 615268250 614987221 614312363
970.2 614312363 613409615 614153786 615229492 614845238 614335670 615146675 615118103 613311844 611275787
978.9 611275787 608704758 605309258 602230453 599846001 597442093 595258446 593209953 590955849
986.6 590955849 588721695 585446396 581734123 578646965 575388184 572544975 570035591 567479095
994.3 567479095 565765839 564541359 562476349 559522400 556162491 552430191 548891602 545351105
1002 545351105 542277756 539844475 537749748 536128273 533865356 531450844 528655891 525856934 524090500
1010.7 524090500 522213097 519828568 518233948 517779465 516736946 515680771 514304619 512539406
1018.4 512539406 510728455 508786316 507954979 506980629 506001892 504982033 504258995 504027214 503929176
1027.1E03929176r8152j385536j327858j242409j60179R995m99840K49672R4375O58951
1036.7E00228195l21998n8518N02205K50435J40076p3853J075592J32332j89095m90799
1046.4E01194572J45112J36642p58553J86463r40056n72090j310425Q6212J988373
1055.1E00156250M16336K86102q95996q1482j94740l25966l58696k62146Q70819q17795
1064.7D98792686K66228M47006N35012k77176j364937K35748q0948P34635J99394L80821
1074.4D99868469N38140N43480L69377r49250O36902M08936O23741k42882n2566J274910
1084E03019257O7100O94771J19018m38117j392441l63503N64652n54276l97034j441497
1093.6D99877930k74430o39648j546478j546975j240615Q1176m36821O95992J076012
$$ plain form
1027.1 503929176 503831024 502445488 501117630 499875221 499715042 499725037 499225197 499474869 499569244 500228195
1036.7 500228195 499906197 499847679 500349884 500600319 500740395 500666542 501742134 501874466 501685371 501194572
1046.4 501194572 501339684 501476326 500717773 500904236 499964180 499392090 498081665 498167877 500156250
1055.1 500156250 500572586 500858688 499962692 499881210 499686470 499360504 499001808 498739662 499610481 498792686
1064.7 498792686 499058914 499505920 500040932 499763756 498398819 498634567 498553619 499288254 499487648 499868469
1074.4 499868469 500406609 500950089 501319466 500370216 501007118 501416054 502039795 501796913 501744347 503019257
1084 503019257 503086357 503781128 503900146 503462029 502069588 501706085 502270737 501716461 501319427 499877930
1093.6 499877930 499603500 498963852 497417374 495870399 494629784 494710960 494274139 494970131 496046143
1102.3D96046143J304168J301270J677704J556587Q28171K411804J589889J594315
1110E08310051K157135K327423J879997R02634J812973J689873J632194J458893K377281
1118.7E24548454L010712K392464J845932J292953K256012K184944J091042K76909
1126.4E38899422J366920J722031J133232K117653J950912J858864Q76389Q24432P62405
1135.1E51512260n32875J68457L10326Q02765R59625O42815L80363k76680n23491j109047
1144.8E52334518l67279j07879J4877L33214J05209M91982K07443N54848O84242J32179
1154.4E54383354l28064m11148J34735P64313J571045J186218Q52394J349411J538964
1163.1E61041222J109199O68030J057930J455231J093673J928254L367805K744370
$$ plain form
1102.3 496046143 497350311 498651581 500329285 501885872 502714043 505125847 506715736 508310051
1110 508310051 510467186 512794609 514674606 515577240 517390213 519080086 520712280 522171173 524548454
1118.7 524548454 527559166 529951630 531797562 533090515 535346527 537531471 538622513 538899422
1126.4 538899422 540266342 541988373 543121605 545239258 547190170 549049034 549925423 550749855 551512260
1135.1 551512260 550979385 551147842 551458168 552260933 553220558 553863373 554243736 553967056 553443565 552334518
1144.8 552334518 551967239 551859360 551874237 552207451 552312660 552804642 553012085 553566933 554251175 554383354
1154.4 554383354 554055290 553644142 553778877 554543190 556114235 557300453 558152847 559502258 561041222
1163.1 561041222 562150421 562818451 563876381 565331612 566425285 568353539 571721344 574465714
1170.8E74465714K713356K914009K381744J855011J434860J800423K117958K773094
1178.5E92456169L007393K639046K196960K316780K381974J758613J622505J399269
1186.2F09778709J386376J708145K218780K108574J866036J623115P15104M19807L70865
1194.9F22195511Q4152q24547p61909n54543j118889n92842k99682j010056j799049
1203.6F15318146k270279k629051k803688k634163k339936k189407j699944k187728
1211.3E96563950l440018l344154l058701l079376l008690k821465k583580k275123
1219E72952843k588082k548217k166291k426223j861153j453552j560746j630134j477585
1227.7E55240860j790886k283020j763344j255417j268539j283608n90515p46193j101265
$$ plain form
1170.8 574465714 577179070 580093079 582474823 584329834 585764694 587565117 589683075 592456169
1178.5 592456169 595463562 598102608 600299568 602616348 604998322 606756935 608379440 609778709
1186.2 609778709 611165085 612873230 615092010 617200584 619066620 620689735 621404839 621824646 622195511
1194.9 622195511 622279663 621455116 620693207 620138664 619019775 618426933 618127251 617117195 615318146
1203.6 615318146 613047867 610418816 607615128 604980965 602641029 600451622 598751678 596563950
1211.3 596563950 593123932 589779778 586721077 583641701 580633011 577811546 575227966 572952843
1219 572952843 570364761 567816544 565650253 563224030 561362877 559909325 558348579 556718445 555240860
1227.7 555240860 553449974 551166954 549403610 548148193 546879654 545596046 545005531 544259338 543158073
1236.4E43158073j153869p36008o7787r52950r09919l99094j61552o6300K95372M84734
1246E39490700k21443o6872j10321L59878m5738l79638N24673M72870P78351Q20770
1255.7E41623230R60236P16552K85111J47209N07889P79495N39818J244697Q18253
1264.3E47622490J307030J587944J153183J350898P66068J130447R75571J260796J252479
1273E58406906J338768K138786J750679K101861J936340J543007Q91876N93300J298942
1281.7E72000465J608086J985588J920357J974602J812934J515770J249924Q87146
1289.4E84954872L78800J5487K77481N06096J319199J617508J097297O74744P7896
1298.1E90919380j49841m53224j048508r40895l98102K71530O12641J52244j35765
$$ plain form
1236.4 543158073 542004204 541268196 541200409 540247459 539337540 538938446 538776894 538710594 539005966 539490700
1246 539490700 539269257 539202385 539092064 539451942 539406204 539026566 539551239 540024109 540802460 541623230
1255.7 541623230 542583466 543300018 543585129 543732338 544240227 545019722 545559540 546804237 547622490
1264.3 547622490 548929520 550517464 551670647 553021545 553787613 554918060 555893631 557154427 558406906
1273 558406906 559745674 561884460 563635139 565737000 567673340 569216347 570108223 570701523 572000465
1281.7 572000465 573608551 575594139 577514496 579489098 581302032 582817802 584067726 584954872
1289.4 584954872 585333672 585349159 585626640 586132736 587451935 589069443 590166740 590841484 590919380
1298.1 590919380 590769539 590316315 589267807 588326912 587928810 588200340 588812981 588965225 588829460
1306.8E88829460p54967j447410j396408j779785j606141j161460j281968j010971
1314.5E78390350p75718j159287j756515j245232o89850K22244J863327K080002K322159
1323.2E79251480K415848K190437J688614R78584O86303M0092o73828r88999m08134
1331.8E85180397L78380J478920K391472K085838J646347J027985J637153J505051
1339.6E97331543P66106R96475Q48274J457405J879769J435356J278610R81140j1826
1348.2F06962852p36961j220856q92295j115532j180382q53005j373787j416664j787948
1356.9E96385422k437821l209381l086662l647575l619690k571488l572120k090111
1364.6E72150574j835900k703971k332459k909012k977218j790848j285515m35028
$$ plain form
1306.8 588829460 588074493 586627083 585230675 583450890 581844749 580683289 579401321 578390350
1314.5 578390350 577614632 576455345 574698830 573453598 572763748 572985992 574849319 576929321 579251480
1323.2 579251480 581667328 583857765 585546379 586524963 587211266 587251358 586577530 585588531 585180397
1331.8 585180397 585558777 587037697 589429169 591515007 593161354 594189339 595826492 597331543
1339.6 597331543 598097649 599094124 599942398 601399803 603279572 604714928 605993538 606974678 606962852
1348.2 606962852 606225891 605005035 604112740 602997208 601816826 600963821 599590034 598173370 596385422
1356.9 596385422 593947601 590738220 587651558 584003983 580384293 577812805 574240685 572150574
1364.6 572150574 570314674 567610703 565278244 562369232 559392014 557601166 556315651 555880623
1372.3E55880623k86331q08487p22962K61154Q47016K40822J91230K90757M10232M77143
1382E56781197N43747O64024P44400J207008P55310J57662J085281K093430J538048
1390.7E65570107R35096J256027R30062k15683r99909J232872N17464o63261j153679
1399.3E67409096r8496J210251J33782J1482J12037j521072j348877m97780p80983
1408E64629440q86154n53131l87688M8180K4376K09885l40004j104660j156846j308822
1417.7E59174576j64223l777084K174K257462P55195M6578j669083l57513n49775j171226
1427.3E54547081j32027q75816j660843n05218J342315J57357j26420N11208q05626
1436E52452011l032112n25093J906662K32086P60079J411094J149635K149354L24974
$$ plain form
1372.3 555880623 555594292 554785805 554062843 554323997 555171013 555411835 555603065 555893822 556304054 556781197
1382 556781197 557324944 557988968 558733368 559940376 560695686 560853348 561938629 564032059 565570107
1390.7 565570107 566505203 567761230 568691292 568475609 567475700 568708572 569226036 568562775 567409096
1399.3 567409096 567310600 568520851 568654633 568666115 568778152 567257080 565908203 565410423 564629440
1408 564629440 563743286 563190155 562802467 562850647 562875023 563084908 562744904 561640244 560483398 559174576
1417.7 559174576 559010353 555233269 555235443 557492905 558248100 558294678 556625595 556268082 555718307 554547081
1427.3 554547081 554415054 553539238 551878395 551373177 552715492 552872849 552746429 553257637 552452011
1436 552452011 549419899 548894806 550801468 551033554 551793633 553204727 554354362 556503716 556828690
1444.7E56828690P18803L34244L96347J105575J997300K666244J147308K408257J380081
1453.3E68982849J632004J221046m91104j644935k027321N060768K450676L957023
1461.1E79141006L043328K234840K393761q24814M043312L149719L771744L441162
1468.8F00394058L613320M571952K204819K630768L998795O848716L586121J167641
1476.5F29016190L900604L987884L433533K577438L069458K513581L331604K709198
1484.2F54539490J161499J332626K12860J617966J680145J9303J253433L113403K883682
1492.9F67814407M76303J63117j037674m428177K232819P1487k55966K213287P72476
1501.6F68022079l4408k99225O34003J69601q977661p980194L603897K791138M95529
$$ plain form
1444.7 556828690 557547493 557881737 558278084 559383659 561380959 564047203 565194511 567602768 568982849
1453.3 568982849 570614853 571835899 571344795 569699860 567672539 572733307 575183983 579141006
1461.1 579141006 582184334 584419174 586812935 585988121 590031433 593181152 596952896 600394058
1468.8 600394058 604007378 608579330 610784149 613414917 617413712 624262428 627848549 629016190
1476.5 629016190 632916794 636904678 640338211 642915649 645985107 648498688 651830292 654539490
1484.2 654539490 655700989 657033615 657246475 658864441 660544586 660563889 661817322 664930725 667814407
1492.9 667814407 668290710 668453827 667416153 662987976 665220795 665292282 665036316 667249603 668022079
1501.6 668022079 667987671 667688446 668322449 668492050 659514389 651534195 655138092 657929230 658424759
1510.2F58424759J214981j240692j807251j81046k042617j847153l159256k991562
1518F46370163J477356J680984m174575n151444J403198J303711j3351n228005m10881
1526.6F37257156p09800j691285J41907l34053q60100k352676l056908o110916P51724
1535.3F23035049q70208j816902k5444j0468483m668999l92723r51767m386215j440087
1544E98014221k421150n753250m31519l498611k067528m226417n550347j676864k999955
1552.7E69388580j858406q827247k455635k71225j197129p476120j4335365Q017921
1560.4E40985374O24924K649994m16870n55191j278725m17595J638565k85949M51545
1569.1E43396072m483108J653061Q69865p73315l14675j273956L25928o570702K190895
$$ plain form
1510.2 658424759 659639740 658399048 656591797 656410751 654368134 652520981 649361725 646370163
1518 646370163 647847519 649528503 645353928 640202484 641605682 642909393 642896042 637668037 637257156
1526.6 637257156 636547356 634856071 634997978 634663925 633803825 631451149 628394241 622283325 623035049
1535.3 623035049 622164841 620347939 620322495 609854012 605185013 604792290 603840523 599454308 598014221
1544 598014221 595593071 589839821 589408302 585909691 583842163 579615746 574065399 572388535 569388580
1552.7 569388580 567530174 558702927 556247292 555976067 554778938 547302818 532967453 540985374
1560.4 540985374 541610298 544260292 543843422 543288231 542009506 541591911 543230476 542944527 543396072
1569.1 543396072 538912964 540566025 541435890 540662575 540347900 539073944 539399872 532829170 535020065
1577.7E35020065J164589k03857k49825j904869m65698j440773p7095p12090m09889
1586.4E30720558j85966j247712k7580j264992k87284j425286o46209q91381j421280
1595.1E23322868K1973j227531L16810r38110j13182k35825n54542N9967j449700K84996
1604.7E19487724m80690K671n66788L6659j62811j310158N55878p16934J36108r16824
1614.4E16064835M61845P82738l984986K077790M44336J011581m44679L0708r24988
1623.1E15519180k224350K382164R02100J735687p14950j70823J319695O89011O72378
1631.7E20110092k14119J648865J404343k125321n1918K568932J996498J418876J933098
1640.4E28689346J227494K212600J138649J852722K650261n06591m97437J075859M036980
$$ plain form
1577.7 535020065 536184654 535980797 535730972 533826103 533360405 531919632 531842537 531130447 530720558
1586.4 530720558 530534592 529286880 529259300 527994308 527707024 526281738 525635529 524744148 523322868
1595.1 523322868 523344841 522117310 522434120 521496010 521382828 521147003 520592461 520652428 519202728 519487724
1604.7 519487724 519007034 519009705 518442917 518479576 518316765 517006607 517562485 516845551 516981659 516064835
1614.4 516064835 516526680 517309418 513324432 515402222 515846558 516858139 516413460 516444168 515519180
1623.1 515519180 513294830 515676994 516579094 518314781 517599831 517429008 518748703 519437714 520110092
1631.7 520110092 519895973 521544838 522949181 520823860 520771942 523340874 525337372 526756248 528689346
1640.4 528689346 529916840 532129440 533268089 535120811 537771072 537264481 536767044 537842903 541879883
1649.1E41879883K836075K747116K881775m897080l786239P021598N577507L575402
1656.8E57836037K492675K011071J832847J628189J924973J284981Q45222L106995
1664.5E72962990L034973K569199K491378J874428m49562K257843L504105J918411
1672.3E90163765K437363K986755R44939J123237M040756L285637K358780J078110
1680F08419342N05981K621193K868767j167259m342308P218208N058213K948913L39470
1688.6F24470520Q33664L66745R49249J227799Q7776K024231O64902m629593J058921
1697.3F27054214J947251K162704n757827n293236K802582J706886p63893k596741
1705F21261940k068863l799248j287536j300469l428154m778557l109321k658386k502289
$$ plain form
1649.1 541879883 544715958 547463074 550344849 545447769 541661530 548683128 554260635 557836037
1656.8 557836037 560328712 562339783 564172630 565800819 567725792 569010773 569855995 572962990
1664.5 572962990 575997963 578567162 581058540 582932968 582483406 584741249 588245354 590163765
1672.3 590163765 592601128 595587883 596532822 597656059 601696815 604982452 607341232 608419342
1680 608419342 608925323 611546516 614415283 613248024 608905716 616123924 621182137 624131050 624470520
1688.6 624470520 625304184 625670929 626620178 627847977 627935753 629959984 630624886 625995293 627054214
1697.3 627054214 629001465 631164169 625406342 620113106 622915688 624622574 623858681 621261940
1705 621261940 619193077 615393829 614106293 612805824 609377670 604599113 601489792 598831406 596329117
1713.7E96329117l705406n042725j129646l851586j0050201j82839l26499k204247
1721.4E69835968k666092l187103k794228j417732j601067j623344j745605j818162
1729.1E52982635l954238j984864P17545n21889n690727m195671L644333J044540j72806
1737.8E41868858K79656j258164k464447J107331R18121j310310J233749J541405J724243
1746.5E43640442P20863O8550J352082K303085K458611J002044N130654L910179L563690
1755.2E64150200M228439K760201N520591M789811N964470N625915N270577P039032
1762.9F05349236P522048P497063O226731P200927O177407O200218O544571O345138
1770.6F59063339N324097M749985M971695N053787N748825L075790M107590L272858
$$ plain form
1713.7 596329117 592623711 587580986 586451340 582599754 572549553 572366714 572040215 569835968
1721.4 569835968 567169876 563982773 561188545 559770813 558169746 556546402 554800797 552982635
1729.1 552982635 549028397 547043533 547761078 547239189 541548462 537352791 540997124 542041664 541868858
1737.8 541868858 542148514 540890350 538425903 539533234 540451355 539141045 540374794 541916199 543640442
1746.5 543640442 544361305 544429855 545781937 548085022 550543633 551545677 556676331 560586510 564150200
1755.2 564150200 568378639 571138840 576659431 581449242 587413712 593039627 598310204 605349236
1762.9 605349236 612871284 620368347 626595078 633796005 639973412 646173630 652718201 659063339
1770.6 659063339 664387436 669137421 674109116 679162903 684911728 687987518 692095108 695367966
1778.3F95367966L111114L116226Q55332L525314L155365K722778R53827J152573K656097
1787G16616592J256180J658554J695404J018143Q92868q88672J131897L731613J603394
1795.7G28715973n06439J267013J526795M15191l63617J888581P95211Q78602K174682
1804.4G36791992R10111P90176l20358n6458J454315R33075n28869Q77762J706009
1813G42557755P42874J163406n0354j18256m85763Q4381J401367N52750J458893K42309
1822.7G47549362J220780J818084k765350J76315J784516J192932q00705l119278J990967
1831.4G49047623K901764J527328O60935Q4381J40304k23770p82089J051559J002426
1840.1G55410461O63224O63070J265717O03638n138016J876678K731629o77567o13785
$$ plain form
1778.3 695367966 698479080 701595306 702450638 705975952 709131317 711854095 712807922 713960495 716616592
1787 716616592 717872772 719531326 721226730 722244873 723137741 722249069 723380966 727112579 728715973
1795.7 728715973 728209534 729476547 731003342 731418533 731054916 732943497 733738708 734617310 736791992
1804.4 736791992 737702103 738492279 738171921 738115463 739569778 740502853 739973984 740851746 742557755
1813 742557755 743300629 744464035 744413681 744295425 743809662 743894043 745295410 745848160 747307053 747549362
1822.7 747549362 748770142 750588226 747822876 747999191 749783707 750976639 750175934 747056656 749047623
1831.4 749047623 751949387 753476715 754137650 754222031 754362335 754138565 753356476 754408035 755410461
1840.1 755410461 756073685 756736755 758002472 758606110 753468094 755344772 758076401 757398834 756785049
1848.7G56785049R36051J367950M09851J068650O62460j9608J16196k07138o6070o89621
1858.4G60363770J35650M56543O86035Q86231N90210N49240j34049k52533q83865j62048
1868G62235184j011887q61130J925965J688537Q85315J66931J36414k27509K518k79846
1877.7G64660492l39661M91715M5852P43332N43137K84042l25470m48150L09372m70963
1887.3G65493698P60498l12271j653213R91134R64050M14963K99607l92380q30460
1896G65735626M92859K63901M2724K63520L3035N79681L31498K33841o20118k94876
1905.6G67061691L92456n40847j78605J61820J09634O42014J051330k54287p23114
1914.3G67722092k13318L39432Q91342j999207n33829J912766J045380n6839j446152
$$ plain form
1848.7 756785049 757721100 759089050 759498901 760567551 761230011 761210403 761326599 761119461 761053391 760363770
1858.4 760363770 760499420 760955963 761641998 762528229 763118439 763667679 763533630 763281097 762397232 762235184
1868 762235184 761223297 760362167 762288132 763976669 764861984 765028915 765165329 764937820 764940338 764660492
1877.7 764660492 764320831 764812546 764858398 765601730 766144867 766428909 766103439 765655289 765964661 765493698
1887.3 765493698 766254196 765941925 764288712 765279846 766243896 766658859 766958466 766566086 765735626
1896 765735626 766228485 766492386 766535110 766798630 766831665 767411346 767742844 767976685 767356567 767061691
1905.6 767061691 767454147 766913300 766734695 766896515 767006149 767648163 768699493 768445206 767722092
1914.3 767722092 767508774 767848206 768739548 766740341 766206512 768119278 769164658 769107819 767661667
1923G67661667j37406O73218N4779k01187p0953J98440M66614K05536N4703M48990
1932.6G69354401k23771k26135n99518m89273L13111K79464M85459K87781J134033
1941.3G70315552n11093k167054M74854j4649n69763j5869N62210M57993L65219N78308
1951G69475708L1891m00925m57840m16031o75354J68915J94931J03455O97632J68838
1960.6G68891220L05939r5215l86963n77392m34266j46560r21402J6021R07288R96704
1970.2G68555374L01895R9030k9450p44171n43670o80771R3841N31540K66342L23487
1979.9G68173447L21960K60162l13644l47748p97653l99017K35977k21100l33862K01263
1989.5G66779785J194992L15018r88770n13992N0125m1427l70484Q0185K91138O90307
$$ plain form
1923 767661667 767524261 768197479 768252258 768051071 767980118 768178558 768645172 768850708 768905411 769354401
1932.6 769354401 769130630 768904495 768304977 767815704 768128815 768408279 768893738 769181519 770315552
1941.3 770315552 769804459 767637405 768112259 768097610 767527847 767511978 768074188 768532181 768897400 769475708
1951 769475708 769507599 769106674 768648834 768232803 767557449 767726364 767921295 768024750 768722382 768891220
1960.6 768891220 769197159 769101944 768714981 768137589 767703323 767556763 766635361 766651382 767558670 768555374
1970.2 768555374 768857269 768956299 768926849 768182678 767639008 766958237 767052078 767583618 767849960 768173447
1979.9 768173447 768495407 768755569 768441925 768094177 767296524 766897507 767133484 766912384 766578522 766779785
1989.5 766779785 767974777 768289795 767301025 766787033 766837158 766795731 766425247 766505432 766796570 767486877
1999.2G67486877O25992O8741l96118n84564j35193l41721m16107k21863K2126K9907
2008.8G66138077O5918M39682K57873J69449k15607m72641l09371p30591p12357M46930
2018.5G65077362N73959K79923N57098J6861m72717p61261k82440p63j77689M1504
2028.1G64851837k59552O62842N99289l17688m54559n16587J11389r3994m4632J9074
2037.7G64557419O4316K21557k32239l45916k16217K61840k63671m00544J11847M10996
2047.4G64169388M78363k45743j91116m20609l98407p0877q8653K8610K38342K52304
2057G63751602l33786M93241L02581m03595n6076l55301o1798m50821m48379N22537
2066.7G62960205Q84705L72772j81580k12555p93457n94253j25962L21274M71268L09372
$$ plain form
1999.2 767486877 768112869 768181610 767785492 767200928 767065735 766724014 766307907 766086044 766108170 766138077
2008.8 766138077 766203995 766643677 766901550 767070999 766855392 766382751 766073380 765342789 764630432 765077362
2018.5 765077362 765651321 765931244 766488342 766505203 766032486 765271225 764988785 764988022 764810333 764851837
2028.1 764851837 764592285 765255127 765854416 765536728 765082169 764565582 764676971 764582977 764538345 764557419
2037.7 764557419 764621735 764843292 764611053 764265137 764048920 764310760 764047089 763646545 763758392 764169388
2047.4 764169388 764647751 764402008 764210892 763790283 763391876 763320999 763232346 763260956 763499298 763751602
2057 763751602 763417816 763911057 764213638 763810043 763753967 763398666 763336868 762886047 762437668 762960205
2066.7 762960205 763844910 764217682 764036102 763823547 763030090 762435837 762309875 762631149 763102417 763411789
2076.3G63411789K85644j4801K01111m41360p87354m78439m49753j48773J96686O15310
2086G62390060P02286O55747j27335l34854m07868q16497l82614k75422K87476L60336
2095.6G62051315J92261L10822L4561j32523l24402l10058q72193o20575J55106N04684
2105.2G60988998N70832K50091K54746k73285l25470n72357q98667k99682M1427L5858
2114.9G59772491J17112P29446M22440L0975k50397p63778o80695o43082n20782l58887
2124.5G57854843O89469P40432L24173N31769j92337m01764m93469m11759m87365p5074
2134.2G58078918K12708k68631N64575O38428J82648l94516p77359m78745k99988P8507
2143.8G57536545l8223M05731Q44879M52042k80686k13089j12915j018906m85458O1417
$$ plain form
2076.3 763411789 763697433 763682632 763883743 763442383 762655029 762176590 761726837 761578064 761774750 762390060
2086 762390060 763092346 763748093 763620758 763285904 762878036 762061539 761678925 761403503 761690979 762051315
2095.6 762051315 762243576 762554398 762588959 762456436 762132034 761821976 760949783 760329208 760484314 760988998
2105.2 760988998 761559830 761809921 762064667 761791382 761465912 760893555 759994888 759695206 759736633 759772491
2114.9 759772491 759889603 760619049 761041489 761072464 760822067 760058289 759377594 758734512 758213730 757854843
2124.5 757854843 758544312 759284744 759608917 760140686 759948349 759546585 759053116 758641357 758153992 758078918
2134.2 758078918 758291626 758022995 758587570 759225998 759408646 759014130 758236771 757758026 757458038 757536545
2143.8 757536545 757498322 757904053 758748932 759200974 758920288 758707199 758594284 757575378 757089920 757151337
2153.5G57151337J29699N8747J49841P65381L09143j46408k41394l03803p90100l89786
2163.1G56692657M03519K31400M04968K51007M29306J72501m01078l83529l95813j07727
2172.8G57297211p8736L22647L71857M94766O65207j43814m92935j55563M12597p4844
2182.4G58618393m06799M43344O07452j13525j69983K87094L0670q4686j93634J0223
2192G59028549J92490R7046M04663K94418Q6060k53907j06201K671j26572K01263K56195
2202.6G60076675L81241K45056J57700j37634l86124p4615M6157K3652r4071j602K2201
2213.3G60258636N37720N78385J70822K72598k96478p05261l61405N22385L79791J03149
2222.9G61460342M59137K30255J62888l87192k32238k46354o73751M2038K66494L25394
$$ plain form
2153.5 757151337 757281036 757339783 757489624 758255005 758564148 758417740 758176346 757872543 757082443 756692657
2163.1 756692657 757096176 757327576 757732544 757983551 758412857 758585358 758184280 757800751 757404938 757297211
2172.8 757297211 757218475 757541122 757912979 758407745 759072952 758929138 758436203 758280640 758693237 758618393
2182.4 758618393 758211594 758654938 759262390 759148865 758978882 759265976 759296646 759211960 759018326 759028549
2192 759028549 759221039 759318085 759722748 760017166 760103226 759849319 759743118 759745789 759619217 759820480 760076675
2202.6 760076675 760457916 760702972 760860672 760723038 760336914 760262299 760308456 760332108 760238037 760236435 760258636
2213.3 760258636 760796356 761374741 761545563 761818161 761521683 760816422 760455017 760977402 761357193 761460342
2222.9 761460342 761919479 762149734 762312622 761925430 761693192 761446838 760773087 760815125 761081619 761407013
2232.5G61407013N41305N96390J83640J4953j79367n87997j39923k2965J3352J09024
2242.2G61935425N09872O48041k09427n60684k19956J29624p0496j48925L1356J09177
2251.8G62154007q698K69394M24958j41755o9580l08990n63126l84674q6288L8910
2261.5G61324158Q6212N07583L21579N21775O1874n31311n91354q54721q0338O06766
2271.1G61372223Q67844N10177M08859j58233m89273j15357o51474R918l6697Q2321
2280.8G61800308M22898K86560M93850k64129p5074n11779m95835j96685j91651R3537
2290.4G61362000n50614K77557J19172p1183n41305r35974m37775j019974N3864k57111
2300G57998657J07117K45361o41098N0125m71954l32031j250305j071015r80835j219635
$$ plain form
2232.5 761407013 761948318 762544708 762728348 762743301 762563934 761975937 761836014 761813049 761826401 761935425
2242.2 761935425 762445297 763093338 762883911 762323227 762103271 762232895 762162399 762013474 762044830 762154007
2251.8 762154007 762145309 762414703 762839661 762697906 762628326 762319336 761756210 761371536 761285248 761324158
2261.5 761324158 761410370 761917953 762239532 762761307 762823181 762291870 761700516 760845795 760765457 761372223
2271.1 761372223 762240067 762750244 763159103 763000870 762511597 762396240 761744766 761754684 761717987 761800308
2280.8 761800308 762223206 762509766 763003616 762739487 762664413 762152634 761656799 761460114 761268463 761362000
2290.4 761362000 760811386 761088943 761208115 761136932 760595627 759659653 759221878 758201904 758255768 757998657
2300 757998657 758105774 758351135 757710037 757760162 757288208 756956177 755705872 754634857 753654022 752434387
2309.7G52434387O4469o80466K46658k51846o87485n98602j425858q33740j334457
2318.4G46933060r82666j117783n57556p48215n96924n8746r02863o4544j514206o07987
2328G39781570m27017j378937j175231p59430K030487P38678r2545k142334k617645
2336.7G33957596N21850P96204J90659q10242K71988q12226K95487M59976q2779K635422
2346.3G37423935K631073M012070J540451k289887k445450k389221k947235k774963
2354.1G32760773k840958l322143j957627j342621j446609o33774J108551J899033
2361.8G24224625l35923J170731J443634J033554J19705L84903K798844J892471K554626
2370.4G35287170K418137J830902J276779J104355J820755J561737J931992J276092
$$ plain form
2309.7 752434387 752498856 751818390 752065048 751813202 751125717 750527115 749101257 748267517 746933060
2318.4 746933060 745950394 744832611 744275055 743526840 742929916 742871170 741968307 741903763 740389557 739781570
2328 739781570 739354553 737975616 736800385 736040955 738071442 738810120 738717575 736575241 733957596
2336.7 733957596 734479446 735275650 735466309 734656067 734928055 734115829 734411316 734871292 734788513 737423935
2346.3 737423935 740055008 744067078 745607529 743317642 740872192 738482971 735535736 732760773
2354.1 732760773 729919815 726597672 724640045 723297424 721850815 721217041 722325592 724224625
2361.8 724224625 723888702 725059433 726503067 727536621 727656326 728041229 730840073 732732544 735287170
2370.4 735287170 737705307 739536209 740812988 741917343 743738098 745299835 747231827 748507919
2378.2G48507919J216736J931610K048798J468735Q24203Q36411K74582j06583l61633
2386.8G56640778K57034P48978M30297N58167J36337j77536n35126m05197k93045p25479
2396.5G56635208l19672L11356N99060K08359j72958l83912l21731m37927n25437l81546
2406.1G55210800m66995K70462L75061L58734K90527k50854l40042m99573k62451n85022
2415.8G54100647m66385p6141P7514N78232K56577j36490o24619m71954m05960o76804
2425.4G52154617o3781K12097J1062N8747M37469o4544l64991n01251o91376r3383
2435.1G51094666j67466o3934l357K92282M41132l69339m18930k18582l8376l71704
2444.7G50176392q46711m73022J95465K80609q0643j07345l07541n12161m12598K46353
$$ plain form
2378.2 748507919 749724655 751656265 753705063 755173798 755998001 756834412 757108994 757002411 756640778
2386.8 756640778 756897812 757646790 758077087 758635254 758771591 758594055 758058929 757653732 757360687 756635208
2396.5 756635208 756315536 756626892 757225952 757434311 757261353 756877441 756555710 756117783 755592346 755210800
2406.1 755210800 754743805 755014267 755389328 755748062 756038589 755787735 755447693 754948120 754685669 754100647
2415.8 754100647 753634262 753558121 753635635 754213867 754470444 754333954 753709335 753237381 752831421 752154617
2425.4 752154617 752090836 752302933 752313995 752372742 752810211 752745667 752380676 751879425 751188049 751094666
2435.1 751094666 750927200 750863266 750859909 751152191 751593323 751223984 750805054 750586472 750548096 750176392
2444.7 750176392 749329681 748856659 749052124 749332733 749252090 749144745 748837204 748325043 747912445 748158798
2454.3G48158798K34986k34147j8081k66571l10669j33286j00479l09448l49197l34397
2464G46337509m73938J08643K7618j15127J07803j9836j98746n00336n22842j06812
2473.6G44643936O0120m50134j90506j45951l54919k17972l69263r7427l41797j01776
2483.3G42434311m9210l24173p0419R0485M16641j42822k07978p88269q00018K04010
2492.9G40762558l91006k68708j09558J93939K36740o3095J82801l95890o95572p12585
2502.6G38739624m9438o8665k19650M40597J13297k57492n98755j68152j92871n78842
2512.2G37159653k50244l49884j63575J23062M60358J84631o3171m26941r79843n83572
2521.9G35110474l56522K60239L38211J51367K97546j19476k51694l95889l93219l66211
$$ plain form
2454.3 748158798 748393784 748159637 748141556 747874985 747564316 747431030 747330551 747021103 746671906 746337509
2464 746337509 745863571 745972214 745999832 745884705 745992508 745972672 745773926 745273590 744750748 744643936
2473.6 744643936 744704056 744253922 744063416 743917465 743562546 743344574 742975311 742877884 742536087 742434311
2483.3 742434311 742385101 742060928 741990509 742080994 742497635 742354813 742146835 741358566 740558548 740762558
2492.9 740762558 740371552 740102844 739993286 740187225 740423965 740360870 740543671 740147781 739452209 738739624
2502.6 738739624 738690186 738621521 738401871 738842468 738955765 738698273 738099518 737931366 737738495 737159653
2512.2 737159653 736909409 736559525 736395950 736519012 736979370 737164001 737100830 736673889 735694046 735110474
2521.9 735110474 734753952 735014191 735352402 735503769 735801315 735681839 735430145 735034256 734641037 734274826
2531.5G34274826m43878l98102q6060J37101K21481K81830j40381k2507l35388p84378
2541.1G32704544l72238k01416m9667P0114J46331J91651M1427l84368l16849k05383
2550.8G31624146l08457j08795n67627l94363L1204k2049P3395k1515n646l28140n58091
2561.4G29414062m42504o0807J94702l2119k12479j91727k0752p1487n6610n48935
2571G27971344p33109k84118j1749L44390q239k25373m57153l82385O1874j24359j07727
2581.6G26043396m15344k85187J17264J62658l0288n60608l63846k00272m68444o11191
2591.3G23388138j02463K23770l72391m77218L9749J30997l00675m56619l90244j38549
2600.9G21544495k66571l85285M9286R7122L8224m49524n25666k75497m30527m05426
$$ plain form
2531.5 734274826 733830948 733432846 733346786 733483887 733705368 733987198 733846817 733824310 733488922 732704544
2541.1 732704544 732332306 732130890 732081223 732151337 732297668 732489319 732530746 732146378 731829529 731624146
2550.8 731624146 731315689 731206894 730639267 730244904 730276108 730254059 730327454 730305939 730300293 729972153 729414062
2561.4 729414062 728971558 728910751 729105453 729073334 728860855 728669128 728648376 728576889 728520279 727971344
2571 727971344 727238235 726954117 726942368 727286758 727278519 727053146 726595993 726213608 726275482 726151123 726043396
2581.6 726043396 725628052 725342865 725460129 725622787 725592499 725031891 724668045 724467773 723999329 723388138
2591.3 723388138 723285675 723509445 723137054 722659836 722699585 722830582 722529907 722073288 721683044 721544495
2600.9 721544495 721277924 720892639 720941925 721039047 721077271 720627747 720102081 719826584 719396057 718990631
2610.6G18990631l70407N264n6076k55432l00140j41144j74866j033706p94678j14517
2620.2G15754929L280m3487k28501m13589k99225j82114l89938j97220m53491n50842
2629.9G12999802m60740m38842j21689l86963k54898l37372l08990l69034r50470n05524
2639.5G08865280k20260p2861J04675J69602L10440j73951r34066r72977n20096l15933
2649.1G06239853k24533o80618m61579J84326L03421N1194q46787q67309o67649n57174
2658.8G02473145n32456k53143M46396J49536J7090m28925n62210k86484o55136n91049
2668.4F99776764m29459m5929j7471k6474Q8425l47443o13632m64783l68652n57175
2678.1F96994171n01785p49588l72162Q7128k69242k32467l42942k55508m25110o63147
$$ plain form
2610.6 718990631 718620224 718625488 718569412 718313980 718013840 717872696 717697830 716664124 715869446 715754929
2620.2 715754929 715758209 715714722 715486221 715072632 714773407 714591293 714201355 714004135 713550644 712999802
2629.9 712999802 712539062 712100220 711978531 711591568 711336670 710999298 710690308 710321274 709370804 708865280
2639.5 708865280 708645020 708572159 708676834 708846436 709156876 708982925 708048859 707075882 706555786 706239853
2649.1 706239853 706015320 705334702 704873123 705057449 705360870 705412064 704565277 703697968 703030319 702473145
2658.8 702473145 701940689 701687546 702133942 702283478 702300568 701871643 701309433 701022949 700367813 699776764
2668.4 699776764 699347305 699301376 699283905 699257431 699345856 698998413 698384781 697919998 697551346 696994171
2678.1 696994171 696492386 695742798 695370636 695457764 695188522 694956055 694613113 694357605 693932495 693269348
2687.7F93269348n70373k64511N9890r8648J3199k83737j29700j56784o69937n48630
2697.4F90620117n16891j03607m29230m18472K16674J51978J79748k64663q51136q64486
2707F87720032m32740k99758j54343j83945k63290k16370n20630M044k55585o52008
2716.6F84745407l86886l96805J8158j11695j66168j91040k17514j93253k84576k52685
2726.3F82562943o67496o16303o47735j90583M31138k5635q1940J755m47846n88989
2735.9F79729309j15890l07007n01709j90583K37809L30047n81741m37393J37100j40762
2745.6F78159180m02375k22930k81907m07257K54822j42288n28641l98102n92880l81470
2755.2F75056152l53470O2638M35867J03912k04925J39160j03760p84759l49121l44773
$$ plain form
2687.7 693269348 692698975 692434464 692494354 692395706 692408905 692125168 691995468 691838684 691168747 690620117
2697.4 690620117 690103226 689999619 689570389 689151917 689368591 689520569 689700317 689435654 688584518 687720032
2707 687720032 687287292 686987534 686833191 686649246 686385956 686169586 685648956 685653000 685397415 684745407
2716.6 684745407 684358521 683961716 683979874 683868179 683702011 683510971 683293457 683100204 682815628 682562943
2726.3 682562943 681895447 681279144 680631409 680440826 680871964 680846329 680764389 680766144 680318298 679729309
2735.9 679729309 679613419 679306412 678804703 678614120 678851929 679181976 678600235 678162842 678299942 678159180
2745.6 678159180 677756805 677533875 677251968 676844711 677099533 676957245 676428604 676030502 675437622 675056152
2755.2 675056152 674702682 674765320 675201187 675305099 675100174 675239334 675135574 674350815 674001694 673656921
2764.9F73656921p57751n88989K6550R4833J32599K76108l87497l73230k14539j85470
2774.5F71679535o35529q28857L815j57929k53677J06735o180m07028n94101q28247
2784.2F68078537l20282L18146o05316n87235k84119j3504J52970o19049p55310p86820
2793.8F64578018l59802l82080m61960m62265r17664n63278k59247K7466n74569q08640
2803.4F59815979n55801p53022l89022m05503k36282o16150p82013n35278o18668m39529
2813.1F54484711r03092j044845p85752k75345p76672r57260j46942o31867k92358
2821.8F48670578m85077j229935j038436r05686p45926q83484q11233q66165o32859
2830.4F41071777p63778j029015q04596r43146q67233j233330j206245j334343j340637
$$ plain form
2764.9 673656921 672899170 672310181 672336731 672431564 672564163 672840271 672452774 672079544 671865005 671679535
2774.5 671679535 671044006 670215149 670218964 670061035 669807358 669914093 669907913 669500885 668906784 668078537
2784.2 668078537 667758255 668076401 667471085 666883850 666599731 666586227 666739197 666120148 665364838 664578018
2793.8 664578018 664218216 663836136 663374176 662911911 661994247 661430969 661171722 661199188 660624619 659815979
2803.4 659815979 659260178 658507156 658118134 657712631 657476349 656860199 656078186 655542908 654924240 654484711
2813.1 654484711 653581619 652536774 651751022 651475677 650699005 649741745 649594803 648962936 648670578
2821.8 648670578 648185501 646955566 645917130 645011444 644265518 643382034 642570801 641704636 641071777
2830.4 641071777 640307999 639278984 638474388 637531242 636664009 635430679 634224434 632890091 631549454
2839.1F31549454r82170j668625j579514j632232k055054k275009k132607j692467
2846.8F17531776j981620j746712j965408k108689j401138j120873o89392k65846l36113
2855.5F05915985m83551r8038k90298n03960m22821q63991p62786o00052n06821q57315
2865.2F00526352j043854l37028m71154j059608j163445q28018r66835j187897m35104
2873.8E93033409l64380r13734q10852m28543k47040l38364m83284o36062o66314n65719
2883.5E87579117l57742j92719o42052r18846o75278l03001K20261l65563j169128
2892.2E83175049o21071J11771O0463l57094l93334n41038n23682k46391k93350j00785
2901.8E80270538j56479n69839l57971J80626l17879o06194N8327l78761j078301j055297
$$ plain form
2839.1 631549454 630567284 628898659 627319145 625686913 623631859 621356850 619224243 617531776
2846.8 617531776 615550156 613803444 611838036 609729347 608328209 607207336 606517944 606252098 605915985
2855.5 605915985 605432434 605334396 605044098 604540138 604117317 603253326 602490540 601890488 601383667 600526352
2865.2 600526352 599482498 599145470 598674316 597614708 596451263 595623245 594656410 593468513 593033409
2873.8 593033409 592669029 591755295 590944443 590515900 590268860 589930496 589447212 588811150 588144836 587579117
2883.5 587579117 587221375 587028656 586386604 585467758 584792480 584489479 584709740 584344177 583175049
2892.2 583175049 582553978 582665749 582726212 582369118 581975784 581434746 580911064 580664673 580371323 580270538
2901.8 580270538 580114059 579544220 579186249 579366875 579048996 578442802 578501129 578122368 577044067 575988770
2911.4E75988770q19550q05435j307717j451721r53445n47867m40178m53529p50313
2920.1E68459015n51987j80740l12195l64761j86348L10936M17633N52711M96140J53808
2929.8E68794212r0675l03955M73251K63977k21176M25720P02019P25060O34384Q86001
2939.4E72288818O82793N17578O49071N26352P42416N23339O86683O69823M36401O31562
2949.1E78354836N6610j82801Q8044L68232M46892J81809L95698O35758K47955j07002
2958.7E80486031J16310R03206J284523L56063J54801P05337L40271K47498Q88710
2967.4E85482750J326294J103287R30595R02901Q71849J162300J211204P67785P16438
2976.1E94475403J493530J419373N63049L99780N56069N62935N19409N76553P88765
$$ plain form
2911.4 575988770 575169220 574363785 573056068 571604347 570650902 570103035 569662857 569209328 568459015
2920.1 568459015 567907028 567726288 567414093 567049332 566862984 567173920 567591553 568144264 568640404 568794212
2929.8 568794212 568703537 568399582 568872833 569136810 568915634 569341354 570043373 570768433 571402817 572288818
2939.4 572288818 572971611 573489189 574138260 574664612 575407028 575930367 576617050 577286873 577723274 578354836
2949.1 578354836 578411446 578228645 578316689 578684921 579131813 579313622 579709320 580345078 580593033 580486031
2958.7 580486031 580602341 581505547 582790070 583146133 583300934 584006271 584346542 584594040 585482750
2967.4 585482750 586809044 587912331 588842926 589745827 590617676 591779976 592991180 593758965 594475403
2976.1 594475403 595968933 597388306 597951355 598351135 598907204 599470139 599989548 600566101 601354866
2984.7F01354866R28803M35638K36702L01018M45137Q59718M11682J94245K56004L55453
2994.4F05779266M24385M6578J62239J46828j25008l21579j2436J74523j52970j83410
3004F05938416k12555j35613j66206L7231l63045o93550N5237r5634l06015j02692
3013.7F03955574j91956o22901n00412j8998k98004m74777m47197k04201m95796m80842
3023.3F00220490p8583m13819n18074o21071l96385m25644j00937N8747o46935j12991
3033E96964798j57852n49965n74150n33371l34549o52199n01366l07312l16162l04985
3042.6E92732887l31955p67021q16765j92184l70522k93235l90587o15044o14777r62333
3052.2E87378464n85518k77405l87230n95932n84602k93083n45960q87604q28895o05698
$$ plain form
2984.7 601354866 602283669 602719307 602956009 603257027 603702164 604561882 604973564 605167809 605423813 605779266
2994.4 605779266 606203651 606250229 606412468 606559296 606434288 606112709 606100273 606274796 606121826 605938416
3004 605938416 605725861 605590248 605424042 605461273 605098228 604404678 604459915 604364281 604058266 603955574
3013.7 603955574 603763618 603140717 602640305 602621307 602323303 601848526 601401329 601197128 600701332 600220490
3023.3 600220490 600141907 599728088 599210014 598588943 598192558 597766914 597665977 597724724 597077789 596964798
3033 596964798 596806946 596256981 595682831 595149460 594814911 594162712 593661346 593354034 593037872 592732887
3042.6 592732887 592400932 591633911 590817146 590624962 590254440 589961205 589570618 588955574 588340797 587378464
3052.2 587378464 586792946 586515541 586128311 585532379 584947777 584654694 584108734 583221130 582392235 581786537
3061.9E81786537l9673j77688j156082n35775j33934n42869l19786m93584m58145p96242
3071.5E77132759r30443k92358j93138n86090q97446n96848m25071m75121p74193o43730
3081.2E71318321l41491m19045l27148q38509m10004L243o92406p63702o35643o85044
3090.8E66208572p11784k45209n45120r14917m16489k43644l1548m80690p38411n69076
3100.5E61311684j280289j250763K2011N2376q87680p61414m38843k39906n92537q83827
3110.1E55050812l99170l45345m92286p66411o92406n55191l51677l03039r95141r35249
3119.8E49214897o25152o79245r39599q89701k97699j07880l95966j009368j122361
3128.4E43147926n67398k98118o01998n24406o01425q19168m70162p79686p80487o51131
$$ plain form
3061.9 581786537 581746864 581569176 580413094 579877319 579743385 579200516 578880730 578387146 577929001 577132759
3071.5 577132759 576202316 575909958 575716820 575130730 574233284 573636436 573211365 572736244 571962051 571318321
3081.2 571318321 570976830 570557785 570230637 569392128 568982124 568985367 568292961 567529259 566893616 566208572
3090.8 566208572 565496788 565251579 564706459 563791542 563375053 563131409 563099861 562619171 561880760 561311684
3100.5 561311684 560031395 558780632 558802643 558855019 557967339 557205925 556767082 556527176 555934639 555050812
3110.1 555050812 554651642 554306297 553814011 553047600 552355194 551800003 551448326 551145287 550150146 549214897
3119.8 549214897 548589745 547910500 546970901 546081200 545783501 545675621 545279655 544270287 543147926
3128.4 543147926 542580528 542282410 541680412 541156006 540554581 539735413 539265251 538485565 537705078 537053947
3138.1E37053947o42204n20477r69811n26924j49040p08199o90002n34401r60083o97555
3147.7E30655251o46477j105118m47578k62680l40233l86277n53627p82737j295548
3156.4E24834976p33490l34778l40728o55899q00286n59616p38373n20706o15425l65219
3166E19170456o27670j237984q50143o26526m95987o44074o8779l7002q42781j041069
3175.7E12698441o83289j83220r40475r08013p42531p13882l30925p70378m82598n28984
3185.3E06414146n08804l58429n32760o03486r26895n49049o56395m89960r8762p92809
3195E00896797j020546o63948o40678p37343p17621p51953m1771M8256n97916p30056
3204.6D95043221p42646n86929p39136o17981q89091p54700l94058o42739J24360m97055
$$ plain form
3138.1 537053947 536411743 535891266 534921455 534394531 534245491 533537292 532847290 532312889 531352806 530655251
3147.7 530655251 530008774 528903656 528456078 528193398 527853165 527466888 526913261 526130524 524834976
3156.4 524834976 524101486 523766708 523425980 522770081 521969795 521410179 520671806 520151100 519535675 519170456
3166 519170456 518542786 517304802 516454659 515828133 515332146 514688072 514619293 514582291 513739510 512698441
3175.7 512698441 512015152 511831932 510891457 509983444 509240913 508527031 508196106 507425728 506943130 506414146
3185.3 506414146 505905342 505546913 505014153 504410667 503483772 502934723 502278328 501788368 501689606 500896797
3195 500896797 499876251 499212303 498571625 497834282 497116661 496364708 496322937 496371193 495773277 495043221
3204.6 495043221 494300575 493713646 492974510 492356529 491467438 490712738 490318680 489675941 489800301 489303246
3214.3D89303246j081315l50303k94724l03154o79168r74999r20715l53699j57738
3222.9D84187431m35676m69246p21932o08596q07343r81598n62477n5656p6905m14123
3232.6D79053879l01590n38445o45370o47125o77567m78401o17523p27730n92728k49443
3242.2D73577957j75934m21333m42505m10499o42357n38445n23453o00891j06010o28624
3251.9D69087906r70993l15018j44081m70962r80301q05970m10881j85089k53906l66592
3261.5D64184113l50037o60172l36418j11198l95661n21850k79045j59836o28738q85163
3271.2D59855995m91180J27411l50609l44429k0447q30040m87518k0180l30963p97577
3280.8D56310463q34236k00577k63596r269J16157q07190o27174k38838p32117l05023
$$ plain form
3214.3 489303246 488221931 487871628 487576904 487273750 486594582 485619583 484698868 484345169 484187431
3222.9 484187431 483751755 483282509 482560577 481951981 481144638 480163040 479600563 479544907 479468002 479053879
3232.6 479053879 478752289 478213844 477568474 476921349 476243782 475765381 475147858 474420128 473827400 473577957
3242.2 473577957 473402023 472980690 472538185 472127686 471485329 470946884 470423431 469822540 469716530 469087906
3251.9 469087906 468116913 467801895 467657814 467186852 466206551 465400581 464989700 464804611 464550705 464184113
3261.5 464184113 463834076 463173904 462837486 462726288 462330627 461808777 461529732 461369896 460741158 459855995
3271.2 459855995 459364815 459492226 459141617 458797188 458776741 457946701 457459183 457439003 457108040 456310463
3280.8 456310463 455476227 455275650 455012054 455002785 455118942 454311752 453684578 453445740 452713623 452408600
3290.4D52408600K18277L12424J487p67173n36423m79546o21414l75023j44310j97716
3300.1D49819183p58743k05612J63994k43836n83648o58417K34375K11525o14357r79653
3309.7D46384811p49206j25847j86577o77490n89790k15340m35028m02794l32298o64597
3319.4D42005844n46989l79525l68499m18549k44102j48468o62384j038094m59290
3328.1D37739944k0561k91557n14717r33838p29294m52194l42827n531m66194n30701
3337.7D33452530j23329N760n71404q79478m63066o17752l19176n08079p53632l2082
3347.3D29190292j41410n75181n24444J1482l69224j250077l35312K96669o85806j004524
3357D24612465m31213l6850j44310l91961j40724m18815q17185p33223m66690M8142
$$ plain form
3290.4 452408600 452626877 452939301 452940788 452173615 451637192 451157646 450536232 450161209 450016899 449819183
3300.1 449819183 449060440 448854828 449018822 448774986 448191338 447532921 447767296 447978821 447364464 446384811
3309.7 446384811 445635605 445509758 445323181 444645691 444055901 443840561 443405533 443002739 442670441 442005844
3319.4 442005844 441458855 441079330 440710831 440292282 440048180 439899712 439237328 438199234 437739944
3328.1 437739944 437719383 437427826 436913109 435979271 435249977 434797783 434454956 434449425 433983231 433452530
3337.7 433452530 433329201 433334961 432763557 431884079 431421013 430803261 430484085 429976006 429222374 429190292
3347.3 429190292 429048882 428473701 427949257 427960739 427591515 426341438 426006126 426302795 425616989 424612465
3357 424612465 424181252 424144402 424000092 423608131 423467407 423048592 422231407 421498184 421031494 421079636
3366.6D21079636j39275l09181n06935o58837m70657l61671K81257O142o88057p98531
3376.3D17433891p39822l81355k48337N1956j12534l75061m40025o09054j64414n54008
3385.9D13861237o99654M26063L87345n59387p42913m33426l65295k85454J92604M38538
3395.6D12219658J8234p50847q93669k87933k92092k48718M5548m93317o63757l64342
3405.2D08288765m95224r7656P79571J01204q88786l53966j36185l40652l33214j7357
3414.8D06506500J91841j93443j44997N4436M0932j16348l06015m11950l65448L15781
3424.5D05571289P34253R6092l07388o1989m52156j15929N00756j08567k81982k22931
3434.1D05351448K6245L66478N5275l75862j59187L53202O21682K88658p12776J28059
$$ plain form
3366.6 421079636 420940361 420631180 420124245 419465408 418994751 418633080 418914337 418920479 418232422 417433891
3376.3 417433891 416694069 416312714 416064377 416116333 416003799 415628738 415188713 414579659 414415245 413861237
3385.9 413861237 413161583 413587646 413974991 413415604 412672691 412239265 411873970 411588516 411781120 412219658
3395.6 412219658 412237892 411487045 410593376 410305443 410013351 409764633 409810181 409316864 408653107 408288765
3405.2 408288765 407793541 407695885 408475456 408576660 407687874 407333908 407197723 406857071 406523857 406506500
3414.8 406506500 406698341 406504898 406359901 406414337 406455269 406338921 406032906 405620956 405255508 405571289
3424.5 405571289 406305542 406401634 406094246 406032257 405580101 405464172 405964928 405856361 405574379 405351448
3434.1 405351448 405377693 405744171 405799446 405423584 405264397 405617599 406239281 406527939 405815163 405943222
3443.8D05943222N20439L15247P11441j214180n32761J210747P95402L66211P6371
3452.5D08192139L41720j6746j05515J35460N9281K33840K88353P13730J65215J20773
3462.1D10128250R12171L84292l4866K24647N88456L42941k21214m36554j22605N66902
3471.7D12332420J181450N64385l34473M97360J082840J130257N05791o00663k87284
3480.4D16072083L62892L91998M23813R70192R07097K34756J984j21956N455K83813
3490.1D19532127P43637R63860Q31299N00793K86789J63956J07841P15561L97492R2621
3499.7D24335976Q73298J309357P60078J069O53152Q90007J84174J14593N73692J67809
3509.4D29863205m768R58099J156120P63130M35257P39518P46765M46815L39394K98195
$$ plain form
3443.8 405943222 406463661 406778908 407490349 406276169 405743408 406954155 407749557 408115768 408192139
3452.5 408192139 408533859 408517113 408411598 408547058 408606339 408840179 409128532 409842262 410007477 410128250
3462.1 410128250 411040421 411424713 411389847 411614494 412202950 412545891 412324677 411888123 411765518 412332420
3471.7 412332420 413513870 414078255 413743782 414241142 415323982 416454239 416960030 416359367 416072083
3480.4 416072083 416434975 416826973 417250786 418220978 419128075 419362831 419364815 419242859 419248314 419532127
3490.1 419532127 420275764 421239624 422070923 422571716 422858505 423022461 423130302 423845863 424243355 424335976
3499.7 424335976 425209274 426518631 427278709 427279778 427932930 428822937 429007111 429121704 429695396 429863205
3509.4 429863205 429858437 430816536 431972656 432735786 433171043 433910561 434657326 435104141 435443535 435741730
3519D35741730M76112N07202J438637P32346q47245M04511J449089J290970L62358
3527.7D41555710M30946L54920Q46443P61337P7286J012192N60264J033821R15337
3536.4D47548256J82571J301346R43947Q07419O54449J167374R42192O76956Q94280
3545D55118790j04409N60112m95643J078148K085876J421242J516151p05261N25551
3553.7D61000557J092453J692734J973457J55983J232834J142998L22380J63917J552162
3562.4D70329475R46732K74162L397942K25868o89964M57649J33286L138732J215935
3571.1D79429817Q73871J552887P71675J18408J116448K590942R62372J144638P83234
3579.7D89344292J49040J233063J524467J220856R83581L362275R66568j898766J419258
$$ plain form
3519 435741730 436217842 436725044 438163681 438896027 438048782 438453293 439902382 441193352 441555710
3527.7 441555710 441986656 442341576 443188019 443949356 444026642 445038834 445599098 446632919 447548256
3536.4 447548256 447730827 449032173 449976120 450783539 451437988 452605362 453547554 454224510 455118790
3545 455118790 455014381 455574493 455078850 456156998 458242874 459664116 461180267 460475006 461000557
3553.7 461000557 462093010 463785744 465759201 465915184 467148018 468291016 468613396 468777313 470329475
3562.4 470329475 471276207 471550369 474948311 475174179 474484215 474941864 475075150 478213882 479429817
3571.1 479429817 480303688 481856575 482628250 482746658 483863106 486454048 487416420 488561058 489344292
3579.7 489344292 489493332 490726395 492250862 493471718 494455299 497817574 498784142 496885376 498304634
3588.4D98304634n93147K188263L261413K904435J021575j34391K580413j95579J563110
3597.1E10900726K980194J010399K442551O76079J066894K103997J384735K227401
3604.8E24792976K439919K013130k518K747384K64205K6627O252747J047515j865577
3613.5E37716408L729057J159439L897438L068238q67043J397743P16171J995469L191452
3622.2E56004372K494087J871376J858673J724052K143937N508270J256447o904946
3629.9E65956268L682480M279518N028649K311935j137390K394943L535576K545357
3637.6E88597336R52797J689682K902374K911148J085472L52783K601853L349228M568062
3646.3F09010735o93627j750412O069527M1427j931343J226654N714531M491349L567276
$$ plain form
3588.4 498304634 497711487 499899750 503161163 506065598 507087173 506952782 509533195 509337616 510900726
3597.1 510900726 513880920 514891319 517333870 518009949 519076843 521180840 522565575 524792976
3604.8 524792976 527232895 529246025 529243507 531990891 532255096 532281723 538534470 539581985 537716408
3613.5 537716408 541445465 542604904 546502342 549570580 548703537 550101280 550817451 552812920 556004372
3622.2 556004372 558498459 560369835 562228508 563952560 566096497 571604767 572861214 565956268
3629.9 565956268 569638748 573918266 578946915 581258850 580121460 582516403 586051979 588597336
3637.6 588597336 589550133 591239815 594142189 597053337 598138809 598491592 601093445 604442673 609010735
3646.3 609010735 608317108 606566696 612636223 612677650 610746307 611972961 617687492 622178841 625746117
3655F25746117M730377n680084J617736M627076J547012J597328R70688K926064J484222
3663.6F39566536J409416J975861R78317L946991J947861l52021r91n984497L267593
3672.3F46755066P959518P713318l17993j5835724K478867P595825L917694j768722
3680F58497849J180572L039932J826172J218567K40021M94690L901672N167465q050384
3688.7F67516556k931977O730347m593429J06201N349273J138154J392593J54495p87277
3697.4F74074936Q84628j30462K274704L319397m339829k634811L493957J600189J54572
3706.1F78697281M15497K078323K801972o352311K328186L020401j0115966N352096
3713.8F78225479M147949k67944P71027J589431P21741k850723M68063M226608m013366
$$ plain form
3655 625746117 630476494 624796410 626414146 631041222 632588234 634185562 635156250 638082314 639566536
3663.6 639566536 640975952 642951813 643930130 647877121 649824982 649472961 649471970 643487473 646755066
3672.3 646755066 654714584 662427902 662109909 646274185 648753052 656348877 660266571 658497849
3680 658497849 659678421 662718353 664544525 665763092 666003113 666497803 670399475 675566940 667516556
3688.7 667516556 664584579 671314926 666721497 666827698 672176971 673315125 674707718 674862213 674074936
3697.4 674074936 674959564 674829102 677103806 680423203 676083374 673448563 676942520 678542709 678697281
3706.1 678697281 679112778 681191101 683993073 677640762 679968948 682989349 672873383 678225479
3713.8 678225479 682373428 682105484 682876511 684465942 685187683 682336960 682805023 687031631 683018265
3722.5F83018265m033890M443130P64771j058578k351609O12793L584366J030045N072555
3731.2F91081848j446533p711029O173172p94678p834396J442795J720352J155243
3738.9F83786774L148880K962036l427658K031479J0234375q366242j4522705Q601685
3746.6F84448624M682541M846725l945084r001693Q907928n575333m288711O132431
3754.3F86207428L876266J463395m590454K875442M912720p580185j466751M264068
3762F89961929Q72727k213L025513k220917m184341K501907M569626k80151q388749
3770.7F85855331K320557L355866N94635P75528n74112N41687O27899J931228j139602
3779.4F94289017o742783K204590J993332J193695J961594l693772j428909J870651
$$ plain form
3722.5 683018265 678984375 683427505 684192276 683133698 680782089 681394882 684979248 686009293 691081848
3731.2 691081848 689635315 681924286 688097458 687302780 679468384 680911179 682631531 683786774
3738.9 683786774 686935654 689897690 686470032 688501511 698735886 690369644 675846939 684448624
3746.6 684448624 689131165 693977890 690032806 681031113 689939041 684363708 680074997 686207428
3754.3 686207428 690083694 691547089 686956635 689832077 694744797 687164612 685697861 689961929
3762 689961929 690834656 690832443 693857956 691637039 687452698 689954605 694524231 694244080 685855331
3770.7 685855331 688175888 691531754 692126389 692901917 692327805 692869492 693497391 695428619 694289017
3779.4 694289017 687546234 689750824 691744156 692937851 694899445 691205673 689776764 691647415
3787.1F91647415J019287L40805j64108N38483m63028j78070J02157Q53653K462387
3795.8F96158981l819122l724289K320557L567428L876496q277054p781372M510727
3803.5F86832352L095016M926605M684601r144974k428207M484482J215134Q8424J00632
3812.2F93854065J82266Q92945L329391l082352j1819000N119934N259094M155503
3819.9F97891846n8594j6879578L932801N377197J982651K725982K36206l467254K29187
3828.6F91970444J693878K109299L24096p078857L014526O301956o433258j631546
3836.3F90270538O060181p508469l564453O455689k581711R21020O265946j529617
3844F94789124l752900K274323Q72803r58252J012497j233216P77283M127960m109421
$$ plain form
3787.1 691647415 692666702 693007507 692843399 693381882 692918854 692740784 692842941 693696594 696158981
3795.8 696158981 692339859 688615570 690936127 694503555 698380051 690102997 682321625 686832352
3803.5 686832352 689927368 694853973 699538574 690393600 687965393 692449875 693665009 693753433 693854065
3812.2 693854065 694036331 694929276 698258667 695176315 683357315 688477249 693736343 697891846
3819.9 697891846 697833252 680953674 684886475 690263672 692246323 694972305 695208511 691741257 691970444
3828.6 691970444 693664322 695773621 696097717 689018860 692033386 698335342 691902084 690270538
3836.3 690270538 696330719 688822250 685257797 691713486 689131775 690052795 696318741 694789124
3844 694789124 691036224 693310547 694183350 693225098 694237595 693004379 693781662 697909622 693800201
3852.7F93800201K035370j3246307Q71811Q089523j639175o26297K603378J616745
3860.4F93505249J272812m168625J325378N287705o098023m361496K964325M442978
3868.1F94170303M667740j0004196n773087N628663N909652L149338q995743R7351
3875.8F88850021L093644j75400J952591L747787n168838o170731N490036J060257
3883.5F92679367J081467L637237j1571045R29795L747635J453781M062423p01980
3891.2F95318680p502442N22995K910767p20596J311111R42536P98416k56424q074799
3899.9F85250244N090790J372223n009995M332962k938461o98624J263199P17316K388763
3908.6F91768417k01339k31324k02560k9221L82r49936O18668J635208k637787l153610
$$ plain form
3852.7 693800201 695835571 682589264 683461075 691550598 689911423 689285126 691888504 693505249
3860.4 693505249 694778061 690609436 691934814 697222519 691124496 686763000 689727325 694170303
3868.1 694170303 698838043 688833847 683060760 688689423 694599075 697748413 688752670 688850021
3875.8 688850021 691943665 691768265 693720856 697468643 692299805 686129074 691619110 692679367
3883.5 692679367 693760834 697398071 685827026 686756821 690504456 691958237 696020660 695318680
3891.2 695318680 687816238 688339233 691250000 690529404 691840515 692783051 693581467 693325043 685250244
3899.9 685250244 690341034 691713257 686703262 691036224 688097763 687399139 688662338 689379654 691768417
3908.6 691768417 691567078 691335754 691133194 691103973 691104355 690154419 690773087 692408295 689770508 686616898
3918.2F86616898K900009l00980k610550K752152J713791O21032j889496k963790J309051
3926.9F88148117J593170Q18024j216354l40653J527252k762375j596679J535644L43704
3935.6F88049850j34887k8458l20511Q5526O78177K146301J238861m367142j433868
3944.3F85913849J712875J276474Q20313j836853M28238J4038j803894Q86459l87573
3953F87023926n01862k25982o5613M94690k74964K17591k77787Q66547J26801k008515
3962.6F85374832K49558P35321J05896m14200j83182P18765j22451N8975N13916n95551
3972.2F86441879m42886M31747k22320p55844m00238k54517n8594L82004L0060J0757
3981.9F85162048K86789m7760j373n61523k3652L25623p8812P95136k91977q66394
$$ plain form
3918.2 686616898 689516907 689215927 686605377 689357529 691071320 691692352 689802856 686839066 688148117
3926.9 688148117 689741287 690559311 689342957 689002304 690529556 687767181 686170502 687706146 688049850
3935.6 688049850 687914963 687886505 687565994 687651520 688329697 690475998 691714859 687347717 685913849
3944.3 685913849 687626724 688903198 689723511 687886658 688314896 688328934 686525040 687411499 687023926
3953 687023926 686522064 686296082 686230469 686725159 686450195 686667786 686389999 687256546 687383347 685374832
3962.6 685374832 685624390 686359711 686465607 686051407 685868225 686586990 686464539 686523514 687037430 686441879
3972.2 686441879 685998993 686430740 686208420 685452576 685052338 684797821 684739227 685121231 685151291 685162048
3981.9 685162048 685448837 685401077 685399704 684838181 684814529 685140152 685061340 685856476 685564499 684698105
3991.5F84698105k5711L78036K17285q55560m1504N23529O028K70385K83432
4000.2F85454025
$$ plain form
3991.5 684698105 684672394 685050430 685267715 684412155 684370651 684894180 684900208 685170593 685454025
4000.2 685454025
##END=$$ End of the data block
